{"text_format":"1","workbook":"xlsx","n_sheets":7,"sheets":["Sheet2","Sheet1","البحث","handover.Form","All_Data","DRIVER","Report"],"not_rendered":{"charts":0,"images":9,"macros":1,"external_links":3,"defined_names":10,"comments":1,"pivot_tables":1},"unopened":[],"bounds":{"document_bytes":16777216,"sheet_cells":100000,"rows_first":2000,"rows_last":500,"rows_between":2000,"halvings":0,"cell_chars":16384,"cell_head_chars":4096},"cells_cut":0,"cells_raw":0,"read":"whole","date_system":"1900"}

{"sheet":"Sheet2","index":0,"n_rows":10,"n_cols":8,"rows_kept":10,"cut":false,"hidden":false,"merged":[]}
["كود المعدة","TT15"]
[]
["Row Labels","Count of اسم الموظف","Count of رقم الجوال","Count of مهنة الإقامة","Count of المهنة الفعلية","Count of الجنسية","Count of رخصة القيادة","Count of موقع العمل"]
["تويوتا بكب غمارتين",1,1,1,1,1,1,1]
[66536876546,1,1,1,1,1,1,1]
["MDB54545F4545",1,1,1,1,1,1,1]
[2015,1,1,1,1,1,1,1]
["ابيض",1,1,1,1,1,1,1]
["نقل خاص",1,1,1,1,1,1,1]
["Grand Total",1,1,1,1,1,1,1]

{"sheet":"Sheet1","index":1,"n_rows":235,"n_cols":27,"rows_kept":235,"cut":false,"hidden":false,"merged":[]}
[]
[1,2,3,4,"5",6,7,8,9,10,11,12,13,"14",15,16,17,18,19,20,21,22,23,24,25,26,27]
["كود المعدة","اسم الموظف","رقم الإقامة","رقم الجوال","مهنة الإقامة","المهنة الفعلية","الجنسية","رخصة القيادة","موقع العمل","وصف الأصل","الرقم التسلسل","رقم الهيكل","الموديل","اللون","نوع الترخيص","انتهاء الفحص","حالة الفحص","انتهاء الاستمارة","حالة الاستمارة","انتهاء التأمين","حالة التأمين","انتهاء كارت التشغيل","حالة كارت التشغيل","انتهاء التفويض","حالة الأصل","حالة الموظف","ملاحظات"]
["TT15","عمر احمد",2222222222,"0500000000","سائق شاحنة","سائق تريلا","السودان","نقل ثقيل","صيانة الطرق","تويوتا بكب غمارتين",66536876546,"MDB54545F4545",2015,"ابيض","نقل خاص","1/12/1444","ساري ","1/1/1445","ساري","1/3/1445","ساري ","15/12/1444","ساري","1/6/1444",0.8,"خارج الكفالة","مقدم على إجازة"]
["TT18","حسن",1]
[]
[]
[]
[]
[]
[]
[]
[]
[]
[]
[]
[]
[]
[]
[]
[]
[]
[]
[]
[]
[]
[]
[]
[]
[]
[]
[]
[]
[]
[]
[]
[]
[]
[]
[]
{"$rows_left_out":196}
{"sheet":"البحث","index":2,"n_rows":3,"n_cols":9,"rows_kept":3,"cut":false,"hidden":false,"merged":[[2,8,8,17]]}
[]
[]
[null,null,null,null,null,null,null,null,"الدخول للبحث"]

{"sheet":"handover.Form","index":3,"n_rows":54,"n_cols":20,"rows_kept":54,"cut":false,"hidden":false,"merged":[[52,0,52,11],[42,7,42,8],[42,9,42,10],[44,1,45,10],[49,2,49,4],[49,6,49,7],[49,9,49,10],[50,2,50,4],[50,6,50,7],[50,9,50,10],[51,2,51,4],[51,6,51,7],[7,2,7,3],[7,5,7,6],[7,8,7,9],[7,11,7,12],[8,2,8,3],[8,5,8,6],[8,8,8,9],[8,11,8,12]]}
[]
[]
[]
[]
[null,null,null,null,null,null,null,null,null,null,null,null,"التاريخ",{"$f":"TODAY()","v":"2022-11-10"}]
[null,"الكود","T10",null,null,null,null,null,null,null,null,null,"الموقع","الإدارة",null,null,"مشاريع بيشة",null,null,"المطلوب عند كتابة الكودفي الخلية C6 تظهر بيانات المركبة من الشيت المسمى ALL_DATA"]
[null,null,null,null,null,null,null,null,null,null,null,null,null,null,null,null,"خلاطة خرسانة بيشة",null,null,"وعند كتابة الكود في الخلية C48 يتم احضار البيانات من الشيت المسمى DRIVER"]
[null,"رقم اللوحة",{"$f":"IF(C6=\"\",\"\",_xlfn.XLOOKUP(C6,[2]All_Data!B5:B151,[2]All_Data!K5:K151,\"البيانات غير موجودة\",0,1))","v":"البيانات غير موجودة"},null,"اللون ",{"$f":"IF(C6=\"\",\"\",_xlfn.XLOOKUP(C6,[2]All_Data!B5:B151,[2]All_Data!J5:J151,\"البيانات غير موجودة\",0,1))","v":"البيانات غير موجودة"},null,"رقم الهيكل ",{"$f":"IF(C6=\"\",\"\",_xlfn.XLOOKUP(C6,[2]All_Data!B5:B151,[2]All_Data!L5:L151,\"البيانات غير موجودة\",0,1))","v":"البيانات غير موجودة"},null,"المالك",{"$f":"IF(C6=\"\",\"\",_xlfn.XLOOKUP(C6,[2]All_Data!B5:B151,[2]All_Data!M5:M151,\"البيانات غير موجودة\",0,1))","v":"البيانات غير موجودة"},null,null,null,null,"خلاطة خرسانة الصبيخة",null,null,"وبعد إضافة بيانات المستلم للمركبة يتم افراغ المحتواى الملون باللون الأصفر "]
[null,"وصف الاصل",{"$f":"IF(C6=\"\",\"\",_xlfn.XLOOKUP(C6,[2]All_Data!B5:B151,[2]All_Data!H5:H151,\"البيانات غير موجودة\",0,1))","v":"البيانات غير موجودة"},null,"الرقم التسلسلي ",{"$f":"IF(C6=\"\",\"\",_xlfn.XLOOKUP(C6,[2]All_Data!B5:B151,[2]All_Data!D5:D151,\"البيانات غير موجودة\",0,1))","v":"البيانات غير موجودة"},null,"الموديل ",{"$f":"IF(C6=\"\",\"\",_xlfn.XLOOKUP(C6,[2]All_Data!B5:B151,[2]All_Data!I5:I151,\"البيانات غير موجودة\",0,1))","v":"البيانات غير موجودة"},null,"الترخيص",{"$f":"IF(C6=\"\",\"\",_xlfn.XLOOKUP(C6,[2]All_Data!B5:B151,[2]All_Data!N5:N151,\"البيانات غير موجودة\",0,1))","v":"البيانات غير موجودة"},null,null,null,null,"خلاطة اسفلت بيشة"]
[null,null,null,null,null,null,null,null,null,null,null,null,null,null,null,null,"خلاطة اسفلت الصبيخة"]
[null,null,null,null,null,null,null,null,null,null,null,null,null,null,null,null,"كسارة بيشة"]
[null,null,null,null,null,null,null,null,null,null,null,null,null,null,null,null,"كسارة الصبيخة"]
[null,null,null,null,null,null,null,null,null,null,null,null,null,null,null,null,"عقد 806"]
[null,null,null,null,null,null,null,null,null,null,null,null,null,null,null,null,"عقد 810"]
[null,null,null,null,null,null,null,null,null,null,null,null,null,null,null,null,"وقائي 8006"]
[null,null,null,null,null,null,null,null,null,null,null,null,null,null,null,null,"الإدارة"]
[]
[]
[]
[]
[]
[]
[]
[]
[]
[]
[]
[]
[]
[]
[]
[]
[]
[null,null,null,null,null,null,null,null,null,null,null,null,null,null,null,null,null,"حالة الماكينة"]
[]
[]
[]
[]
[]
[]
{"$rows_left_out":15}
{"sheet":"All_Data","index":4,"n_rows":154,"n_cols":43,"rows_kept":154,"cut":false,"hidden":false,"merged":[[1,0,1,4]]}
[]
["بيانات السيارات",null,null,null,null,null,null,null,{"$f":"TODAY()","v":"2022-11-10"},null,null,null,null,null,null,null,null,null,null,null,null,null,null,null,null,null,null,null,null,null,null,null,null,null,null,null,null,null,null,null,null,"الرقم التسلسلي","Rows"]
[null,null,null,null,null,null,null,null,null,null,null,null,null,null,null,null,null,null,null,null,null,null,null,null,null,null,null,null,null,null,null,null,null,null,null,null,null,null,null,null,null,2488345584,{"$f":"MATCH(AP3,#REF!,0)","v":{"$error":"#REF!"}}]
["م","كود المعدة","الرقم التسلسلي","الموقع","وصف الاصل","الموديل","اللون","رقم اللوحة","رقم الهيكل","المالك","الترخيص","ملاحظات",null,null,null,null,null,null,null,null,null,null,null,null,null,null,"الفحص ميلادي","المتبقي على الفحص","الاستمارة ميلادي","المتبقي على الاستمارة","التأمين ميلادي","المتبقي على التأمين","الرخصة ميلادي","المتبقي على رخصة القيادة","التفويض ميلادي","المتبقي على التفويض"]
[{"$f":"SUBTOTAL(3,$B$5:B5)","v":1},"TT1",17412710,"صيانة 810","وايت مياه - اكتروس",2007,"رصاصي","ب ر ا  8927","WDB9302031L153554",7009429445,"نقل خاص",null,null,null,null,null,null,null,null,null,null,null,null,null,null,null,null,{"$f":"I2-AC5","v":{"$error":"#NAME?"}},{"$f":"ConvertDate(#REF!)","v":{"$error":"#NAME?"}},null,{"$f":"ConvertDate(#REF!)","v":{"$error":"#NAME?"}},null,null,null,{"$f":"ConvertDate(#REF!)","v":{"$error":"#NAME?"}}]
[{"$f":"SUBTOTAL(3,$B$5:B6)","v":1},null,null,null,null,null,null,null,null,null,null,null,null,null,null,null,null,null,null,null,null,null,null,null,null,null,null,{"$error":"#NAME?"},{"$f":"ConvertDate(#REF!)","v":{"$error":"#NAME?"}},null,{"$f":"ConvertDate(#REF!)","v":{"$error":"#NAME?"}},null,null,null,{"$f":"ConvertDate(#REF!)","v":{"$error":"#NAME?"}}]
[{"$f":"SUBTOTAL(3,$B$5:B7)","v":1},null,null,null,null,null,null,null,null,null,null,null,null,null,null,null,null,null,null,null,null,null,null,null,null,null,null,{"$error":"#VALUE!"},{"$f":"ConvertDate(#REF!)","v":{"$error":"#NAME?"}},null,{"$f":"ConvertDate(#REF!)","v":{"$error":"#NAME?"}},null,null,null,{"$f":"ConvertDate(#REF!)","v":{"$error":"#NAME?"}}]
[{"$f":"SUBTOTAL(3,$B$5:B8)","v":1},null,null,null,null,null,null,null,null,null,null,null,null,null,null,null,null,null,null,null,null,null,null,null,null,null,null,{"$error":"#VALUE!"},{"$f":"ConvertDate(#REF!)","v":{"$error":"#NAME?"}},null,{"$f":"ConvertDate(#REF!)","v":{"$error":"#NAME?"}},null,null,null,{"$f":"ConvertDate(#REF!)","v":{"$error":"#NAME?"}}]
[{"$f":"SUBTOTAL(3,$B$5:B9)","v":1},null,null,null,null,null,null,null,null,null,null,null,null,null,null,null,null,null,null,null,null,null,null,null,null,null,null,{"$error":"#NAME?"},{"$f":"ConvertDate(#REF!)","v":{"$error":"#NAME?"}},null,{"$f":"ConvertDate(#REF!)","v":{"$error":"#NAME?"}},null,null,null,{"$f":"ConvertDate(#REF!)","v":{"$error":"#NAME?"}}]
[{"$f":"SUBTOTAL(3,$B$5:B10)","v":1},null,null,null,null,null,null,null,null,null,null,null,null,null,null,null,null,null,null,null,null,null,null,null,null,null,null,{"$error":"#NAME?"},{"$f":"ConvertDate(#REF!)","v":{"$error":"#NAME?"}},null,{"$f":"ConvertDate(#REF!)","v":{"$error":"#NAME?"}},null,null,null,{"$f":"ConvertDate(#REF!)","v":{"$error":"#NAME?"}}]
[{"$f":"SUBTOTAL(3,$B$5:B11)","v":1},null,null,null,null,null,null,null,null,null,null,null,null,null,null,null,null,null,null,null,null,null,null,null,null,null,null,{"$error":"#NAME?"},{"$f":"ConvertDate(#REF!)","v":{"$error":"#NAME?"}},null,{"$f":"ConvertDate(#REF!)","v":{"$error":"#NAME?"}},null,null,null,{"$f":"ConvertDate(#REF!)","v":{"$error":"#NAME?"}}]
[{"$f":"SUBTOTAL(3,$B$5:B12)","v":1},null,null,null,null,null,null,null,null,null,null,null,null,null,null,null,null,null,null,null,null,null,null,null,null,null,null,{"$error":"#NAME?"},{"$f":"ConvertDate(#REF!)","v":{"$error":"#NAME?"}},null,{"$f":"ConvertDate(#REF!)","v":{"$error":"#NAME?"}},null,null,null,{"$f":"ConvertDate(#REF!)","v":{"$error":"#NAME?"}}]
[{"$f":"SUBTOTAL(3,$B$5:B13)","v":1},null,null,null,null,null,null,null,null,null,null,null,null,null,null,null,null,null,null,null,null,null,null,null,null,null,null,{"$error":"#NAME?"},{"$f":"ConvertDate(#REF!)","v":{"$error":"#NAME?"}},null,{"$f":"ConvertDate(#REF!)","v":{"$error":"#NAME?"}},null,null,null,{"$f":"ConvertDate(#REF!)","v":{"$error":"#NAME?"}}]
[{"$f":"SUBTOTAL(3,$B$5:B14)","v":1},null,null,null,null,null,null,null,null,null,null,null,null,null,null,null,null,null,null,null,null,null,null,null,null,null,null,{"$error":"#NAME?"},{"$f":"ConvertDate(#REF!)","v":{"$error":"#NAME?"}},null,{"$f":"ConvertDate(#REF!)","v":{"$error":"#NAME?"}},null,null,null,{"$f":"ConvertDate(#REF!)","v":{"$error":"#NAME?"}}]
[{"$f":"SUBTOTAL(3,$B$5:B15)","v":1},null,null,null,null,null,null,null,null,null,null,null,null,null,null,null,null,null,null,null,null,null,null,null,null,null,null,{"$error":"#NAME?"},{"$f":"ConvertDate(#REF!)","v":{"$error":"#NAME?"}},null,{"$f":"ConvertDate(#REF!)","v":{"$error":"#NAME?"}},null,null,null,{"$f":"ConvertDate(#REF!)","v":{"$error":"#NAME?"}}]
[{"$f":"SUBTOTAL(3,$B$5:B16)","v":1},null,null,null,null,null,null,null,null,null,null,null,null,null,null,null,null,null,null,null,null,null,null,null,null,null,null,{"$error":"#NAME?"},{"$f":"ConvertDate(#REF!)","v":{"$error":"#NAME?"}},null,{"$f":"ConvertDate(#REF!)","v":{"$error":"#NAME?"}},null,null,null,{"$f":"ConvertDate(#REF!)","v":{"$error":"#NAME?"}}]
[{"$f":"SUBTOTAL(3,$B$5:B17)","v":1},null,null,null,null,null,null,null,null,null,null,null,null,null,null,null,null,null,null,null,null,null,null,null,null,null,null,{"$error":"#NAME?"},{"$f":"ConvertDate(#REF!)","v":{"$error":"#NAME?"}},null,{"$f":"ConvertDate(#REF!)","v":{"$error":"#NAME?"}},null,null,null,{"$f":"ConvertDate(#REF!)","v":{"$error":"#NAME?"}}]
[{"$f":"SUBTOTAL(3,$B$5:B18)","v":1},null,null,null,null,null,null,null,null,null,null,null,null,null,null,null,null,null,null,null,null,null,null,null,null,null,null,{"$error":"#NAME?"},{"$f":"ConvertDate(#REF!)","v":{"$error":"#NAME?"}},null,{"$f":"ConvertDate(#REF!)","v":{"$error":"#NAME?"}},null,null,null,{"$f":"ConvertDate(#REF!)","v":{"$error":"#NAME?"}}]
[{"$f":"SUBTOTAL(3,$B$5:B19)","v":1},null,null,null,null,null,null,null,null,null,null,null,null,null,null,null,null,null,null,null,null,null,null,null,null,null,null,{"$error":"#NAME?"},{"$f":"ConvertDate(#REF!)","v":{"$error":"#NAME?"}},null,{"$f":"ConvertDate(#REF!)","v":{"$error":"#NAME?"}},null,null,null,{"$f":"ConvertDate(#REF!)","v":{"$error":"#NAME?"}}]
[{"$f":"SUBTOTAL(3,$B$5:B20)","v":1},null,null,null,null,null,null,null,null,null,null,null,null,null,null,null,null,null,null,null,null,null,null,null,null,null,null,{"$error":"#NAME?"},{"$f":"ConvertDate(#REF!)","v":{"$error":"#NAME?"}},null,{"$f":"ConvertDate(#REF!)","v":{"$error":"#NAME?"}},null,null,null,{"$f":"ConvertDate(#REF!)","v":{"$error":"#NAME?"}}]
[{"$f":"SUBTOTAL(3,$B$5:B21)","v":1},null,null,null,null,null,null,null,null,null,null,null,null,null,null,null,null,null,null,null,null,null,null,null,null,null,null,{"$error":"#NAME?"},{"$f":"ConvertDate(#REF!)","v":{"$error":"#NAME?"}},null,{"$f":"ConvertDate(#REF!)","v":{"$error":"#NAME?"}},null,null,null,{"$f":"ConvertDate(#REF!)","v":{"$error":"#NAME?"}}]
[{"$f":"SUBTOTAL(3,$B$5:B22)","v":1},null,null,null,null,null,null,null,null,null,null,null,null,null,null,null,null,null,null,null,null,null,null,null,null,null,null,{"$error":"#NAME?"},{"$f":"ConvertDate(#REF!)","v":{"$error":"#NAME?"}},null,{"$f":"ConvertDate(#REF!)","v":{"$error":"#NAME?"}},null,null,null,{"$f":"ConvertDate(#REF!)","v":{"$error":"#NAME?"}}]
[{"$f":"SUBTOTAL(3,$B$5:B23)","v":1},null,null,null,null,null,null,null,null,null,null,null,null,null,null,null,null,null,null,null,null,null,null,null,null,null,null,{"$error":"#NAME?"},{"$f":"ConvertDate(#REF!)","v":{"$error":"#NAME?"}},null,{"$f":"ConvertDate(#REF!)","v":{"$error":"#NAME?"}},null,null,null,{"$f":"ConvertDate(#REF!)","v":{"$error":"#NAME?"}}]
[{"$f":"SUBTOTAL(3,$B$5:B24)","v":1},null,null,null,null,null,null,null,null,null,null,null,null,null,null,null,null,null,null,null,null,null,null,null,null,null,null,{"$error":"#NAME?"},{"$f":"ConvertDate(#REF!)","v":{"$error":"#NAME?"}},null,{"$f":"ConvertDate(#REF!)","v":{"$error":"#NAME?"}},null,null,null,{"$f":"ConvertDate(#REF!)","v":{"$error":"#NAME?"}}]
[{"$f":"SUBTOTAL(3,$B$5:B25)","v":1},null,null,null,null,null,null,null,null,null,null,null,null,null,null,null,null,null,null,null,null,null,null,null,null,null,null,{"$error":"#NAME?"},{"$f":"ConvertDate(#REF!)","v":{"$error":"#NAME?"}},null,{"$f":"ConvertDate(#REF!)","v":{"$error":"#NAME?"}},null,null,null,{"$f":"ConvertDate(#REF!)","v":{"$error":"#NAME?"}}]
[{"$f":"SUBTOTAL(3,$B$5:B26)","v":1},null,null,null,null,null,null,null,null,null,null,null,null,null,null,null,null,null,null,null,null,null,null,null,null,null,null,{"$error":"#NAME?"},{"$f":"ConvertDate(#REF!)","v":{"$error":"#NAME?"}},null,{"$f":"ConvertDate(#REF!)","v":{"$error":"#NAME?"}},null,null,null,{"$f":"ConvertDate(#REF!)","v":{"$error":"#NAME?"}}]
[{"$f":"SUBTOTAL(3,$B$5:B27)","v":1},null,null,null,null,null,null,null,null,null,null,null,null,null,null,null,null,null,null,null,null,null,null,null,null,null,null,{"$error":"#NAME?"},{"$f":"ConvertDate(#REF!)","v":{"$error":"#NAME?"}},null,{"$f":"ConvertDate(#REF!)","v":{"$error":"#NAME?"}},null,null,null,{"$f":"ConvertDate(#REF!)","v":{"$error":"#NAME?"}}]
[{"$f":"SUBTOTAL(3,$B$5:B28)","v":1},null,null,null,null,null,null,null,null,null,null,null,null,null,null,null,null,null,null,null,null,null,null,null,null,null,null,{"$error":"#NAME?"},{"$f":"ConvertDate(#REF!)","v":{"$error":"#NAME?"}},null,{"$f":"ConvertDate(#REF!)","v":{"$error":"#NAME?"}},null,null,null,{"$f":"ConvertDate(#REF!)","v":{"$error":"#NAME?"}}]
[{"$f":"SUBTOTAL(3,$B$5:B29)","v":1},null,null,null,null,null,null,null,null,null,null,null,null,null,null,null,null,null,null,null,null,null,null,null,null,null,null,{"$error":"#NAME?"},{"$f":"ConvertDate(#REF!)","v":{"$error":"#NAME?"}},null,{"$f":"ConvertDate(#REF!)","v":{"$error":"#NAME?"}},null,null,null,{"$f":"ConvertDate(#REF!)","v":{"$error":"#NAME?"}}]
[{"$f":"SUBTOTAL(3,$B$5:B30)","v":1},null,null,null,null,null,null,null,null,null,null,null,null,null,null,null,null,null,null,null,null,null,null,null,null,null,null,{"$error":"#NAME?"},{"$f":"ConvertDate(#REF!)","v":{"$error":"#NAME?"}},null,{"$f":"ConvertDate(#REF!)","v":{"$error":"#NAME?"}},null,null,null,{"$f":"ConvertDate(#REF!)","v":{"$error":"#NAME?"}}]
[{"$f":"SUBTOTAL(3,$B$5:B31)","v":1},null,null,null,null,null,null,null,null,null,null,null,null,null,null,null,null,null,null,null,null,null,null,null,null,null,null,{"$error":"#NAME?"},{"$f":"ConvertDate(#REF!)","v":{"$error":"#NAME?"}},null,{"$f":"ConvertDate(#REF!)","v":{"$error":"#NAME?"}},null,null,null,{"$f":"ConvertDate(#REF!)","v":{"$error":"#NAME?"}}]
[{"$f":"SUBTOTAL(3,$B$5:B32)","v":1},null,null,null,null,null,null,null,null,null,null,null,null,null,null,null,null,null,null,null,null,null,null,null,null,null,null,{"$error":"#NAME?"},{"$f":"ConvertDate(#REF!)","v":{"$error":"#NAME?"}},null,{"$f":"ConvertDate(#REF!)","v":{"$error":"#NAME?"}},null,null,null,{"$f":"ConvertDate(#REF!)","v":{"$error":"#NAME?"}}]
[{"$f":"SUBTOTAL(3,$B$5:B33)","v":1},null,null,null,null,null,null,null,null,null,null,null,null,null,null,null,null,null,null,null,null,null,null,null,null,null,null,{"$error":"#NAME?"},{"$f":"ConvertDate(#REF!)","v":{"$error":"#NAME?"}},null,{"$f":"ConvertDate(#REF!)","v":{"$error":"#NAME?"}},null,null,null,{"$f":"ConvertDate(#REF!)","v":{"$error":"#NAME?"}}]
[{"$f":"SUBTOTAL(3,$B$5:B34)","v":1},null,null,null,null,null,null,null,null,null,null,null,null,null,null,null,null,null,null,null,null,null,null,null,null,null,null,{"$error":"#NAME?"},{"$f":"ConvertDate(#REF!)","v":{"$error":"#NAME?"}},null,{"$f":"ConvertDate(#REF!)","v":{"$error":"#NAME?"}},null,null,null,{"$f":"ConvertDate(#REF!)","v":{"$error":"#NAME?"}}]
[{"$f":"SUBTOTAL(3,$B$5:B35)","v":1},null,null,null,null,null,null,null,null,null,null,null,null,null,null,null,null,null,null,null,null,null,null,null,null,null,null,{"$error":"#NAME?"},{"$f":"ConvertDate(#REF!)","v":{"$error":"#NAME?"}},null,{"$f":"ConvertDate(#REF!)","v":{"$error":"#NAME?"}},null,null,null,{"$f":"ConvertDate(#REF!)","v":{"$error":"#NAME?"}}]
[{"$f":"SUBTOTAL(3,$B$5:B36)","v":1},null,null,null,null,null,null,null,null,null,null,null,null,null,null,null,null,null,null,null,null,null,null,null,null,null,null,{"$error":"#NAME?"},{"$f":"ConvertDate(#REF!)","v":{"$error":"#NAME?"}},null,{"$f":"ConvertDate(#REF!)","v":{"$error":"#NAME?"}},null,null,null,{"$f":"ConvertDate(#REF!)","v":{"$error":"#NAME?"}}]
[{"$f":"SUBTOTAL(3,$B$5:B37)","v":1},null,null,null,null,null,null,null,null,null,null,null,null,null,null,null,null,null,null,null,null,null,null,null,null,null,null,{"$error":"#NAME?"},{"$f":"ConvertDate(#REF!)","v":{"$error":"#NAME?"}},null,{"$f":"ConvertDate(#REF!)","v":{"$error":"#NAME?"}},null,null,null,{"$f":"ConvertDate(#REF!)","v":{"$error":"#NAME?"}}]
[{"$f":"SUBTOTAL(3,$B$5:B38)","v":1},null,null,null,null,null,null,null,null,null,null,null,null,null,null,null,null,null,null,null,null,null,null,null,null,null,null,{"$error":"#NAME?"},{"$f":"ConvertDate(#REF!)","v":{"$error":"#NAME?"}},null,{"$f":"ConvertDate(#REF!)","v":{"$error":"#NAME?"}},null,null,null,{"$f":"ConvertDate(#REF!)","v":{"$error":"#NAME?"}}]
[{"$f":"SUBTOTAL(3,$B$5:B39)","v":1},null,null,null,null,null,null,null,null,null,null,null,null,null,null,null,null,null,null,null,null,null,null,null,null,null,null,{"$error":"#NAME?"},{"$f":"ConvertDate(#REF!)","v":{"$error":"#NAME?"}},null,{"$f":"ConvertDate(#REF!)","v":{"$error":"#NAME?"}},null,null,null,{"$f":"ConvertDate(#REF!)","v":{"$error":"#NAME?"}}]
[{"$f":"SUBTOTAL(3,$B$5:B40)","v":1},null,null,null,null,null,null,null,null,null,null,null,null,null,null,null,null,null,null,null,null,null,null,null,null,null,null,{"$error":"#NAME?"},{"$f":"ConvertDate(#REF!)","v":{"$error":"#NAME?"}},null,{"$f":"ConvertDate(#REF!)","v":{"$error":"#NAME?"}},null,null,null,{"$f":"ConvertDate(#REF!)","v":{"$error":"#NAME?"}}]
{"$rows_left_out":115}
{"sheet":"DRIVER","index":5,"n_rows":2,"n_cols":13,"rows_kept":2,"cut":false,"hidden":false,"merged":[]}
["كود الموظف ","م","رقم اقامة الموظف","اسم الموظف","الجنسية ","حالة الموظف","موقع العمل ","الحالة","رقم الجوال","مهنة الاقامة","المهنة الفعلية ","رخصة القيادة","تاريخ انتهاء الإقامة"]
[4,1,2222222222,"لياقت علي باجوا عنايت الله","باكستان","على الكفالة","نقليات - التريلات","على راس العمل ","0500000000","سائق شاحنة","سائق تريلا","نقل ثقيل","2022-08-29"]

{"sheet":"Report","index":6,"n_rows":35,"n_cols":12,"rows_kept":35,"cut":false,"hidden":false,"merged":[[30,2,34,2],[30,3,34,6],[30,9,30,12],[32,9,32,12],[34,9,34,12],[1,1,2,6],[1,8,2,8],[1,11,2,13],[24,3,24,6],[24,9,24,12],[26,3,26,6],[26,9,26,12],[28,3,28,6],[28,9,28,12],[18,3,18,6],[18,9,18,12],[20,3,20,6],[20,9,20,12],[22,3,22,6],[22,9,22,12],[12,3,12,6],[12,9,12,12],[14,3,14,6],[14,9,14,12],[16,3,16,6],[16,9,16,12],[6,3,6,6],[6,9,6,12],[8,3,8,6],[8,9,8,12],[10,3,10,6],[10,9,10,12]]}
[]
[null,"تقرير الأصل ",null,null,null,null,null,null,{"$f":"D5","v":"tr31"},null,null,{"$f":"TODAY()","v":"2022-11-10"}]
[]
[]
[null,null,"الكود","tr31"]
[]
[null,null,"وصف الاصل",{"$f":"IFERROR(VLOOKUP(D5,[3]!Truck_New[#Data],2,0),\"\")","v":"تريلا - اكتروس"},null,null,null,null,"الموديل",{"$f":"IFERROR(VLOOKUP(D5,[3]!Truck_New[#Data],4,0),\"\")","v":2013}]
[]
[null,null,"الماركة",{"$f":"IFERROR(VLOOKUP(D5,[3]!Truck_New[#Data],3,0),\"\")","v":"Mercedes"},null,null,null,null,"اللون",{"$f":"IFERROR(VLOOKUP(D5,[3]!Truck_New[#Data],5,0),\"\")","v":"ابيض"}]
[]
[null,null,"رقم اللوحة",{"$f":"IFERROR(VLOOKUP(D5,[3]!Truck_New[#Data],7,0),\"\")","v":"ا ر ح  5062"},null,null,null,null,"رقم الللوحة ENG",{"$f":"IFERROR(VLOOKUP(D5,[3]!Truck_New[#Data],8,0),\"\")","v":"A R B  5062"}]
[]
[null,null,"الرقم التسلسلي",{"$f":"IFERROR(VLOOKUP(D5,[3]!Truck_New[#Data],10,0),\"\")","v":147990710},null,null,null,null,"رقم الهيكل",{"$f":"IFERROR(VLOOKUP(D5,[3]!Truck_New[#Data],9,0),\"\")","v":"WDB9340321L706653"}]
[]
[null,null,"المالك",{"$f":"IFERROR(VLOOKUP(D5,[3]!Truck_New[#Data],6,0),\"\")","v":7009429445},null,null,null,null,"نوع الترخيص",{"$f":"IFERROR(VLOOKUP(D5,[3]!Truck_New[#Data],11,0),\"\")","v":"نقل عام"}]
[]
[null,null,"تاريخ انتهاء الفحص",{"$f":"IFERROR(VLOOKUP(D5,[3]!Truck_New[#Data],12,0),\"\")","v":"03/01/1445"},null,null,null,null,"حالة الفحص",{"$f":"IFERROR(VLOOKUP(D5,[3]!Truck_New[#Data],14,0),\"\")","v":"😁"},{"$f":"IFERROR(VLOOKUP(D5,#REF!,10,0),\"\")","v":""}]
[]
[null,null,"تاريخ انتهاء الاستماارة",{"$f":"IFERROR(VLOOKUP(D5,[3]!Truck_New[#Data],15,0),\"\")","v":"29/08/1445"},null,null,null,null,"حالة الاستمارة",{"$f":"IFERROR(VLOOKUP(D5,[3]!Truck_New[#Data],17,0),\"\")","v":"😁"}]
[]
[null,null,"تاريخ انتهاء التأمين",{"$f":"IFERROR(VLOOKUP(D5,[3]!Truck_New[#Data],21,0),\"\")","v":"00:00:00"},null,null,null,null,"حالة التأمين",{"$f":"IFERROR(VLOOKUP(D5,[3]!Truck_New[#Data],23,0),\"\")","v":"ساري"}]
[]
[null,null,"تاريخ انتهاء كارت التشغيل",{"$f":"IFERROR(VLOOKUP(D5,[3]!Truck_New[#Data],18,0),\"\")","v":"01/02/1444"},null,null,null,null,"حالة كارت التشغيل",{"$f":"IFERROR(VLOOKUP(D5,[3]!Truck_New[#Data],20,0),\"\")","v":"منتهي"}]
[]
[null,null,"اسم المفوض",{"$f":"IFERROR(VLOOKUP(D5,[3]!Truck_New[#Data],24,0),\"\")","v":"بولا"},null,null,null,null,"الجنسية",{"$f":"IFERROR(VLOOKUP(D5,[3]!Truck_New[#Data],25,0),\"\")","v":"الهند"}]
[]
[null,null,"حالة الرخصة",{"$f":"IFERROR(VLOOKUP(D5,[3]!Truck_New[#Data],32,0),\"\")","v":"منتهي"},null,null,null,null,"رقم الإقامة",{"$f":"IFERROR(VLOOKUP(D5,[3]!Truck_New[#Data],29,0),\"\")","v":0}]
[]
[null,null,"رقم الجوال",{"$f":"IFERROR(VLOOKUP(D5,[3]!Truck_New[#Data],33,0),\"\")","v":0},null,null,null,null,"تاريخ انتهاء التفويض",{"$f":"IFERROR(VLOOKUP(D5,[3]!Truck_New[#Data],26,0),\"\")","v":"00:00:00"}]
[]
[null,null,"ملاحظات",{"$f":"IFERROR(VLOOKUP(D5,[3]!Truck_New[#Data],44,0),\"\")","v":0},null,null,null,null,"جهاز التتبع",{"$f":"IFERROR(VLOOKUP(D5,[3]!Truck_New[#Data],34,0),\"\")","v":0},"=IFERROR(VLOOKUP(D5;Data_New;21;0);\"\")"]
[]
[null,null,null,null,null,null,null,null,"الحمولة",{"$f":"IFERROR(VLOOKUP(D5,[3]!Truck_New[#Data],41,0),\"\")","v":0}]
[]
[null,null,null,null,null,null,null,null,"الموقع",{"$f":"IFERROR(VLOOKUP(D5,[3]!Truck_New[#Data],43,0),\"\")","v":"حركة التريلات - تريلة ديزل - تريلة مياه"}]