{"text_format":"1","workbook":"xlsx","n_sheets":2,"sheets":["رئيسي","1"],"not_rendered":{"charts":0,"images":0,"macros":1,"external_links":0,"defined_names":1,"comments":0,"pivot_tables":0},"unopened":[],"bounds":{"document_bytes":16777216,"sheet_cells":100000,"rows_first":2000,"rows_last":500,"rows_between":2000,"halvings":0,"cell_chars":16384,"cell_head_chars":4096},"cells_cut":0,"cells_raw":0,"read":"whole","date_system":"1900"}

{"sheet":"رئيسي","index":0,"n_rows":3,"n_cols":14,"rows_kept":3,"cut":false,"hidden":false,"merged":[]}
[]
[null,"إسم الملف","المنطقة","المدينة","الحي","رقم المنزل","رقم رئيسي","المرتبة","الرتبة","الإسم","مسمى الوظيفة","التخصص","رقم الدورة","رقم الجوال"]
[null,1,1,2,3,4,5,6,7,8,9,10,11,12]

{"sheet":"1","index":1,"n_rows":42,"n_cols":10,"rows_kept":42,"cut":false,"hidden":false,"merged":[[4,9,9,9],[5,1,5,2],[5,3,5,4],[5,5,5,6],[5,7,5,8],[8,7,8,8],[9,5,9,6],[9,7,9,8],[6,1,6,2],[6,3,6,4],[6,5,6,6],[6,7,6,8],[7,3,7,4],[7,5,7,6],[7,7,7,8],[3,1,3,2],[4,1,4,2],[4,3,4,4],[4,5,4,6],[4,7,4,8],[14,2,14,4],[14,5,14,6],[8,1,9,1],[8,2,9,2],[8,5,8,6],[11,1,11,2],[12,2,12,4],[12,5,12,6],[13,2,13,4],[13,5,13,6],[15,2,15,4],[15,5,15,6],[16,2,16,4],[16,5,16,6],[17,2,17,4],[17,5,17,6],[25,2,25,3],[25,4,25,6],[25,7,25,9],[18,2,18,4],[18,5,18,6],[19,2,19,4],[19,5,19,6],[20,2,20,4],[20,5,20,6],[21,2,21,4],[21,5,21,6],[22,2,22,4],[22,5,22,6],[24,1,24,9],[26,2,26,3],[26,4,26,6],[26,7,26,9],[27,2,27,3],[27,4,27,6],[27,7,27,9],[28,2,28,3],[28,4,28,6],[28,7,28,9],[29,2,29,3],[29,4,29,6],[29,7,29,9],[30,2,30,3],[30,4,30,6],[30,7,30,9],[31,2,31,3],[31,4,31,6],[31,7,31,9],[33,1,33,9],[34,1,35,1],[34,2,34,5],[34,6,34,9],[35,2,35,3],[35,4,35,5],[35,6,35,7],[35,8,35,9],[36,2,36,3],[36,4,36,5],[36,6,36,7],[36,8,36,9],[37,2,37,3],[37,4,37,5],[37,6,37,7],[37,8,37,9],[38,2,38,3],[38,4,38,5],[38,6,38,7],[38,8,38,9],[39,2,39,3],[39,4,39,5],[39,6,39,7],[39,8,39,9],[40,2,40,3],[40,4,40,5],[40,6,40,7],[40,8,40,9],[41,2,41,3],[41,4,41,5],[41,6,41,7],[41,8,41,9]]}
[1]
[]
[]
[null,"1. معلومات عامة."]
[null,"الاسم",null,"الرتبة",null,"المؤهل العلمي",null,null,null,"صورة"]
[null,{"$f":"IFERROR(VLOOKUP($A1,رئيسي!$B$3:$M$500,9,FALSE),\"\")","v":8},null,{"$f":"IFERROR(VLOOKUP($A1,رئيسي!$B$3:$M$500,8,FALSE),\"\")","v":7}]
[null,"الرقم ",null,"المنطقة"]
[null,"المنزل","الرئيسي",{"$f":"IFERROR(VLOOKUP($A1,رئيسي!$B$3:$M$500,2,FALSE),\"\")","v":1},null,{"$f":"IFERROR(VLOOKUP($A1,رئيسي!$B$3:$M$500,10,FALSE),\"\")","v":9}]
[null,{"$f":"IFERROR(VLOOKUP($A1,رئيسي!$B$3:$M$500,5,FALSE),\"\")","v":4},{"$f":"IFERROR(VLOOKUP($A1,رئيسي!$B$3:$M$500,6,FALSE),\"\")","v":5},"المدينة","الحي","التخصص",null,"رقم الدورة"]
[null,null,null,{"$f":"IFERROR(VLOOKUP($A1,رئيسي!$B$3:$M$500,3,FALSE),\"\")","v":2},{"$f":"IFERROR(VLOOKUP($A1,رئيسي!$B$3:$M$500,4,FALSE),\"\")","v":3},{"$f":"IFERROR(VLOOKUP($A1,رئيسي!$B$3:$M$500,11,FALSE),\"\")","v":10},null,{"$f":"IFERROR(VLOOKUP($A1,رئيسي!$B$3:$M$500,12,FALSE),\"\")","v":11}]
[]
[null,"2. الدورات ."]
[null,"ت","اسم الدورة",null,null,"مكانها",null,"مدتها","التقدير","الترتيب"]
[null,1]
[null,2]
[null,3]
[null,4]
[null,5]
[null,6]
[null,7]
[null,8]
[null,9]
[null,10]
[]
[null,"3. الوظائف التي سبق وأن اثبت عليها. "]
[null,"ت","الوظيفة",null,"المنطقة",null,null,"ملاحظات"]
[null,1]
[null,2]
[null,3]
[null,4]
[null,5]
[null,6]
[]
[null,"4.انجازات . "]
[null,"ت"]
[]
[null,1]
[null,2]
[null,3]
[null,4]
[null,5]
[null,6]