{"text_format":"1","workbook":"xlsx","n_sheets":2,"sheets":["2","ورقة1"],"not_rendered":{"charts":0,"images":1,"macros":1,"external_links":0,"defined_names":7,"comments":0,"pivot_tables":0},"unopened":[],"bounds":{"document_bytes":16777216,"sheet_cells":100000,"rows_first":2000,"rows_last":500,"rows_between":2000,"halvings":0,"cell_chars":16384,"cell_head_chars":4096},"cells_cut":0,"cells_raw":0,"read":"whole","date_system":"1900"}

{"sheet":"2","index":0,"n_rows":477,"n_cols":58,"rows_kept":477,"cut":false,"hidden":false,"merged":[[0,57,0,58],[52,58,52,59],[9,25,10,25],[44,60,44,62],[35,52,35,53],[49,59,49,62],[1,54,1,61],[42,58,42,60],[42,55,42,57],[44,55,44,56],[0,7,0,25]]}
["الرقم","التاريخ","إسم البضاعة","الكمية","مبلغ الوحدة","المجموع",null,null,null,null,null,null,null,null,null,null,null,null,null,null,null,null,null,null,null,null,null,null,null,null,null,null,null,null,null,null,null,null,null,null,null,null,null,null,null,null,null,null,null,null,null,null,null,null,null,null,null,"مارس 2023"]
[1,"2022-10-12","يايورت عادي",205,20,{"$f":"IFERROR(D2*E2,\"\")","v":4100}]
[2,"2022-10-12","بيض",60,{"$f":"IFERROR(VLOOKUP(C3,ورقة1!$D$2:$E$34,2,FALSE),\"\")","v":14},{"$f":"IFERROR(D3*E3,\"\")","v":840}]
[3,"2022-10-16","بطاطا",7,{"$f":"IFERROR(VLOOKUP(C4,ورقة1!$D$2:$E$34,2,FALSE),\"\")","v":80},560]
[4,"2022-10-16","جزر",7,{"$f":"IFERROR(VLOOKUP(C5,ورقة1!$D$2:$E$34,2,FALSE),\"\")","v":80},560]
[5,"2022-10-16","اجاص",32,{"$f":"IFERROR(VLOOKUP(C6,ورقة1!$D$2:$E$34,2,FALSE),\"\")","v":340},10880]
[6,"2022-10-16","تمر",47,{"$f":"IFERROR(VLOOKUP(C7,ورقة1!$D$2:$E$34,2,FALSE),\"\")","v":440},20680]
[7,"2022-10-16","جونبو",240,{"$f":"IFERROR(VLOOKUP(C8,ورقة1!$D$2:$E$34,2,FALSE),\"\")","v":12},2880]
[8,"2022-10-16","ثوم",1,170,170]
[9,"2022-10-16","عصير",406,{"$f":"IFERROR(VLOOKUP(C10,ورقة1!$D$2:$E$34,2,FALSE),\"\")","v":1},406]
[10,"2022-10-16","بيض",810,{"$f":"IFERROR(VLOOKUP(C11,ورقة1!$D$2:$E$34,2,FALSE),\"\")","v":14},11340]
[11,"2022-10-16","بصل",7,{"$f":"IFERROR(VLOOKUP(C12,ورقة1!$D$2:$E$34,2,FALSE),\"\")","v":95},665]
[12,"2022-10-16","طماطم حب",6,{"$f":"IFERROR(VLOOKUP(C13,ورقة1!$D$2:$E$34,2,FALSE),\"\")","v":120},720]
[13,"2022-10-23","جزر",15,{"$f":"IFERROR(VLOOKUP(C14,ورقة1!$D$2:$E$34,2,FALSE),\"\")","v":80},1200]
[14,"2022-10-23","طماطم حب",12,{"$f":"IFERROR(VLOOKUP(C15,ورقة1!$D$2:$E$34,2,FALSE),\"\")","v":120},1440]
[15,"2022-10-23","بيض",1440,{"$f":"IFERROR(VLOOKUP(C16,ورقة1!$D$2:$E$34,2,FALSE),\"\")","v":14},20160]
[16,"2022-10-23","تفاح",52,{"$f":"IFERROR(VLOOKUP(C17,ورقة1!$D$2:$E$34,2,FALSE),\"\")","v":450},23400]
[17,"2022-10-23","بصل",14,{"$f":"IFERROR(VLOOKUP(C18,ورقة1!$D$2:$E$34,2,FALSE),\"\")","v":95},1330]
[18,"2022-10-23","بطاطا",17,{"$f":"IFERROR(VLOOKUP(C19,ورقة1!$D$2:$E$34,2,FALSE),\"\")","v":80},1360]
[19,"2022-10-23","تمر",60,{"$f":"IFERROR(VLOOKUP(C20,ورقة1!$D$2:$E$34,2,FALSE),\"\")","v":440},26400]
[20,"2022-11-06","بطاطا",10,{"$f":"IFERROR(VLOOKUP(C21,ورقة1!$D$2:$E$34,2,FALSE),\"\")","v":80},800]
[21,"2022-11-06","طماطم حب",8,{"$f":"IFERROR(VLOOKUP(C22,ورقة1!$D$2:$E$34,2,FALSE),\"\")","v":120},960]
[22,"2022-11-06","جزر",6,{"$f":"IFERROR(VLOOKUP(C23,ورقة1!$D$2:$E$34,2,FALSE),\"\")","v":80},480]
[23,"2022-11-06","بصل",5,{"$f":"IFERROR(VLOOKUP(C24,ورقة1!$D$2:$E$34,2,FALSE),\"\")","v":95},475]
[24,"2022-11-06","تمر",76,{"$f":"IFERROR(VLOOKUP(C25,ورقة1!$D$2:$E$34,2,FALSE),\"\")","v":440},33440]
[25,"2022-11-06","تفاح",54,{"$f":"IFERROR(VLOOKUP(C26,ورقة1!$D$2:$E$34,2,FALSE),\"\")","v":450},24300]
[26,"2022-11-06","بيض",1440,{"$f":"IFERROR(VLOOKUP(C27,ورقة1!$D$2:$E$34,2,FALSE),\"\")","v":14},20160]
[27,"2022-11-13","بصل",5,{"$f":"IFERROR(VLOOKUP(C28,ورقة1!$D$2:$E$34,2,FALSE),\"\")","v":95},475]
[28,"2022-11-13","تمر",70,{"$f":"IFERROR(VLOOKUP(C29,ورقة1!$D$2:$E$34,2,FALSE),\"\")","v":440},30800]
[29,"2022-11-13","بطاطا",10,80,800]
[30,"2022-11-13","طماطم حب",8,{"$f":"IFERROR(VLOOKUP(C31,ورقة1!$D$2:$E$34,2,FALSE),\"\")","v":120},960]
[31,"2022-11-13","تفاح",56,{"$f":"IFERROR(VLOOKUP(C32,ورقة1!$D$2:$E$34,2,FALSE),\"\")","v":450},25200]
[32,"2022-11-13","بيض",1440,{"$f":"IFERROR(VLOOKUP(C33,ورقة1!$D$2:$E$34,2,FALSE),\"\")","v":14},20160]
[33,"2022-11-13","كؤوس بلاستكية",3000,2,6000]
[34,"2022-11-13","يايورت عادي",350,20,7000]
[35,"2022-11-13","جزر",6,{"$f":"IFERROR(VLOOKUP(C36,ورقة1!$D$2:$E$34,2,FALSE),\"\")","v":80},480]
[36,"2022-11-15","بيض",100,{"$f":"IFERROR(VLOOKUP(C37,ورقة1!$D$2:$E$34,2,FALSE),\"\")","v":14},1400]
[37,"2022-11-15","جبن قطع",343,{"$f":"IFERROR(VLOOKUP(C38,ورقة1!$D$2:$E$34,2,FALSE),\"\")","v":17},5831]
[38,"2022-11-15","يايورت عادي",343,20,6860]
[39,"2022-11-20","يايورت عادي",343,20,6860]
[40,"2022-11-20","طونة",343,{"$f":"IFERROR(VLOOKUP(C41,ورقة1!$D$2:$E$34,2,FALSE),\"\")","v":80},27440]
[41,"2022-11-20","تمر",60,440,26400]
[42,"2022-11-20","تفاح",61,{"$f":"IFERROR(VLOOKUP(C43,ورقة1!$D$2:$E$34,2,FALSE),\"\")","v":450},27450]
[43,"2022-11-20","جزر",6,{"$f":"IFERROR(VLOOKUP(C44,ورقة1!$D$2:$E$34,2,FALSE),\"\")","v":80},480]
[44,"2022-11-20","بصل",6,{"$f":"IFERROR(VLOOKUP(C45,ورقة1!$D$2:$E$34,2,FALSE),\"\")","v":95},570]
[45,"2022-11-20","طماطم حب",10,{"$f":"IFERROR(VLOOKUP(C46,ورقة1!$D$2:$E$34,2,FALSE),\"\")","v":120},1200]
[46,"2022-11-20","بيض",1440,{"$f":"IFERROR(VLOOKUP(C47,ورقة1!$D$2:$E$34,2,FALSE),\"\")","v":14},20160]
[47,"2022-11-20","بطاطا",10,80,800]
[48,"2022-11-20","جبن قطع",686,{"$f":"IFERROR(VLOOKUP(C49,ورقة1!$D$2:$E$34,2,FALSE),\"\")","v":17},11662]
[49,"2022-11-27","جزر",6,80,480]
[50,"2022-11-27","تفاح",50,{"$f":"IFERROR(VLOOKUP(C51,ورقة1!$D$2:$E$34,2,FALSE),\"\")","v":450},22500]
[51,"2022-11-27","طونة",345,{"$f":"IFERROR(VLOOKUP(C52,ورقة1!$D$2:$E$34,2,FALSE),\"\")","v":80},27600]
[52,"2022-11-27","يايورت عادي",345,1,345]
[53,"2022-11-27","تمر",60,{"$f":"IFERROR(VLOOKUP(C54,ورقة1!$D$2:$E$34,2,FALSE),\"\")","v":440},26400]
[54,"2022-11-27","طماطم حب",10,120,1200]
[55,"2022-11-27","بصل",8,{"$f":"IFERROR(VLOOKUP(C56,ورقة1!$D$2:$E$34,2,FALSE),\"\")","v":95},760]
[56,"2022-11-27","بطاطا",10,{"$f":"IFERROR(VLOOKUP(C57,ورقة1!$D$2:$E$34,2,FALSE),\"\")","v":80},800]
[57,"2022-11-27","بيض",1725,{"$f":"IFERROR(VLOOKUP(C58,ورقة1!$D$2:$E$34,2,FALSE),\"\")","v":14},24150]
[58,"2022-11-29","يايورت عادي",343,20,6860]
[59,"2022-11-29","ماء معدني",720,{"$f":"IFERROR(VLOOKUP(C60,ورقة1!$D$2:$E$34,2,FALSE),\"\")","v":40},28800]
[60,"2022-11-29","كؤوس بلاستكية",600,1.3,780]
[61,null,null,null,{"$f":"IFERROR(VLOOKUP(C62,ورقة1!$D$2:$E$34,2,FALSE),\"\")","v":""},""]
[62,null,null,null,{"$f":"IFERROR(VLOOKUP(C63,ورقة1!$D$2:$E$34,2,FALSE),\"\")","v":""},""]
[63,null,null,null,{"$f":"IFERROR(VLOOKUP(C64,ورقة1!$D$2:$E$34,2,FALSE),\"\")","v":""},""]
[64,null,null,null,{"$f":"IFERROR(VLOOKUP(C65,ورقة1!$D$2:$E$34,2,FALSE),\"\")","v":""},""]
[65,null,null,null,{"$f":"IFERROR(VLOOKUP(C66,ورقة1!$D$2:$E$34,2,FALSE),\"\")","v":""},""]
[66,null,null,null,{"$f":"IFERROR(VLOOKUP(C67,ورقة1!$D$2:$E$34,2,FALSE),\"\")","v":""},{"$f":"IFERROR(D67*E67,\"\")","v":""}]
[67,null,null,null,{"$f":"IFERROR(VLOOKUP(C68,ورقة1!$D$2:$E$34,2,FALSE),\"\")","v":""},""]
[68,null,null,null,{"$f":"IFERROR(VLOOKUP(C69,ورقة1!$D$2:$E$34,2,FALSE),\"\")","v":""},""]
[69,null,null,null,{"$f":"IFERROR(VLOOKUP(C70,ورقة1!$D$2:$E$34,2,FALSE),\"\")","v":""},""]
[70,null,null,null,{"$f":"IFERROR(VLOOKUP(C71,ورقة1!$D$2:$E$34,2,FALSE),\"\")","v":""},""]
[71,null,null,null,{"$f":"IFERROR(VLOOKUP(C72,ورقة1!$D$2:$E$34,2,FALSE),\"\")","v":""},""]
[72,null,null,null,{"$f":"IFERROR(VLOOKUP(C73,ورقة1!$D$2:$E$34,2,FALSE),\"\")","v":""},""]
[73,null,null,null,{"$f":"IFERROR(VLOOKUP(C74,ورقة1!$D$2:$E$34,2,FALSE),\"\")","v":""},""]
[74,null,null,null,{"$f":"IFERROR(VLOOKUP(C75,ورقة1!$D$2:$E$34,2,FALSE),\"\")","v":""},""]
[75,null,null,null,{"$f":"IFERROR(VLOOKUP(C76,ورقة1!$D$2:$E$34,2,FALSE),\"\")","v":""},""]
[76,null,null,null,{"$f":"IFERROR(VLOOKUP(C77,ورقة1!$D$2:$E$34,2,FALSE),\"\")","v":""},""]
[77,null,null,null,{"$f":"IFERROR(VLOOKUP(C78,ورقة1!$D$2:$E$34,2,FALSE),\"\")","v":""},""]
[78,null,null,null,{"$f":"IFERROR(VLOOKUP(C79,ورقة1!$D$2:$E$34,2,FALSE),\"\")","v":""},""]
[79,null,null,null,{"$f":"IFERROR(VLOOKUP(C80,ورقة1!$D$2:$E$34,2,FALSE),\"\")","v":""},""]
[80,null,null,null,{"$f":"IFERROR(VLOOKUP(C81,ورقة1!$D$2:$E$34,2,FALSE),\"\")","v":""},""]
[81,null,null,null,{"$f":"IFERROR(VLOOKUP(C82,ورقة1!$D$2:$E$34,2,FALSE),\"\")","v":""},""]
[82,null,null,null,{"$f":"IFERROR(VLOOKUP(C83,ورقة1!$D$2:$E$34,2,FALSE),\"\")","v":""},""]
[83,null,null,null,{"$f":"IFERROR(VLOOKUP(C84,ورقة1!$D$2:$E$34,2,FALSE),\"\")","v":""},""]
[84,null,null,null,{"$f":"IFERROR(VLOOKUP(C85,ورقة1!$D$2:$E$34,2,FALSE),\"\")","v":""},""]
[85,null,null,null,{"$f":"IFERROR(VLOOKUP(C86,ورقة1!$D$2:$E$34,2,FALSE),\"\")","v":""},""]
[86,null,null,null,{"$f":"IFERROR(VLOOKUP(C87,ورقة1!$D$2:$E$34,2,FALSE),\"\")","v":""},""]
[87,null,null,null,{"$f":"IFERROR(VLOOKUP(C88,ورقة1!$D$2:$E$34,2,FALSE),\"\")","v":""},""]
[88,null,null,null,{"$f":"IFERROR(VLOOKUP(C89,ورقة1!$D$2:$E$34,2,FALSE),\"\")","v":""},""]
[89,null,null,null,{"$f":"IFERROR(VLOOKUP(C90,ورقة1!$D$2:$E$34,2,FALSE),\"\")","v":""},""]
[90,null,null,null,{"$f":"IFERROR(VLOOKUP(C91,ورقة1!$D$2:$E$34,2,FALSE),\"\")","v":""},""]
[91,null,null,null,{"$f":"IFERROR(VLOOKUP(C92,ورقة1!$D$2:$E$34,2,FALSE),\"\")","v":""},""]
[92,null,null,null,{"$f":"IFERROR(VLOOKUP(C93,ورقة1!$D$2:$E$34,2,FALSE),\"\")","v":""},""]
[93,null,null,null,{"$f":"IFERROR(VLOOKUP(C94,ورقة1!$D$2:$E$34,2,FALSE),\"\")","v":""},""]
[94,null,null,null,{"$f":"IFERROR(VLOOKUP(C95,ورقة1!$D$2:$E$34,2,FALSE),\"\")","v":""},""]
[95,null,null,null,{"$f":"IFERROR(VLOOKUP(C96,ورقة1!$D$2:$E$34,2,FALSE),\"\")","v":""},""]
[96,null,null,null,{"$f":"IFERROR(VLOOKUP(C97,ورقة1!$D$2:$E$34,2,FALSE),\"\")","v":""},""]
[97,null,null,null,{"$f":"IFERROR(VLOOKUP(C98,ورقة1!$D$2:$E$34,2,FALSE),\"\")","v":""},""]
[98,null,null,null,{"$f":"IFERROR(VLOOKUP(C99,ورقة1!$D$2:$E$34,2,FALSE),\"\")","v":""},""]
[99,null,null,null,{"$f":"IFERROR(VLOOKUP(C100,ورقة1!$D$2:$E$34,2,FALSE),\"\")","v":""},""]
[100,null,null,null,{"$f":"IFERROR(VLOOKUP(C101,ورقة1!$D$2:$E$34,2,FALSE),\"\")","v":""},""]
[101,null,null,null,{"$f":"IFERROR(VLOOKUP(C102,ورقة1!$D$2:$E$34,2,FALSE),\"\")","v":""},""]
[102,null,null,null,{"$f":"IFERROR(VLOOKUP(C103,ورقة1!$D$2:$E$34,2,FALSE),\"\")","v":""},""]
[103,null,null,null,{"$f":"IFERROR(VLOOKUP(C104,ورقة1!$D$2:$E$34,2,FALSE),\"\")","v":""},""]
[104,null,null,null,{"$f":"IFERROR(VLOOKUP(C105,ورقة1!$D$2:$E$34,2,FALSE),\"\")","v":""},""]
[105,null,null,null,{"$f":"IFERROR(VLOOKUP(C106,ورقة1!$D$2:$E$34,2,FALSE),\"\")","v":""},""]
[106,null,null,null,{"$f":"IFERROR(VLOOKUP(C107,ورقة1!$D$2:$E$34,2,FALSE),\"\")","v":""},""]
[107,null,null,null,{"$f":"IFERROR(VLOOKUP(C108,ورقة1!$D$2:$E$34,2,FALSE),\"\")","v":""},""]
[108,null,null,null,{"$f":"IFERROR(VLOOKUP(C109,ورقة1!$D$2:$E$34,2,FALSE),\"\")","v":""},""]
[109,null,null,null,{"$f":"IFERROR(VLOOKUP(C110,ورقة1!$D$2:$E$34,2,FALSE),\"\")","v":""},""]
[110,null,null,null,{"$f":"IFERROR(VLOOKUP(C111,ورقة1!$D$2:$E$34,2,FALSE),\"\")","v":""},""]
[111,null,null,null,{"$f":"IFERROR(VLOOKUP(C112,ورقة1!$D$2:$E$34,2,FALSE),\"\")","v":""},""]
[112,null,null,null,{"$f":"IFERROR(VLOOKUP(C113,ورقة1!$D$2:$E$34,2,FALSE),\"\")","v":""},""]
[113,null,null,null,{"$f":"IFERROR(VLOOKUP(C114,ورقة1!$D$2:$E$34,2,FALSE),\"\")","v":""},""]
[114,null,null,null,{"$f":"IFERROR(VLOOKUP(C115,ورقة1!$D$2:$E$34,2,FALSE),\"\")","v":""},""]
[115,null,null,null,{"$f":"IFERROR(VLOOKUP(C116,ورقة1!$D$2:$E$34,2,FALSE),\"\")","v":""},""]
[116,null,null,null,{"$f":"IFERROR(VLOOKUP(C117,ورقة1!$D$2:$E$34,2,FALSE),\"\")","v":""},""]
[117,null,null,null,{"$f":"IFERROR(VLOOKUP(C118,ورقة1!$D$2:$E$34,2,FALSE),\"\")","v":""},""]
[118,null,null,null,{"$f":"IFERROR(VLOOKUP(C119,ورقة1!$D$2:$E$34,2,FALSE),\"\")","v":""},""]
[119,null,null,null,{"$f":"IFERROR(VLOOKUP(C120,ورقة1!$D$2:$E$34,2,FALSE),\"\")","v":""},""]
[120,null,null,null,{"$f":"IFERROR(VLOOKUP(C121,ورقة1!$D$2:$E$34,2,FALSE),\"\")","v":""},""]
[121,null,null,null,{"$f":"IFERROR(VLOOKUP(C122,ورقة1!$D$2:$E$34,2,FALSE),\"\")","v":""},""]
[122,null,null,null,{"$f":"IFERROR(VLOOKUP(C123,ورقة1!$D$2:$E$34,2,FALSE),\"\")","v":""},""]
[123,null,null,null,{"$f":"IFERROR(VLOOKUP(C124,ورقة1!$D$2:$E$34,2,FALSE),\"\")","v":""},""]
[124,null,null,null,{"$f":"IFERROR(VLOOKUP(C125,ورقة1!$D$2:$E$34,2,FALSE),\"\")","v":""},""]
[125,null,null,null,{"$f":"IFERROR(VLOOKUP(C126,ورقة1!$D$2:$E$34,2,FALSE),\"\")","v":""},""]
[126,null,null,null,{"$f":"IFERROR(VLOOKUP(C127,ورقة1!$D$2:$E$34,2,FALSE),\"\")","v":""},""]
[127,null,null,null,{"$f":"IFERROR(VLOOKUP(C128,ورقة1!$D$2:$E$34,2,FALSE),\"\")","v":""},""]
[128,null,null,null,{"$f":"IFERROR(VLOOKUP(C129,ورقة1!$D$2:$E$34,2,FALSE),\"\")","v":""},""]
[129,null,null,null,{"$f":"IFERROR(VLOOKUP(C130,ورقة1!$D$2:$E$34,2,FALSE),\"\")","v":""},""]
[130,null,null,null,{"$f":"IFERROR(VLOOKUP(C131,ورقة1!$D$2:$E$34,2,FALSE),\"\")","v":""},{"$f":"IFERROR(D131*E131,\"\")","v":""}]
[131,null,null,null,{"$f":"IFERROR(VLOOKUP(C132,ورقة1!$D$2:$E$34,2,FALSE),\"\")","v":""},""]
[132,null,null,null,{"$f":"IFERROR(VLOOKUP(C133,ورقة1!$D$2:$E$34,2,FALSE),\"\")","v":""},""]
[133,null,null,null,{"$f":"IFERROR(VLOOKUP(C134,ورقة1!$D$2:$E$34,2,FALSE),\"\")","v":""},""]
[134,null,null,null,{"$f":"IFERROR(VLOOKUP(C135,ورقة1!$D$2:$E$34,2,FALSE),\"\")","v":""},""]
[135,null,null,null,{"$f":"IFERROR(VLOOKUP(C136,ورقة1!$D$2:$E$34,2,FALSE),\"\")","v":""},""]
[136,null,null,null,{"$f":"IFERROR(VLOOKUP(C137,ورقة1!$D$2:$E$34,2,FALSE),\"\")","v":""},""]
[137,null,null,null,{"$f":"IFERROR(VLOOKUP(C138,ورقة1!$D$2:$E$34,2,FALSE),\"\")","v":""},""]
[138,null,null,null,{"$f":"IFERROR(VLOOKUP(C139,ورقة1!$D$2:$E$34,2,FALSE),\"\")","v":""},""]
[139,null,null,null,{"$f":"IFERROR(VLOOKUP(C140,ورقة1!$D$2:$E$34,2,FALSE),\"\")","v":""},""]
[140,null,null,null,{"$f":"IFERROR(VLOOKUP(C141,ورقة1!$D$2:$E$34,2,FALSE),\"\")","v":""},""]
[141,null,null,null,{"$f":"IFERROR(VLOOKUP(C142,ورقة1!$D$2:$E$34,2,FALSE),\"\")","v":""},""]
[142,null,null,null,{"$f":"IFERROR(VLOOKUP(C143,ورقة1!$D$2:$E$34,2,FALSE),\"\")","v":""},""]
[143,null,null,null,{"$f":"IFERROR(VLOOKUP(C144,ورقة1!$D$2:$E$34,2,FALSE),\"\")","v":""},""]
[144,null,null,null,{"$f":"IFERROR(VLOOKUP(C145,ورقة1!$D$2:$E$34,2,FALSE),\"\")","v":""},""]
[145,null,null,null,{"$f":"IFERROR(VLOOKUP(C146,ورقة1!$D$2:$E$34,2,FALSE),\"\")","v":""},""]
[146,null,null,null,{"$f":"IFERROR(VLOOKUP(C147,ورقة1!$D$2:$E$34,2,FALSE),\"\")","v":""},""]
[147,null,null,null,{"$f":"IFERROR(VLOOKUP(C148,ورقة1!$D$2:$E$34,2,FALSE),\"\")","v":""},""]
[148,null,null,null,{"$f":"IFERROR(VLOOKUP(C149,ورقة1!$D$2:$E$34,2,FALSE),\"\")","v":""},""]
[149,null,null,null,{"$f":"IFERROR(VLOOKUP(C150,ورقة1!$D$2:$E$34,2,FALSE),\"\")","v":""},""]
[150,null,null,null,{"$f":"IFERROR(VLOOKUP(C151,ورقة1!$D$2:$E$34,2,FALSE),\"\")","v":""},""]
[151,null,null,null,{"$f":"IFERROR(VLOOKUP(C152,ورقة1!$D$2:$E$34,2,FALSE),\"\")","v":""},""]
[152,null,null,null,{"$f":"IFERROR(VLOOKUP(C153,ورقة1!$D$2:$E$34,2,FALSE),\"\")","v":""},""]
[153,null,null,null,{"$f":"IFERROR(VLOOKUP(C154,ورقة1!$D$2:$E$34,2,FALSE),\"\")","v":""},""]
[154,null,null,null,{"$f":"IFERROR(VLOOKUP(C155,ورقة1!$D$2:$E$34,2,FALSE),\"\")","v":""},""]
[155,null,null,null,{"$f":"IFERROR(VLOOKUP(C156,ورقة1!$D$2:$E$34,2,FALSE),\"\")","v":""},""]
[156,null,null,null,{"$f":"IFERROR(VLOOKUP(C157,ورقة1!$D$2:$E$34,2,FALSE),\"\")","v":""},""]
[157,null,null,null,{"$f":"IFERROR(VLOOKUP(C158,ورقة1!$D$2:$E$34,2,FALSE),\"\")","v":""},""]
[158,null,null,null,{"$f":"IFERROR(VLOOKUP(C159,ورقة1!$D$2:$E$34,2,FALSE),\"\")","v":""},""]
[159,null,null,null,{"$f":"IFERROR(VLOOKUP(C160,ورقة1!$D$2:$E$34,2,FALSE),\"\")","v":""},""]
[160,null,null,null,{"$f":"IFERROR(VLOOKUP(C161,ورقة1!$D$2:$E$34,2,FALSE),\"\")","v":""},""]
[161,null,null,null,{"$f":"IFERROR(VLOOKUP(C162,ورقة1!$D$2:$E$34,2,FALSE),\"\")","v":""},""]
[162,null,null,null,{"$f":"IFERROR(VLOOKUP(C163,ورقة1!$D$2:$E$34,2,FALSE),\"\")","v":""},""]
[163,null,null,null,{"$f":"IFERROR(VLOOKUP(C164,ورقة1!$D$2:$E$34,2,FALSE),\"\")","v":""},""]
[164,null,null,null,{"$f":"IFERROR(VLOOKUP(C165,ورقة1!$D$2:$E$34,2,FALSE),\"\")","v":""},""]
[165,null,null,null,{"$f":"IFERROR(VLOOKUP(C166,ورقة1!$D$2:$E$34,2,FALSE),\"\")","v":""},""]
[166,null,null,null,{"$f":"IFERROR(VLOOKUP(C167,ورقة1!$D$2:$E$34,2,FALSE),\"\")","v":""},""]
[167,null,null,null,{"$f":"IFERROR(VLOOKUP(C168,ورقة1!$D$2:$E$34,2,FALSE),\"\")","v":""},""]
[168,null,null,null,{"$f":"IFERROR(VLOOKUP(C169,ورقة1!$D$2:$E$34,2,FALSE),\"\")","v":""},""]
[169,null,null,null,{"$f":"IFERROR(VLOOKUP(C170,ورقة1!$D$2:$E$34,2,FALSE),\"\")","v":""},""]
[170,null,null,null,{"$f":"IFERROR(VLOOKUP(C171,ورقة1!$D$2:$E$34,2,FALSE),\"\")","v":""},""]
[171,null,null,null,{"$f":"IFERROR(VLOOKUP(C172,ورقة1!$D$2:$E$34,2,FALSE),\"\")","v":""},""]
[172,null,null,null,{"$f":"IFERROR(VLOOKUP(C173,ورقة1!$D$2:$E$34,2,FALSE),\"\")","v":""},""]
[173,null,null,null,{"$f":"IFERROR(VLOOKUP(C174,ورقة1!$D$2:$E$34,2,FALSE),\"\")","v":""},""]
[174,null,null,null,{"$f":"IFERROR(VLOOKUP(C175,ورقة1!$D$2:$E$34,2,FALSE),\"\")","v":""},""]
[175,null,null,null,{"$f":"IFERROR(VLOOKUP(C176,ورقة1!$D$2:$E$34,2,FALSE),\"\")","v":""},""]
[176,null,null,null,{"$f":"IFERROR(VLOOKUP(C177,ورقة1!$D$2:$E$34,2,FALSE),\"\")","v":""},""]
[177,null,null,null,{"$f":"IFERROR(VLOOKUP(C178,ورقة1!$D$2:$E$34,2,FALSE),\"\")","v":""},""]
[178,null,null,null,{"$f":"IFERROR(VLOOKUP(C179,ورقة1!$D$2:$E$34,2,FALSE),\"\")","v":""},""]
[179,null,null,null,{"$f":"IFERROR(VLOOKUP(C180,ورقة1!$D$2:$E$34,2,FALSE),\"\")","v":""},""]
[180,null,null,null,{"$f":"IFERROR(VLOOKUP(C181,ورقة1!$D$2:$E$34,2,FALSE),\"\")","v":""},""]
[181,null,null,null,{"$f":"IFERROR(VLOOKUP(C182,ورقة1!$D$2:$E$34,2,FALSE),\"\")","v":""},""]
[182,null,null,null,{"$f":"IFERROR(VLOOKUP(C183,ورقة1!$D$2:$E$34,2,FALSE),\"\")","v":""},""]
[183,null,null,null,{"$f":"IFERROR(VLOOKUP(C184,ورقة1!$D$2:$E$34,2,FALSE),\"\")","v":""},""]
[184,null,null,null,{"$f":"IFERROR(VLOOKUP(C185,ورقة1!$D$2:$E$34,2,FALSE),\"\")","v":""},""]
[185,null,null,null,{"$f":"IFERROR(VLOOKUP(C186,ورقة1!$D$2:$E$34,2,FALSE),\"\")","v":""},""]
[186,null,null,null,{"$f":"IFERROR(VLOOKUP(C187,ورقة1!$D$2:$E$34,2,FALSE),\"\")","v":""},""]
[187,null,null,null,{"$f":"IFERROR(VLOOKUP(C188,ورقة1!$D$2:$E$34,2,FALSE),\"\")","v":""},""]
[188,null,null,null,{"$f":"IFERROR(VLOOKUP(C189,ورقة1!$D$2:$E$34,2,FALSE),\"\")","v":""},""]
[189,null,null,null,{"$f":"IFERROR(VLOOKUP(C190,ورقة1!$D$2:$E$34,2,FALSE),\"\")","v":""},""]
[190,null,null,null,{"$f":"IFERROR(VLOOKUP(C191,ورقة1!$D$2:$E$34,2,FALSE),\"\")","v":""},""]
[191,null,null,null,{"$f":"IFERROR(VLOOKUP(C192,ورقة1!$D$2:$E$34,2,FALSE),\"\")","v":""},""]
[192,null,null,null,{"$f":"IFERROR(VLOOKUP(C193,ورقة1!$D$2:$E$34,2,FALSE),\"\")","v":""},""]
[193,null,null,null,{"$f":"IFERROR(VLOOKUP(C194,ورقة1!$D$2:$E$34,2,FALSE),\"\")","v":""},""]
[194,null,null,null,{"$f":"IFERROR(VLOOKUP(C195,ورقة1!$D$2:$E$34,2,FALSE),\"\")","v":""},{"$f":"IFERROR(D195*E195,\"\")","v":""}]
[195,null,null,null,{"$f":"IFERROR(VLOOKUP(C196,ورقة1!$D$2:$E$34,2,FALSE),\"\")","v":""},""]
[196,null,null,null,{"$f":"IFERROR(VLOOKUP(C197,ورقة1!$D$2:$E$34,2,FALSE),\"\")","v":""},""]
[197,null,null,null,{"$f":"IFERROR(VLOOKUP(C198,ورقة1!$D$2:$E$34,2,FALSE),\"\")","v":""},""]
[198,null,null,null,{"$f":"IFERROR(VLOOKUP(C199,ورقة1!$D$2:$E$34,2,FALSE),\"\")","v":""},""]
[199,null,null,null,{"$f":"IFERROR(VLOOKUP(C200,ورقة1!$D$2:$E$34,2,FALSE),\"\")","v":""},""]
{"$rows_left_out":278}
{"sheet":"ورقة1","index":1,"n_rows":34,"n_cols":23,"rows_kept":34,"cut":false,"hidden":true,"merged":[]}
[]
[null,null,0,null,0]
[null,null,80,"بطاطا",80,"بطاطا","اكتوبر 2022"]
[null,null,95,"بصل",95,"بصل","نوفمبر 2022"]
[null,null,80,"جزر",80,"جزر","ديسمبر 2022"]
[null,null,120,"طماطم حب",120,"طماطم حب","جانفي 2023"]
[null,null,120,"سلاطة حشيش",120,"سلاطة حشيش","فبراير 2023",null,null,null,null,null,null,null,null,null,null,null,null,null,null,null,"OIGNONS"]
[null,null,350,"زيتون سلاطة",350,"زيتون سلاطة","مارس 2023",null,null,null,null,null,null,null,null,null,null,null,null,null,null,null,"CAROTTE"]
[null,null,14,"بيض",14,"بيض","ابريل 2023",null,null,null,null,null,null,null,null,null,null,null,null,null,null,null,"TOMATE FRAICHE"]
[null,null,17,"جبن قطع",17,"جبن قطع","ماي 2023",null,null,null,null,null,null,null,null,null,null,null,null,null,null,null,"SALADE"]
[null,null,450,"تفاح",450,"تفاح","جوان 2023",null,null,null,null,null,null,null,null,null,null,null,null,null,null,null,"OLIVE NOIR"]
[null,null,440,"تمر",440,"تمر","سبتمبر 2023",null,null,null,null,null,null,null,null,null,null,null,null,null,null,null,"OEUFS"]
[null,null,340,"موز",340,"موز","اكتوبر 2023",null,null,null,null,null,null,null,null,null,null,null,null,null,null,null,"EAU MINERALE"]
[null,null,340,"اجاص",340,"اجاص","نوفمبر 2023",null,null,null,null,null,null,null,null,null,null,null,null,null,null,null,"ORANGE"]
[null,null,40,"ماء معدني",40,"ماء معدني","ديسمبر 2023",null,null,null,null,null,null,null,null,null,null,null,null,null,null,null,"POMME"]
[null,null,100,"مرغرين",100,"مرغرين","جانفي 2024",null,null,null,null,null,null,null,null,null,null,null,null,null,null,null,"YAHORT 2"]
[null,null,200,"برتقال طامسة",200,"برتقال طامسة","فبراير 2024",null,null,null,null,null,null,null,null,null,null,null,null,null,null,null,"OLIVE VERT"]
[null,null,250,"برتقال ماندرين",250,"برتقال ماندرين","مارس 2024",null,null,null,null,null,null,null,null,null,null,null,null,null,null,null,"POMME DE TERRE"]
[null,null,20,"يايورت عادي",1,"يايورت عادي","أبريل 2024",null,null,null,null,null,null,null,null,null,null,null,null,null,null,null,"POULET"]
[null,null,30,"يايورت مشكل",30,"يايورت مشكل","ماي 2024",null,null,null,null,null,null,null,null,null,null,null,null,null,null,null,"TOMATE FRAICHE"]
[null,null,20,"عصير",1,"عصير","جوان 2024",null,null,null,null,null,null,null,null,null,null,null,null,null,null,null,"YAHORT"]
[null,null,380,"دجاج",380,"دجاج",null,null,null,null,null,null,null,null,null,null,null,null,null,null,null,null,"SALADE"]
[null,null,100,"طونة",80,"طونة",null,null,null,null,null,null,null,null,null,null,null,null,null,null,null,null,"VIANDE"]
[null,null,170,"شربة",170,"شربة",null,null,null,null,null,null,null,null,null,null,null,null,null,null,null,null,"EAU MINERALE"]
[null,null,170,"مقارون",170,"مقارون",null,null,null,null,null,null,null,null,null,null,null,null,null,null,null,null,"POMME DE TERRE"]
[null,null,170,"سباقيتي",170,"سباقيتي",null,null,null,null,null,null,null,null,null,null,null,null,null,null,null,null,"OIGNONS"]
[null,null,110,"طماطم مركزة",110,"طماطم مركزة",null,null,null,null,null,null,null,null,null,null,null,null,null,null,null,null,"CAROTTE"]
[null,null,40,"ملح",40,"ملح",null,null,null,null,null,null,null,null,null,null,null,null,null,null,null,null,"TOMATE FRAICHE"]
[null,null,1,"ثوم",1,"ثوم",null,null,null,null,null,null,null,null,null,null,null,null,null,null,null,null,"SALADE"]
[null,null,2,"لحم العجل",2,"لحم العجل",null,null,null,null,null,null,null,null,null,null,null,null,null,null,null,null,"OLIVE NOIR"]
[null,null,3,"لحم الخروف",3,"لحم الخروف"]
[null,null,4,"لحم مفروم",4,"لحم مفروم"]
[null,null,1.3,"كؤوس بلاستكية",2]
[null,null,12,"جونبو",12]