{"text_format":"1","workbook":"xlsx","n_sheets":2,"sheets":["in","data"],"not_rendered":{"charts":0,"images":0,"macros":0,"external_links":2,"defined_names":33,"comments":0,"pivot_tables":0},"unopened":[],"bounds":{"document_bytes":16777216,"sheet_cells":100000,"rows_first":2000,"rows_last":500,"rows_between":2000,"halvings":0,"cell_chars":16384,"cell_head_chars":4096},"cells_cut":0,"cells_raw":0,"read":"whole","date_system":"1900"}

{"sheet":"in","index":0,"n_rows":36,"n_cols":15,"rows_kept":36,"cut":false,"hidden":false,"merged":[[0,0,0,13]]}
["اذن استلام  صاج"]
[]
["رقم الاذن",2]
["التاريخ",{"$f":"TODAY()","v":"2023-01-11"}]
["كود المورد"]
["اسم المورد",{"$f":"IFERROR(VLOOKUP(B5,[1]data!F:G,2,FALSE),\"\")","v":""}]
["م","كود الصنف","اسم الصنف","وصف الصنف","عدد البالتات","وزن البالتات","الوزن الإجمالي","الوزن الصافي"," الطول بالمتر","العرض بالمتر","الارتفاع بالمتر","السمك","الكثافة","العدد","الخطة"]
[1,1,{"$f":"VLOOKUP(B8,data!F:G,2,FALSE)","v":"صاج مجلفن "},null,4,{"$f":"E8*data!B$3","v":140},8590,{"$f":"G8-F8","v":8450},2.0499999999999998,1.17,{"$f":"H8/(7850*I8*J8)","v":0.44879429686016609},0.4,7.8499999999999994E-6,{"$f":"ROUNDDOWN((K8/L8)*1000,0)","v":1121}]
[]
[]
[null,null,{"$f":"IF(ISNA(VLOOKUP(B11,[1]data!J:L,2,FALSE)),\"\",VLOOKUP(B11,[1]data!J:L,2,FALSE))","v":""},{"$f":"IF(ISNA(VLOOKUP(B11,[1]data!J:L,3,FALSE)),\"\",VLOOKUP(B11,[1]data!J:L,3,FALSE))","v":""}]
[null,null,{"$f":"IF(ISNA(VLOOKUP(B12,[1]data!J:L,2,FALSE)),\"\",VLOOKUP(B12,[1]data!J:L,2,FALSE))","v":""},{"$f":"IF(ISNA(VLOOKUP(B12,[1]data!J:L,3,FALSE)),\"\",VLOOKUP(B12,[1]data!J:L,3,FALSE))","v":""}]
[null,null,{"$f":"IF(ISNA(VLOOKUP(B13,[1]data!J:L,2,FALSE)),\"\",VLOOKUP(B13,[1]data!J:L,2,FALSE))","v":""},{"$f":"IF(ISNA(VLOOKUP(B13,[1]data!J:L,3,FALSE)),\"\",VLOOKUP(B13,[1]data!J:L,3,FALSE))","v":""}]
[null,null,{"$f":"IF(ISNA(VLOOKUP(B14,[1]data!J:L,2,FALSE)),\"\",VLOOKUP(B14,[1]data!J:L,2,FALSE))","v":""},{"$f":"IF(ISNA(VLOOKUP(B14,[1]data!J:L,3,FALSE)),\"\",VLOOKUP(B14,[1]data!J:L,3,FALSE))","v":""}]
[null,null,{"$f":"IF(ISNA(VLOOKUP(B15,[1]data!J:L,2,FALSE)),\"\",VLOOKUP(B15,[1]data!J:L,2,FALSE))","v":""},{"$f":"IF(ISNA(VLOOKUP(B15,[1]data!J:L,3,FALSE)),\"\",VLOOKUP(B15,[1]data!J:L,3,FALSE))","v":""}]
[null,null,{"$f":"IF(ISNA(VLOOKUP(B16,[1]data!J:L,2,FALSE)),\"\",VLOOKUP(B16,[1]data!J:L,2,FALSE))","v":""},{"$f":"IF(ISNA(VLOOKUP(B16,[1]data!J:L,3,FALSE)),\"\",VLOOKUP(B16,[1]data!J:L,3,FALSE))","v":""}]
[null,null,{"$f":"IF(ISNA(VLOOKUP(B17,[1]data!J:L,2,FALSE)),\"\",VLOOKUP(B17,[1]data!J:L,2,FALSE))","v":""},{"$f":"IF(ISNA(VLOOKUP(B17,[1]data!J:L,3,FALSE)),\"\",VLOOKUP(B17,[1]data!J:L,3,FALSE))","v":""}]
[null,null,{"$f":"IF(ISNA(VLOOKUP(B18,[1]data!J:L,2,FALSE)),\"\",VLOOKUP(B18,[1]data!J:L,2,FALSE))","v":""},{"$f":"IF(ISNA(VLOOKUP(B18,[1]data!J:L,3,FALSE)),\"\",VLOOKUP(B18,[1]data!J:L,3,FALSE))","v":""}]
[null,null,{"$f":"IF(ISNA(VLOOKUP(B19,[1]data!J:L,2,FALSE)),\"\",VLOOKUP(B19,[1]data!J:L,2,FALSE))","v":""},{"$f":"IF(ISNA(VLOOKUP(B19,[1]data!J:L,3,FALSE)),\"\",VLOOKUP(B19,[1]data!J:L,3,FALSE))","v":""}]
[null,null,{"$f":"IF(ISNA(VLOOKUP(B20,[1]data!J:L,2,FALSE)),\"\",VLOOKUP(B20,[1]data!J:L,2,FALSE))","v":""},{"$f":"IF(ISNA(VLOOKUP(B20,[1]data!J:L,3,FALSE)),\"\",VLOOKUP(B20,[1]data!J:L,3,FALSE))","v":""}]
[null,null,{"$f":"IF(ISNA(VLOOKUP(B21,[1]data!J:L,2,FALSE)),\"\",VLOOKUP(B21,[1]data!J:L,2,FALSE))","v":""},{"$f":"IF(ISNA(VLOOKUP(B21,[1]data!J:L,3,FALSE)),\"\",VLOOKUP(B21,[1]data!J:L,3,FALSE))","v":""}]
[null,null,{"$f":"IF(ISNA(VLOOKUP(B22,[1]data!J:L,2,FALSE)),\"\",VLOOKUP(B22,[1]data!J:L,2,FALSE))","v":""},{"$f":"IF(ISNA(VLOOKUP(B22,[1]data!J:L,3,FALSE)),\"\",VLOOKUP(B22,[1]data!J:L,3,FALSE))","v":""}]
[null,null,{"$f":"IF(ISNA(VLOOKUP(B23,[1]data!J:L,2,FALSE)),\"\",VLOOKUP(B23,[1]data!J:L,2,FALSE))","v":""},{"$f":"IF(ISNA(VLOOKUP(B23,[1]data!J:L,3,FALSE)),\"\",VLOOKUP(B23,[1]data!J:L,3,FALSE))","v":""}]
[null,null,{"$f":"IF(ISNA(VLOOKUP(B24,[1]data!J:L,2,FALSE)),\"\",VLOOKUP(B24,[1]data!J:L,2,FALSE))","v":""},{"$f":"IF(ISNA(VLOOKUP(B24,[1]data!J:L,3,FALSE)),\"\",VLOOKUP(B24,[1]data!J:L,3,FALSE))","v":""}]
[null,null,{"$f":"IF(ISNA(VLOOKUP(B25,[1]data!J:L,2,FALSE)),\"\",VLOOKUP(B25,[1]data!J:L,2,FALSE))","v":""},{"$f":"IF(ISNA(VLOOKUP(B25,[1]data!J:L,3,FALSE)),\"\",VLOOKUP(B25,[1]data!J:L,3,FALSE))","v":""}]
[null,null,{"$f":"IF(ISNA(VLOOKUP(B26,[1]data!J:L,2,FALSE)),\"\",VLOOKUP(B26,[1]data!J:L,2,FALSE))","v":""},{"$f":"IF(ISNA(VLOOKUP(B26,[1]data!J:L,3,FALSE)),\"\",VLOOKUP(B26,[1]data!J:L,3,FALSE))","v":""}]
[null,null,{"$f":"IF(ISNA(VLOOKUP(B27,[1]data!J:L,2,FALSE)),\"\",VLOOKUP(B27,[1]data!J:L,2,FALSE))","v":""},{"$f":"IF(ISNA(VLOOKUP(B27,[1]data!J:L,3,FALSE)),\"\",VLOOKUP(B27,[1]data!J:L,3,FALSE))","v":""}]
[null,null,{"$f":"IF(ISNA(VLOOKUP(B28,[1]data!J:L,2,FALSE)),\"\",VLOOKUP(B28,[1]data!J:L,2,FALSE))","v":""},{"$f":"IF(ISNA(VLOOKUP(B28,[1]data!J:L,3,FALSE)),\"\",VLOOKUP(B28,[1]data!J:L,3,FALSE))","v":""}]
[null,null,{"$f":"IF(ISNA(VLOOKUP(B29,[1]data!J:L,2,FALSE)),\"\",VLOOKUP(B29,[1]data!J:L,2,FALSE))","v":""},{"$f":"IF(ISNA(VLOOKUP(B29,[1]data!J:L,3,FALSE)),\"\",VLOOKUP(B29,[1]data!J:L,3,FALSE))","v":""}]
[null,null,{"$f":"IF(ISNA(VLOOKUP(B30,[1]data!J:L,2,FALSE)),\"\",VLOOKUP(B30,[1]data!J:L,2,FALSE))","v":""},{"$f":"IF(ISNA(VLOOKUP(B30,[1]data!J:L,3,FALSE)),\"\",VLOOKUP(B30,[1]data!J:L,3,FALSE))","v":""}]
[null,null,{"$f":"IF(ISNA(VLOOKUP(B31,[1]data!J:L,2,FALSE)),\"\",VLOOKUP(B31,[1]data!J:L,2,FALSE))","v":""},{"$f":"IF(ISNA(VLOOKUP(B31,[1]data!J:L,3,FALSE)),\"\",VLOOKUP(B31,[1]data!J:L,3,FALSE))","v":""}]
[null,null,{"$f":"IF(ISNA(VLOOKUP(B32,[1]data!J:L,2,FALSE)),\"\",VLOOKUP(B32,[1]data!J:L,2,FALSE))","v":""},{"$f":"IF(ISNA(VLOOKUP(B32,[1]data!J:L,3,FALSE)),\"\",VLOOKUP(B32,[1]data!J:L,3,FALSE))","v":""}]
[null,null,{"$f":"IF(ISNA(VLOOKUP(B33,[1]data!J:L,2,FALSE)),\"\",VLOOKUP(B33,[1]data!J:L,2,FALSE))","v":""},{"$f":"IF(ISNA(VLOOKUP(B33,[1]data!J:L,3,FALSE)),\"\",VLOOKUP(B33,[1]data!J:L,3,FALSE))","v":""}]
[null,null,{"$f":"IF(ISNA(VLOOKUP(B34,[1]data!J:L,2,FALSE)),\"\",VLOOKUP(B34,[1]data!J:L,2,FALSE))","v":""},{"$f":"IF(ISNA(VLOOKUP(B34,[1]data!J:L,3,FALSE)),\"\",VLOOKUP(B34,[1]data!J:L,3,FALSE))","v":""}]
[null,null,{"$f":"IF(ISNA(VLOOKUP(B35,[1]data!J:L,2,FALSE)),\"\",VLOOKUP(B35,[1]data!J:L,2,FALSE))","v":""},{"$f":"IF(ISNA(VLOOKUP(B35,[1]data!J:L,3,FALSE)),\"\",VLOOKUP(B35,[1]data!J:L,3,FALSE))","v":""}]
[null,null,{"$f":"IF(ISNA(VLOOKUP(B36,[1]data!J:L,2,FALSE)),\"\",VLOOKUP(B36,[1]data!J:L,2,FALSE))","v":""},{"$f":"IF(ISNA(VLOOKUP(B36,[1]data!J:L,3,FALSE)),\"\",VLOOKUP(B36,[1]data!J:L,3,FALSE))","v":""}]

{"sheet":"data","index":1,"n_rows":4,"n_cols":7,"rows_kept":4,"cut":false,"hidden":false,"merged":[]}
[]
[]
["متوسط وزن البالتة",35,null,null,null,"كود الصنف","اسم الصنف"]
[null,null,null,null,null,1,"صاج مجلفن "]