{"text_format":"1","workbook":"xlsx","n_sheets":17,"sheets":["الرئيسية","قائمة الموظفين","Input","مواعيد البصمه","Data","يناير","فبراير","مارس","ابريل","مايو","يونيو","يوليو","اغسطس","سبتمبر","اكتوبر","نوفمبر","ديسمبر"],"not_rendered":{"charts":0,"images":4,"macros":1,"external_links":0,"defined_names":0,"comments":1,"pivot_tables":0},"unopened":[],"bounds":{"document_bytes":16777216,"sheet_cells":100000,"rows_first":2000,"rows_last":500,"rows_between":2000,"halvings":0,"cell_chars":16384,"cell_head_chars":4096},"cells_cut":0,"cells_raw":0,"read":"whole","date_system":"1900"}

{"sheet":"الرئيسية","index":0,"n_rows":15,"n_cols":27,"rows_kept":15,"cut":false,"hidden":false,"merged":[[0,0,32,13]]}
[]
[]
[]
[null,null,null,null,null,null,null,null,null,null,null,null,null,null,null,null,null,null,null,null,null,null,null,null,null,"يناير",1]
[null,null,null,null,null,null,null,null,null,null,null,null,null,null,null,null,null,null,null,null,null,null,null,null,null,"فبراير",2]
[null,null,null,null,null,null,null,null,null,null,null,null,null,null,null,null,null,null,null,null,null,null,null,null,null,"مارس",3]
[null,null,null,null,null,null,null,null,null,null,null,null,null,null,null,null,null,null,null,null,null,null,null,null,null,"ابريل",4]
[null,null,null,null,null,null,null,null,null,null,null,null,null,null,null,null,null,null,null,null,null,null,null,null,null,"مايو",5]
{"$rows_left_out":8}
{"sheet":"قائمة الموظفين","index":1,"n_rows":151,"n_cols":24,"rows_kept":151,"cut":false,"hidden":false,"merged":[[0,22,0,23],[0,20,0,21],[0,0,1,0],[0,4,0,5],[0,1,1,1],[0,2,1,2],[0,3,1,3]]}
["الكود","الاسم","الوظيفه","الاساسى","التامين",null,null,null,null,null,null,null,null,null,null,null,null,null,null,null,"رصيد الاجازات",null,"التامينات"]
[null,null,null,null,"الثابت","المتغير","اجر اليوم","اجر الساعه","اضافى 1","اضافى2","عطلات","الحافز","بدل اغتراب ","بدل مواصلات","بدل وجبه","بدل غلاء معيشه","بدل موبايل","بدل ملبس","بدل طبيعة عمل","قرض","اعتيادى 21","عارضه 6","ت اجتماعى","ت طبى خاص"]
[230012,"احمد امام","مدير ادارى",3000,750,750,{"$f":"SUM(D3+F3+E3)/30","v":150},{"$f":"G3/8","v":18.75},{"$f":"H3*1.5","v":28.125},{"$f":"H3*2","v":37.5},{"$f":"H3*2","v":37.5},1000,100,600,250,150,100,50,50,{"$f":"12000-Input!AC37","v":12000},{"$f":"21-IF(A3=Input!$A$6,Input!P37,0)","v":21},6,{"$f":"-140","v":-140},{"$f":"-100","v":-100}]
[230013,"احمد السيد","امين مخزن ",2000,500,500,{"$f":"SUM(D4+F4+E4)/30","v":100},{"$f":"G4/8","v":12.5},{"$f":"H4*1.5","v":18.75},{"$f":"H4*2","v":25},{"$f":"H4*2","v":25},800,100,600,300,150,null,null,50,-10000,{"$f":"21-IF(A4=Input!$A$6,Input!P37,0)","v":21},6,{"$f":"-140","v":-140},{"$f":"-100","v":-100}]
[230014,"يسرى موافى","فنى ",1500,500,500,83.333333333333329,10.416666666666666,15.625,20.833333333333332,20.833333333333332,750,null,650,350,null,50,null,100,-9000,{"$f":"21-IF(A5=Input!$A$6,Input!P37,0)","v":21},6,-140,-100]
[230015,"صالح محمد ","عامل ",1800,null,null,60,7.5,11.25,15,15,1000,null,500,300,200,null,null,500,-8000,{"$f":"21-IF(A6=Input!$A$6,Input!P37,0)","v":21},6,-140,-100]
[230016,"مراد الشافعى ","عامل ",1750,250,250,75,9.375,14.0625,18.75,18.75,500,100,200,100,null,50,null,100,-7000,null,6,-140,-100]
[230017,"محمد على ","مدير ادارى",1500,150,150,60,7.5,11.25,15,15,800,null,750,null,200,null,100,null,-500,null,6,-140,-100]
{"$rows_left_out":144}
{"sheet":"Input","index":2,"n_rows":71,"n_cols":31,"rows_kept":71,"cut":false,"hidden":false,"merged":[[36,0,36,1],[5,0,35,0],[5,30,35,30],[5,29,35,29],[0,9,1,15],[0,0,1,1],[0,2,1,8]]}
[2022,null,"مدخلات شهر",null,null,null,null,null,null,"ديسمبر"]
[]
["الاسم",{"$f":"IFERROR(VLOOKUP(A6,'قائمة الموظفين'!A:C,2,0),\"\")","v":"يسرى موافى"},"اجمالى  المستحق",null,{"$f":"H4+M4+N4+O4+P4+Q4+T4+U4+V4+W4+X4+Y4+Z4+AA4","v":-683.5380497685195},"الصافى ",{"$f":"E3+E4","v":-724.74638310185287},null,null,null,{"$f":"IFERROR(#REF!*VLOOKUP($A6,'قائمة الموظفين'!$A$3:$V$500,7,0),\"\")","v":""},{"$f":"IF(K37=0,0,IF(K37=1,0.25,IF(K37=2,0.75,IF(K37=3,1.75,K37-2+0.75))))","v":8.75},null,null,null,null,null,null,null,null,null,null,null,null,null,null,null,"القرض المتبقى"]
["الوظيفه",{"$f":"IFERROR(VLOOKUP(A6,'قائمة الموظفين'!A1:C1048575,3,0),\"\")","v":"فنى "},"اجمالى الاستقطاعات",null,{"$f":"K4+L4+R4+S4+AB4+AC37+AD37+AE37","v":-41.208333333333321},null,null,{"$f":"IFERROR($H37*VLOOKUP($A6,'قائمة الموظفين'!$A$3:$V$500,8,0),\"\")","v":3501.2297453703704},null,{"$f":"J37","v":-172.36805555555557},{"$f":"IF(OR(K37=0,K37=1),0,IF(K37=2,0.25,IF(K37=3,0.75,K37-3+0.75)))","v":7.75},{"$f":"IFERROR($L37*VLOOKUP($A6,'قائمة الموظفين'!$A$3:$X$500,8,0),\"\")","v":-48.958333333333321},{"$f":"IFERROR($M37*VLOOKUP($A6,'قائمة الموظفين'!$A$3:$X$500,9,0),\"\")","v":-4606.4344618055566},{"$f":"IFERROR($N37*VLOOKUP($A6,'قائمة الموظفين'!$A$3:$X$500,10,0),\"\")","v":0},{"$f":"IFERROR($O37*VLOOKUP($A6,'قائمة الموظفين'!$A$3:$X$500,11,0),\"\")","v":0},{"$f":"IFERROR($P37*VLOOKUP($A6,'قائمة الموظفين'!$A$3:$X$500,7,0),\"\")","v":0},{"$f":"IFERROR($Q37*VLOOKUP($A6,'قائمة الموظفين'!$A$3:$X$500,7,0),\"\")","v":0},{"$f":"IFERROR(-$R37*VLOOKUP($A6,'قائمة الموظفين'!$A$3:$X$500,7,0),\"\")","v":0},{"$f":"IFERROR(-$S37*2*VLOOKUP($A6,'قائمة الموظفين'!$A$3:$X$500,7,0),\"\")","v":0},{"$f":"T37","v":0},238.33333333333329,128.33333333333334,0,18.333333333333332,0,{"$f":"Z37","v":36.666666666666664},{"$f":"IFERROR(AA37*VLOOKUP($A6,'قائمة الموظفين'!$A$3:$X$500,7,0),\"\")","v":0},{"$f":"IFERROR(-AB37*VLOOKUP($A6,'قائمة الموظفين'!$A$3:$X$500,7,0),\"\")","v":0},{"$f":"IFERROR(VLOOKUP($A6,'قائمة الموظفين'!$A$3:$X$500,20,0),\"\")","v":-9000},{"$f":"IFERROR(VLOOKUP($A6,'قائمة الموظفين'!$A$3:$X$500,23,0),\"\")","v":-140},{"$f":"IFERROR(VLOOKUP($A6,'قائمة الموظفين'!$A$3:$X$500,24,0),\"\")","v":-100}]
["الكود","اليوم","التــــــــــــاريخ","اذن تأخير ","الحضور","الانصراف","عدد الساعات ","الفعلى","عدد الاضافى","التأخير\nساعات","عدد\nالتأخيرات","الفاقد","اضافى 1","اضافى2","عطلات","اعتيادى 21","عارضه 6","غياب باذن","غياب بدون اذن","بدل اغتراب ","بدل مواصلات","بدل وجبه","بدل غلاء معيشه","بدل موبايل","بدل ملبس","بدل طبيعة عمل","مكافات","جزاء","قرض","ت اجتماعى","ت طبى خاص"]
[230014,{"$f":"C6","v":"2022-12-01"},{"$f":"IF(MONTH(DATE($A$1,VLOOKUP($J$1,الرئيسية!$Z$4:$AA$15,2,0),ROWS($A$1:A1)))>VLOOKUP($J$1,الرئيسية!$Z$4:$AA$15,2,0),\"\",DATE($A$1,VLOOKUP($J$1,الرئيسية!$Z$4:$AA$15,2,0),ROWS($A$1:A1)))","v":"2022-12-01"},null,{"$f":"IFERROR(INDEX('مواعيد البصمه'!$F$3:$F$1000,MATCH(1,INDEX(($A$6='مواعيد البصمه'!$A$3:$A$1000)*(C6='مواعيد البصمه'!$D$3:$D$1000),0,1),0)),\"\")","v":8.5500000000000007},{"$f":"IFERROR(INDEX('مواعيد البصمه'!$G$3:$G$1000,MATCH(1,INDEX(($A$6='مواعيد البصمه'!$A$3:$A$1000)*(C6='مواعيد البصمه'!$D$3:$D$1000),0,1),0)),\"\")","v":12.3},{"$f":"IFERROR($F6-E6,\"\")","v":3.75},{"$f":"IFERROR(IF($E6=9.25,G6+0.25,F6-E6),\"\")","v":3.75},{"$f":"IFERROR(IF($F6>17,$F6-17,0),\"\")","v":0},{"$f":"IFERROR(IF($E6>9.25,E6-9,0),\"\")","v":0},{"$f":"IFERROR(IF(D6=\"اذن تاخير\",0,IF($J6>0,1,0)),\"\")","v":0},{"$f":"IFERROR(IF(F6>=17,0,IF(F6=0,0,F6-17)),\"\")","v":-4.6999999999999993},{"$f":"IFERROR(IF($I6>3,3,I6),\"\")","v":0},{"$f":"IFERROR(P3SI(I6>3,I6-3,0),\"\")","v":""},null,null,null,null,null,{"$f":"IF($G6>=1,VLOOKUP($A$6,'قائمة الموظفين'!$A$3:$V$500,13,0)/30,0)","v":0},{"$f":"IF($G6>=1,VLOOKUP($A$6,'قائمة الموظفين'!$A$3:$V$500,14,0)/30,0)","v":21.666666666666668},{"$f":"IF($G6>=1,VLOOKUP($A$6,'قائمة الموظفين'!$A$3:$V$500,15,0)/30,0)","v":11.666666666666666},{"$f":"IF($G6>=1,VLOOKUP($A$6,'قائمة الموظفين'!$A$3:$V$500,16,0)/30,0)","v":0},{"$f":"IF($G6>=1,VLOOKUP($A$6,'قائمة الموظفين'!$A$3:$V$500,17,0)/30,0)","v":1.6666666666666667},{"$f":"IF($G6>=1,VLOOKUP($A$6,'قائمة الموظفين'!$A$3:$V$500,18,0)/30,0)","v":0},{"$f":"IF($G6>=1,VLOOKUP($A$6,'قائمة الموظفين'!$A$3:$V$500,19,0)/30,0)","v":3.3333333333333335}]
[null,{"$f":"C7","v":"2022-12-02"},{"$f":"IF(MONTH(DATE($A$1,VLOOKUP($J$1,الرئيسية!$Z$4:$AA$15,2,0),ROWS($A$1:A2)))>VLOOKUP($J$1,الرئيسية!$Z$4:$AA$15,2,0),\"\",DATE($A$1,VLOOKUP($J$1,الرئيسية!$Z$4:$AA$15,2,0),ROWS($A$1:A2)))","v":"2022-12-02"},null,{"$f":"IFERROR(INDEX('مواعيد البصمه'!$F$3:$F$1000,MATCH(1,INDEX(($A$6='مواعيد البصمه'!$A$3:$A$1000)*(C7='مواعيد البصمه'!$D$3:$D$1000),0,1),0)),\"\")","v":""},{"$f":"IFERROR(INDEX('مواعيد البصمه'!$G$3:$G$1000,MATCH(1,INDEX(($A$6='مواعيد البصمه'!$A$3:$A$1000)*(C7='مواعيد البصمه'!$D$3:$D$1000),0,1),0)),\"\")","v":""},{"$f":"IFERROR($F7-E7,\"\")","v":""},{"$f":"IFERROR(IF($E7=9.25,G7+0.25,F7-E7),\"\")","v":""},{"$f":"IFERROR(IF($F7>17,$F7-17,0),\"\")","v":""},{"$f":"IFERROR(IF($E7>9.25,E7-9,0),\"\")","v":""},{"$f":"IFERROR(IF(D7=\"اذن تاخير\",0,IF($J7>0,1,0)),\"\")","v":1},{"$f":"IFERROR(IF(F7>=17,0,IF(F7=0,0,F7-17)),\"\")","v":0},{"$f":"IFERROR(IF($I7>3,3,I7),\"\")","v":3},{"$f":"IFERROR(P3SI(I7>3,I7-3,0),\"\")","v":""},null,null,null,null,null,{"$f":"IF($G7>=1,VLOOKUP($A$6,'قائمة الموظفين'!$A$3:$V$500,13,0)/30,0)","v":0},{"$f":"IF($G7>=1,VLOOKUP($A$6,'قائمة الموظفين'!$A$3:$V$500,14,0)/30,0)","v":21.666666666666668},{"$f":"IF($G7>=1,VLOOKUP($A$6,'قائمة الموظفين'!$A$3:$V$500,15,0)/30,0)","v":11.666666666666666},{"$f":"IF($G7>=1,VLOOKUP($A$6,'قائمة الموظفين'!$A$3:$V$500,16,0)/30,0)","v":0},{"$f":"IF($G7>=1,VLOOKUP($A$6,'قائمة الموظفين'!$A$3:$V$500,17,0)/30,0)","v":1.6666666666666667},{"$f":"IF($G7>=1,VLOOKUP($A$6,'قائمة الموظفين'!$A$3:$V$500,18,0)/30,0)","v":0},{"$f":"IF($G7>=1,VLOOKUP($A$6,'قائمة الموظفين'!$A$3:$V$500,19,0)/30,0)","v":3.3333333333333335}]
[null,"2022-12-03",{"$f":"IF(MONTH(DATE($A$1,VLOOKUP($J$1,الرئيسية!$Z$4:$AA$15,2,0),ROWS($A$1:A3)))>VLOOKUP($J$1,الرئيسية!$Z$4:$AA$15,2,0),\"\",DATE($A$1,VLOOKUP($J$1,الرئيسية!$Z$4:$AA$15,2,0),ROWS($A$1:A3)))","v":"2022-12-03"},null,{"$f":"IFERROR(INDEX('مواعيد البصمه'!$F$3:$F$1000,MATCH(1,INDEX(($A$6='مواعيد البصمه'!$A$3:$A$1000)*(C8='مواعيد البصمه'!$D$3:$D$1000),0,1),0)),\"\")","v":"08:49"},{"$f":"IFERROR(INDEX('مواعيد البصمه'!$G$3:$G$1000,MATCH(1,INDEX(($A$6='مواعيد البصمه'!$A$3:$A$1000)*(C8='مواعيد البصمه'!$D$3:$D$1000),0,1),0)),\"\")","v":"17:24"},0.3576388888888889,0.3576388888888889,-16.274999999999999,-8.6326388888888896,0,0,-16.274999999999999,{"$f":"IFERROR(P3SI(I8>3,I8-3,0),\"\")","v":""},null,null,null,null,null,{"$f":"IF($G8>=1,VLOOKUP($A$6,'قائمة الموظفين'!$A$3:$V$500,13,0)/30,0)","v":0},{"$f":"IF($G8>=1,VLOOKUP($A$6,'قائمة الموظفين'!$A$3:$V$500,14,0)/30,0)","v":0},{"$f":"IF($G8>=1,VLOOKUP($A$6,'قائمة الموظفين'!$A$3:$V$500,15,0)/30,0)","v":0},{"$f":"IF($G8>=1,VLOOKUP($A$6,'قائمة الموظفين'!$A$3:$V$500,16,0)/30,0)","v":0},{"$f":"IF($G8>=1,VLOOKUP($A$6,'قائمة الموظفين'!$A$3:$V$500,17,0)/30,0)","v":0},{"$f":"IF($G8>=1,VLOOKUP($A$6,'قائمة الموظفين'!$A$3:$V$500,18,0)/30,0)","v":0},{"$f":"IF($G8>=1,VLOOKUP($A$6,'قائمة الموظفين'!$A$3:$V$500,19,0)/30,0)","v":0}]
{"$rows_left_out":64}
{"sheet":"مواعيد البصمه","index":3,"n_rows":86,"n_cols":9,"rows_kept":86,"cut":false,"hidden":false,"merged":[]}
["First & Last"]
["Employee ID","First Name","Department","Date","Weekday","First Punch","Last Punch","Total Time","HELPER COLUMN"]
[230012,"Ahmedemam","Showrooms","2022-12-01","Thursday","08:51","13:54","05:03","230012#2022-12-01"]
[230012,"Ahmedemam","Showrooms","2022-12-03","Saturday","08:49","17:24","08:34","230012#2022-12-03"]
[230012,"Ahmedemam","Showrooms","2022-12-04","Sunday","09:10","19:09","09:59","230012#2022-12-04"]
[230012,"Ahmedemam","Showrooms","2022-12-05","Monday","08:13","18:42","10:29","230012#2022-12-05"]
[230012,"Ahmedemam","Showrooms","2022-12-06","Tuesday","09:08","09:08","00:00","230012#2022-12-06"]
[230012,"Ahmedemam","Showrooms","2022-12-10","Saturday","09:13","17:07","07:54","230012#2022-12-10"]
{"$rows_left_out":79}
{"sheet":"Data","index":4,"n_rows":32,"n_cols":11,"rows_kept":32,"cut":false,"hidden":false,"merged":[[0,8,0,10]]}
["م","الحافز","الوظيفه","الراتب الاساسى","التامينات","الكود","الاسم","الوظيفه","التاخيرات "]
[1,3000,"مدير ادارى",5000,"يخصم",null,null,null,1,"سماح",0]
[2,2000,"رئيس قسم ",4000,"لا يخصم",100001,"احمد امام","رئيس قسم ",2,"ربع يوم",0.25]
[3,1500,"فنى ",3500,null,100002,"احمد السيد","امين مخزن ",3,"نصف يوم",0.5]
[4,1200,"مساعد فنى ",3000,null,100003,"يسرى موافى","فنى ",4,"يوم",{"$f":"1+K4+K3","v":1.75}]
[5,1000,"عامل ",2800,null,100004,"صالح محمد ","عامل ",5,"يوم",{"$f":"1+K5","v":2.75}]
[6,1500,"امين مخزن ",3400,null,100005,"مراد الشافعى ","عامل ",6,"يوم",{"$f":"1+K6","v":3.75}]
[7,1100,"مساعد امين مخزن ",3000,null,100006,"محمد على ","مدير ادارى",7,"يوم",{"$f":"1+K7","v":4.75}]
{"$rows_left_out":25}
{"sheet":"يناير","index":5,"n_rows":140,"n_cols":31,"rows_kept":140,"cut":false,"hidden":false,"merged":[]}
["الكود","اليوم","التــــــــــــاريخ",null,"الحضور","الانصراف","عدد الساعات ","الفعلى","عدد الاضافى","التأخير\nساعات","عدد\nالتأخيرات","الفاقد","اضافى 1","اضافى2","عطلات","اعتيادى 21","عارضه 6","غياب باذن","غياب بدون اذن","بدل اغتراب ","بدل مواصلات","بدل وجبه","بدل غلاء معيشه","بدل موبايل","بدل ملبس","بدل طبيعة عمل","مكافات","جزاء","قرض","ت اجتماعى","ت طبى خاص"]
["الاسم","احمد امام","اجمالى  المستحق",null,430,"الصافى ",134.5,null,null,null,"",1.75,null,null,null,null,null,null,null,null,null,null,null,null,null,null,null,"القرض المتبقى",12000]
["الوظيفه","مدير ادارى","اجمالى الاستقطاعات",null,-295.5,null,null,300,null,5,0.75,-56.25,0,0,0,0,0,0,0,10,60,25,15,10,5,5,0,0,12000,-140,-100]
["الكود","اليوم","التــــــــــــاريخ","اذن تأخير ","الحضور","الانصراف","عدد الساعات ","الفعلى","عدد الاضافى","التأخير\nساعات","عدد\nالتأخيرات","الفاقد","اضافى 1","اضافى2","عطلات","اعتيادى 21","عارضه 6","غياب باذن","غياب بدون اذن","بدل اغتراب ","بدل مواصلات","بدل وجبه","بدل غلاء معيشه","بدل موبايل","بدل ملبس","بدل طبيعة عمل","مكافات","جزاء","قرض","ت اجتماعى","ت طبى خاص"]
[100001,"2023-01-01","2023-01-01",null,10,14,4,4,0,1,1,-3,0,0,null,null,null,null,null,3.3333333333333335,20,8.3333333333333339,5,3.3333333333333335,1.6666666666666667,1.6666666666666667,null,null,null,"يخصم","يخصم"]
[null,"2023-01-02","2023-01-02",null,11,17,6,6,0,2,1,0,0,0,null,null,null,null,null,3.3333333333333335,20,8.3333333333333339,5,3.3333333333333335,1.6666666666666667,1.6666666666666667]
[null,"2023-01-03","2023-01-03",null,11,17,6,6,0,2,1,0,0,0,null,null,null,null,null,3.3333333333333335,20,8.3333333333333339,5,3.3333333333333335,1.6666666666666667,1.6666666666666667]
[null,"2023-01-04","2023-01-04",null,null,null,0,0,0,0,0,0,0,0,null,null,null,null,null,0,0,0,0,0,0,0]
{"$rows_left_out":133}
{"sheet":"فبراير","index":6,"n_rows":105,"n_cols":31,"rows_kept":105,"cut":false,"hidden":false,"merged":[]}
["الكود","اليوم","التــــــــــــاريخ","الحضور","الانصراف","عدد الساعات ","الفعلى","عدد الاضافى","التأخير\nساعات","عدد\nالتأخيرات","الفاقد","اضافى 1","اضافى2","عطلات","اعتيادى 21","عارضه 6","غياب باذن","غياب بدون اذن","بدل اغتراب ","بدل مواصلات","بدل وجبه","بدل غلاء معيشه","بدل موبايل","بدل ملبس","بدل طبيعة عمل","مكافات","جزاء","قرض","ت اجتماعى","ت طبى خاص"]
["الاسم","احمد امام","اجمالى  المستحق",null,1895.8333333333333,"الصافى ",1370.8333333333333,null,null,0.25,37.5,0.75,null,null,null,null,null,null,null,null,null,null,null,null,null,null,null,"القرض المتبقى",12000]
["الوظيفه","مدير ادارى","اجمالى الاستقطاعات",null,-525,null,null,1256.25,null,7,0.25,-112.5,56.25,0,0,0,0,-150,-300,33.333333333333329,200,83.333333333333329,50,33.333333333333329,16.666666666666664,16.666666666666664,150,0,12000,-140,-100]
["الكود","اليوم","التــــــــــــاريخ","اذن تأخير ","الحضور","الانصراف","عدد الساعات ","الفعلى","عدد الاضافى","التأخير\nساعات","عدد\nالتأخيرات","الفاقد","اضافى 1","اضافى2","عطلات","اعتيادى 21","عارضه 6","غياب باذن","غياب بدون اذن","بدل اغتراب ","بدل مواصلات","بدل وجبه","بدل غلاء معيشه","بدل موبايل","بدل ملبس","بدل طبيعة عمل","مكافات","جزاء","قرض","ت اجتماعى","ت طبى خاص"]
[100001,"2023-02-01","2023-02-01",null,9,17,8,8,0,0,0,0,0,0,null,null,null,null,null,3.3333333333333335,20,8.3333333333333339,5,3.3333333333333335,1.6666666666666667,1.6666666666666667]
[null,"2023-02-02","2023-02-02",null,10,18,8,8,1,1,1,0,1,0,null,null,null,null,null,3.3333333333333335,20,8.3333333333333339,5,3.3333333333333335,1.6666666666666667,1.6666666666666667]
[null,"2023-02-03","2023-02-03","اذن تاخير",11,18,7,7,1,2,0,0,1,0,null,null,null,null,null,3.3333333333333335,20,8.3333333333333339,5,3.3333333333333335,1.6666666666666667,1.6666666666666667]
[null,"2023-02-04","2023-02-04","اذن تاخير",10,17,7,7,0,1,0,0,0,0,null,null,null,null,null,3.3333333333333335,20,8.3333333333333339,5,3.3333333333333335,1.6666666666666667,1.6666666666666667]
{"$rows_left_out":98}
{"sheet":"مارس","index":7,"n_rows":1,"n_cols":30,"rows_kept":1,"cut":false,"hidden":false,"merged":[]}
["الكود","اليوم","التــــــــــــاريخ","الحضور","الانصراف","عدد الساعات ","الفعلى","عدد الاضافى","التأخير\nساعات","عدد\nالتأخيرات","الفاقد","اضافى 1","اضافى2","عطلات","اعتيادى 21","عارضه 6","غياب باذن","غياب بدون اذن","بدل اغتراب ","بدل مواصلات","بدل وجبه","بدل غلاء معيشه","بدل موبايل","بدل ملبس","بدل طبيعة عمل","مكافات","جزاء","قرض","ت اجتماعى","ت طبى خاص"]

{"sheet":"ابريل","index":8,"n_rows":1,"n_cols":30,"rows_kept":1,"cut":false,"hidden":false,"merged":[]}
["الكود","اليوم","التــــــــــــاريخ","الحضور","الانصراف","عدد الساعات ","الفعلى","عدد الاضافى","التأخير\nساعات","عدد\nالتأخيرات","الفاقد","اضافى 1","اضافى2","عطلات","اعتيادى 21","عارضه 6","غياب باذن","غياب بدون اذن","بدل اغتراب ","بدل مواصلات","بدل وجبه","بدل غلاء معيشه","بدل موبايل","بدل ملبس","بدل طبيعة عمل","مكافات","جزاء","قرض","ت اجتماعى","ت طبى خاص"]

{"sheet":"مايو","index":9,"n_rows":1,"n_cols":30,"rows_kept":1,"cut":false,"hidden":false,"merged":[]}
["الكود","اليوم","التــــــــــــاريخ","الحضور","الانصراف","عدد الساعات ","الفعلى","عدد الاضافى","التأخير\nساعات","عدد\nالتأخيرات","الفاقد","اضافى 1","اضافى2","عطلات","اعتيادى 21","عارضه 6","غياب باذن","غياب بدون اذن","بدل اغتراب ","بدل مواصلات","بدل وجبه","بدل غلاء معيشه","بدل موبايل","بدل ملبس","بدل طبيعة عمل","مكافات","جزاء","قرض","ت اجتماعى","ت طبى خاص"]

{"sheet":"يونيو","index":10,"n_rows":1,"n_cols":30,"rows_kept":1,"cut":false,"hidden":false,"merged":[]}
["الكود","اليوم","التــــــــــــاريخ","الحضور","الانصراف","عدد الساعات ","الفعلى","عدد الاضافى","التأخير\nساعات","عدد\nالتأخيرات","الفاقد","اضافى 1","اضافى2","عطلات","اعتيادى 21","عارضه 6","غياب باذن","غياب بدون اذن","بدل اغتراب ","بدل مواصلات","بدل وجبه","بدل غلاء معيشه","بدل موبايل","بدل ملبس","بدل طبيعة عمل","مكافات","جزاء","قرض","ت اجتماعى","ت طبى خاص"]

{"sheet":"يوليو","index":11,"n_rows":33,"n_cols":30,"rows_kept":33,"cut":false,"hidden":false,"merged":[]}
["الكود","اليوم","التــــــــــــاريخ","الحضور","الانصراف","عدد الساعات ","الفعلى","عدد الاضافى","التأخير\nساعات","عدد\nالتأخيرات","الفاقد","اضافى 1","اضافى2","عطلات","اعتيادى 21","عارضه 6","غياب باذن","غياب بدون اذن","بدل اغتراب ","بدل مواصلات","بدل وجبه","بدل غلاء معيشه","بدل موبايل","بدل ملبس","بدل طبيعة عمل","مكافات","جزاء","قرض","ت اجتماعى","ت طبى خاص"]
[]
[]
[]
[]
[]
[]
[]
{"$rows_left_out":26}
{"sheet":"اغسطس","index":12,"n_rows":1,"n_cols":30,"rows_kept":1,"cut":false,"hidden":false,"merged":[]}
["الكود","اليوم","التــــــــــــاريخ","الحضور","الانصراف","عدد الساعات ","الفعلى","عدد الاضافى","التأخير\nساعات","عدد\nالتأخيرات","الفاقد","اضافى 1","اضافى2","عطلات","اعتيادى 21","عارضه 6","غياب باذن","غياب بدون اذن","بدل اغتراب ","بدل مواصلات","بدل وجبه","بدل غلاء معيشه","بدل موبايل","بدل ملبس","بدل طبيعة عمل","مكافات","جزاء","قرض","ت اجتماعى","ت طبى خاص"]

{"sheet":"سبتمبر","index":13,"n_rows":1,"n_cols":30,"rows_kept":1,"cut":false,"hidden":false,"merged":[]}
["الكود","اليوم","التــــــــــــاريخ","الحضور","الانصراف","عدد الساعات ","الفعلى","عدد الاضافى","التأخير\nساعات","عدد\nالتأخيرات","الفاقد","اضافى 1","اضافى2","عطلات","اعتيادى 21","عارضه 6","غياب باذن","غياب بدون اذن","بدل اغتراب ","بدل مواصلات","بدل وجبه","بدل غلاء معيشه","بدل موبايل","بدل ملبس","بدل طبيعة عمل","مكافات","جزاء","قرض","ت اجتماعى","ت طبى خاص"]

{"sheet":"اكتوبر","index":14,"n_rows":1,"n_cols":30,"rows_kept":1,"cut":false,"hidden":false,"merged":[]}
["الكود","اليوم","التــــــــــــاريخ","الحضور","الانصراف","عدد الساعات ","الفعلى","عدد الاضافى","التأخير\nساعات","عدد\nالتأخيرات","الفاقد","اضافى 1","اضافى2","عطلات","اعتيادى 21","عارضه 6","غياب باذن","غياب بدون اذن","بدل اغتراب ","بدل مواصلات","بدل وجبه","بدل غلاء معيشه","بدل موبايل","بدل ملبس","بدل طبيعة عمل","مكافات","جزاء","قرض","ت اجتماعى","ت طبى خاص"]

{"sheet":"نوفمبر","index":15,"n_rows":1,"n_cols":30,"rows_kept":1,"cut":false,"hidden":false,"merged":[]}
["الكود","اليوم","التــــــــــــاريخ","الحضور","الانصراف","عدد الساعات ","الفعلى","عدد الاضافى","التأخير\nساعات","عدد\nالتأخيرات","الفاقد","اضافى 1","اضافى2","عطلات","اعتيادى 21","عارضه 6","غياب باذن","غياب بدون اذن","بدل اغتراب ","بدل مواصلات","بدل وجبه","بدل غلاء معيشه","بدل موبايل","بدل ملبس","بدل طبيعة عمل","مكافات","جزاء","قرض","ت اجتماعى","ت طبى خاص"]

{"sheet":"ديسمبر","index":16,"n_rows":595,"n_cols":31,"rows_kept":595,"cut":false,"hidden":false,"merged":[]}
["الكود","اليوم","التــــــــــــاريخ","الحضور","الانصراف","عدد الساعات ","الفعلى","عدد الاضافى","التأخير\nساعات","عدد\nالتأخيرات","الفاقد","اضافى 1","اضافى2","عطلات","اعتيادى 21","عارضه 6","غياب باذن","غياب بدون اذن","بدل اغتراب ","بدل مواصلات","بدل وجبه","بدل غلاء معيشه","بدل موبايل","بدل ملبس","بدل طبيعة عمل","مكافات","جزاء","قرض","ت اجتماعى","ت طبى خاص"]
["الاسم","احمد امام","اجمالى  المستحق",null,{"$error":"#VALUE!"},"الصافى ",{"$error":"#VALUE!"},null,null,null,"",{"$error":"#NAME?"},null,null,null,null,null,null,null,null,null,null,null,null,null,null,null,"القرض المتبقى"]
["الوظيفه","مدير ادارى","اجمالى الاستقطاعات",null,{"$error":"#NAME?"},null,null,"",null,{"$error":"#NAME?"},{"$error":"#NAME?"},0,0,0,0,0,0,0,0,{"$error":"#NAME?"},{"$error":"#NAME?"},{"$error":"#NAME?"},{"$error":"#NAME?"},{"$error":"#NAME?"},{"$error":"#NAME?"},{"$error":"#NAME?"},0,0,12000,-140,-100]
["الكود","اليوم","التــــــــــــاريخ","اذن تأخير ","الحضور","الانصراف","عدد الساعات ","الفعلى","عدد الاضافى","التأخير\nساعات","عدد\nالتأخيرات","الفاقد","اضافى 1","اضافى2","عطلات","اعتيادى 21","عارضه 6","غياب باذن","غياب بدون اذن","بدل اغتراب ","بدل مواصلات","بدل وجبه","بدل غلاء معيشه","بدل موبايل","بدل ملبس","بدل طبيعة عمل","مكافات","جزاء","قرض","ت اجتماعى","ت طبى خاص"]
[230012,"2022-12-01","2022-12-01",null,{"$error":"#NAME?"},null,{"$error":"#NAME?"},{"$error":"#NAME?"},0,{"$error":"#NAME?"},{"$error":"#NAME?"},0,0,0,null,null,null,null,null,{"$error":"#NAME?"},{"$error":"#NAME?"},{"$error":"#NAME?"},{"$error":"#NAME?"},{"$error":"#NAME?"},{"$error":"#NAME?"},{"$error":"#NAME?"}]
[null,"2022-12-02","2022-12-02",null,null,null,0,0,0,0,0,0,0,0,null,null,null,null,null,0,0,0,0,0,0,0]
[null,"2022-12-03","2022-12-03","اذن تاخير",null,null,0,0,0,0,0,0,0,0,null,null,null,null,null,0,0,0,0,0,0,0]
[null,"2022-12-04","2022-12-04",null,null,null,0,0,0,0,0,0,0,0,null,null,null,null,null,0,0,0,0,0,0,0]
{"$rows_left_out":587}