{"text_format":"1","workbook":"xlsx","n_sheets":7,"sheets":["مكتب ","قائمة ","1","2","3","4","5"],"not_rendered":{"charts":0,"images":1,"macros":1,"external_links":0,"defined_names":1,"comments":0,"pivot_tables":0},"unopened":[],"bounds":{"document_bytes":16777216,"sheet_cells":100000,"rows_first":2000,"rows_last":500,"rows_between":2000,"halvings":0,"cell_chars":16384,"cell_head_chars":4096},"cells_cut":0,"cells_raw":0,"read":"whole","date_system":"1900"}

{"sheet":"مكتب ","index":0,"n_rows":216,"n_cols":16,"rows_kept":216,"cut":false,"hidden":false,"merged":[[16,0,17,1],[16,2,17,2],[9,5,9,7],[14,0,15,1],[14,2,15,2],[0,1,2,3],[12,0,13,1],[9,0,9,1],[5,0,5,1],[12,2,13,2],[11,0,11,1]]}
[null,null,null,null,null,null,null,null,null,null,null,"التحقق ",null,"الاسم "]
[null,null,null,null,null,null,null,null,null,{"$f":"OFFSET($P$2,,,COUNTIF($P$2:P96,\"?*\"))","v":{"$error":"#REF!"}},null,null,{"$f":"IF(ISNUMBER(SEARCH($C$6,#REF!)),MAX($M$1:M1)+1,0)","v":0},null,{"$f":"#REF!","v":{"$error":"#REF!"}},{"$f":"IFERROR(VLOOKUP(ROWS($P$2:P2),$M:$O,3,0),\"\")","v":""}]
[null,null,null,null,null,null,null,null,null,null,null,null,{"$f":"IF(ISNUMBER(SEARCH($C$6,#REF!)),MAX($M$1:M2)+1,0)","v":0},null,{"$f":"#REF!","v":{"$error":"#REF!"}},{"$f":"IFERROR(VLOOKUP(ROWS($P$2:P3),$M:$O,3,0),\"\")","v":""}]
[null,null,null,null,null,null,null,null,null,null,null,null,{"$f":"IF(ISNUMBER(SEARCH($C$6,#REF!)),MAX($M$1:M3)+1,0)","v":0},null,{"$f":"#REF!","v":{"$error":"#REF!"}},{"$f":"IFERROR(VLOOKUP(ROWS($P$2:P4),$M:$O,3,0),\"\")","v":""}]
[null,null,null,null,null,null,null,null,null,null,null,null,{"$f":"IF(ISNUMBER(SEARCH($C$6,#REF!)),MAX($M$1:M4)+1,0)","v":0},null,{"$f":"#REF!","v":{"$error":"#REF!"}},{"$f":"IFERROR(VLOOKUP(ROWS($P$2:P5),$M:$O,3,0),\"\")","v":""}]
[]
[null,null,null,null,null,null,null,null,null,null,null,null,{"$f":"IF(ISNUMBER(SEARCH($C$6,#REF!)),MAX($M$1:M6)+1,0)","v":0},null,{"$f":"#REF!","v":{"$error":"#REF!"}},{"$f":"IFERROR(VLOOKUP(ROWS($P$2:P7),$M:$O,3,0),\"\")","v":""}]
[null,null,null,null,null,null,null,null,null,null,null,null,{"$f":"IF(ISNUMBER(SEARCH($C$6,#REF!)),MAX($M$1:M7)+1,0)","v":0},null,{"$f":"#REF!","v":{"$error":"#REF!"}},{"$f":"IFERROR(VLOOKUP(ROWS($P$2:P8),$M:$O,3,0),\"\")","v":""}]
[null,null,null,null,null,null,null,null,null,null,null,null,{"$f":"IF(ISNUMBER(SEARCH($C$6,#REF!)),MAX($M$1:M8)+1,0)","v":0},null,{"$f":"#REF!","v":{"$error":"#REF!"}},{"$f":"IFERROR(VLOOKUP(ROWS($P$2:P9),$M:$O,3,0),\"\")","v":""}]
[null,null,null,null,null,null,null,null,null,null,null,null,{"$f":"IF(ISNUMBER(SEARCH($C$6,#REF!)),MAX($M$1:M9)+1,0)","v":0},null,{"$f":"#REF!","v":{"$error":"#REF!"}},{"$f":"IFERROR(VLOOKUP(ROWS($P$2:P10),$M:$O,3,0),\"\")","v":""}]
[]
["الطالب ",null,"قاسم "]
["رقم الجوال ",null,null,null,null,null,null,null,null,null,null,null,{"$f":"IF(ISNUMBER(SEARCH($C$6,#REF!)),MAX($M$1:M12)+1,0)","v":0},null,{"$f":"#REF!","v":{"$error":"#REF!"}},{"$f":"IFERROR(VLOOKUP(ROWS($P$2:P13),$M:$O,3,0),\"\")","v":""}]
[null,null,null,null,null,null,null,null,null,null,null,null,{"$f":"IF(ISNUMBER(SEARCH($C$6,#REF!)),MAX($M$1:M13)+1,0)","v":0},null,{"$f":"#REF!","v":{"$error":"#REF!"}},{"$f":"IFERROR(VLOOKUP(ROWS($P$2:P14),$M:$O,3,0),\"\")","v":""}]
["الهوية ",null,null,null,null,null,null,null,null,null,null,null,{"$f":"IF(ISNUMBER(SEARCH($C$6,#REF!)),MAX($M$1:M14)+1,0)","v":0},null,{"$f":"#REF!","v":{"$error":"#REF!"}},{"$f":"IFERROR(VLOOKUP(ROWS($P$2:P15),$M:$O,3,0),\"\")","v":""}]
[]
["الرقم ",null,{"$f":"IFERROR(VLOOKUP(C12,'قائمة '!1:1048576,2,0),\"\")","v":4}]
[null,null,null,null,null,null,null,null,null,null,null,null,{"$f":"IF(ISNUMBER(SEARCH($C$6,#REF!)),MAX($M$1:M17)+1,0)","v":0},null,{"$f":"#REF!","v":{"$error":"#REF!"}},{"$f":"IFERROR(VLOOKUP(ROWS($P$2:P18),$M:$O,3,0),\"\")","v":""}]
[null,null,null,null,null,null,null,null,null,null,null,null,{"$f":"IF(ISNUMBER(SEARCH($C$6,#REF!)),MAX($M$1:M18)+1,0)","v":0},null,{"$f":"#REF!","v":{"$error":"#REF!"}},{"$f":"IFERROR(VLOOKUP(ROWS($P$2:P19),$M:$O,3,0),\"\")","v":""}]
[null,null,null,null,null,null,null,null,null,null,null,null,{"$f":"IF(ISNUMBER(SEARCH($C$6,#REF!)),MAX($M$1:M19)+1,0)","v":0},null,{"$f":"#REF!","v":{"$error":"#REF!"}},{"$f":"IFERROR(VLOOKUP(ROWS($P$2:P20),$M:$O,3,0),\"\")","v":""}]
[null,null,null,null,null,null,null,null,null,null,null,null,{"$f":"IF(ISNUMBER(SEARCH($C$6,#REF!)),MAX($M$1:M20)+1,0)","v":0},null,{"$f":"#REF!","v":{"$error":"#REF!"}},{"$f":"IFERROR(VLOOKUP(ROWS($P$2:P21),$M:$O,3,0),\"\")","v":""}]
[null,null,null,null,null,null,null,null,null,null,null,null,{"$f":"IF(ISNUMBER(SEARCH($C$6,#REF!)),MAX($M$1:M21)+1,0)","v":0},null,{"$f":"#REF!","v":{"$error":"#REF!"}},{"$f":"IFERROR(VLOOKUP(ROWS($P$2:P22),$M:$O,3,0),\"\")","v":""}]
[null,null,null,null,null,null,null,null,null,null,null,null,{"$f":"IF(ISNUMBER(SEARCH($C$6,#REF!)),MAX($M$1:M22)+1,0)","v":0},null,{"$f":"#REF!","v":{"$error":"#REF!"}},{"$f":"IFERROR(VLOOKUP(ROWS($P$2:P23),$M:$O,3,0),\"\")","v":""}]
[null,null,null,null,null,null,null,null,null,null,null,null,{"$f":"IF(ISNUMBER(SEARCH($C$6,#REF!)),MAX($M$1:M23)+1,0)","v":0},null,{"$f":"#REF!","v":{"$error":"#REF!"}},{"$f":"IFERROR(VLOOKUP(ROWS($P$2:P24),$M:$O,3,0),\"\")","v":""}]
[null,null,null,null,null,null,null,null,null,null,null,null,{"$f":"IF(ISNUMBER(SEARCH($C$6,#REF!)),MAX($M$1:M24)+1,0)","v":0},null,{"$f":"#REF!","v":{"$error":"#REF!"}},{"$f":"IFERROR(VLOOKUP(ROWS($P$2:P25),$M:$O,3,0),\"\")","v":""}]
[null,null,null,null,null,null,null,null,null,null,null,null,{"$f":"IF(ISNUMBER(SEARCH($C$6,#REF!)),MAX($M$1:M25)+1,0)","v":0},null,{"$f":"#REF!","v":{"$error":"#REF!"}},{"$f":"IFERROR(VLOOKUP(ROWS($P$2:P26),$M:$O,3,0),\"\")","v":""}]
[null,null,null,null,null,null,null,null,null,null,null,null,{"$f":"IF(ISNUMBER(SEARCH($C$6,#REF!)),MAX($M$1:M26)+1,0)","v":0},null,{"$f":"#REF!","v":{"$error":"#REF!"}},{"$f":"IFERROR(VLOOKUP(ROWS($P$2:P27),$M:$O,3,0),\"\")","v":""}]
[null,null,null,null,null,null,null,null,null,null,null,null,{"$f":"IF(ISNUMBER(SEARCH($C$6,#REF!)),MAX($M$1:M27)+1,0)","v":0},null,{"$f":"#REF!","v":{"$error":"#REF!"}},{"$f":"IFERROR(VLOOKUP(ROWS($P$2:P28),$M:$O,3,0),\"\")","v":""}]
[null,null,null,null,null,null,null,null,null,null,null,null,{"$f":"IF(ISNUMBER(SEARCH($C$6,#REF!)),MAX($M$1:M28)+1,0)","v":0},null,{"$f":"#REF!","v":{"$error":"#REF!"}},{"$f":"IFERROR(VLOOKUP(ROWS($P$2:P29),$M:$O,3,0),\"\")","v":""}]
[null,null,null,null,null,null,null,null,null,null,null,null,{"$f":"IF(ISNUMBER(SEARCH($C$6,#REF!)),MAX($M$1:M29)+1,0)","v":0},null,{"$f":"#REF!","v":{"$error":"#REF!"}},{"$f":"IFERROR(VLOOKUP(ROWS($P$2:P30),$M:$O,3,0),\"\")","v":""}]
[null,null,null,null,null,null,null,null,null,null,null,null,{"$f":"IF(ISNUMBER(SEARCH($C$6,#REF!)),MAX($M$1:M30)+1,0)","v":0},null,{"$f":"#REF!","v":{"$error":"#REF!"}},{"$f":"IFERROR(VLOOKUP(ROWS($P$2:P31),$M:$O,3,0),\"\")","v":""}]
[null,null,null,null,null,null,null,null,null,null,null,null,{"$f":"IF(ISNUMBER(SEARCH($C$6,#REF!)),MAX($M$1:M31)+1,0)","v":0},null,{"$f":"#REF!","v":{"$error":"#REF!"}},{"$f":"IFERROR(VLOOKUP(ROWS($P$2:P32),$M:$O,3,0),\"\")","v":""}]
[null,null,null,null,null,null,null,null,null,null,null,null,{"$f":"IF(ISNUMBER(SEARCH($C$6,#REF!)),MAX($M$1:M32)+1,0)","v":0},null,{"$f":"#REF!","v":{"$error":"#REF!"}},{"$f":"IFERROR(VLOOKUP(ROWS($P$2:P33),$M:$O,3,0),\"\")","v":""}]
[null,null,null,null,null,null,null,null,null,null,null,null,{"$f":"IF(ISNUMBER(SEARCH($C$6,#REF!)),MAX($M$1:M33)+1,0)","v":0},null,{"$f":"#REF!","v":{"$error":"#REF!"}},{"$f":"IFERROR(VLOOKUP(ROWS($P$2:P34),$M:$O,3,0),\"\")","v":""}]
[null,null,null,null,null,null,null,null,null,null,null,null,{"$f":"IF(ISNUMBER(SEARCH($C$6,#REF!)),MAX($M$1:M34)+1,0)","v":0},null,{"$f":"#REF!","v":{"$error":"#REF!"}},{"$f":"IFERROR(VLOOKUP(ROWS($P$2:P35),$M:$O,3,0),\"\")","v":""}]
[null,null,null,null,null,null,null,null,null,null,null,null,{"$f":"IF(ISNUMBER(SEARCH($C$6,#REF!)),MAX($M$1:M35)+1,0)","v":0},null,{"$f":"#REF!","v":{"$error":"#REF!"}},{"$f":"IFERROR(VLOOKUP(ROWS($P$2:P36),$M:$O,3,0),\"\")","v":""}]
[null,null,null,null,null,null,null,null,null,null,null,null,{"$f":"IF(ISNUMBER(SEARCH($C$6,#REF!)),MAX($M$1:M36)+1,0)","v":0},null,{"$f":"#REF!","v":{"$error":"#REF!"}},{"$f":"IFERROR(VLOOKUP(ROWS($P$2:P37),$M:$O,3,0),\"\")","v":""}]
[null,null,null,null,null,null,null,null,null,null,null,null,{"$f":"IF(ISNUMBER(SEARCH($C$6,#REF!)),MAX($M$1:M37)+1,0)","v":0},null,{"$f":"#REF!","v":{"$error":"#REF!"}},{"$f":"IFERROR(VLOOKUP(ROWS($P$2:P38),$M:$O,3,0),\"\")","v":""}]
[null,null,null,null,null,null,null,null,null,null,null,null,{"$f":"IF(ISNUMBER(SEARCH($C$6,#REF!)),MAX($M$1:M38)+1,0)","v":0},null,{"$f":"#REF!","v":{"$error":"#REF!"}},{"$f":"IFERROR(VLOOKUP(ROWS($P$2:P39),$M:$O,3,0),\"\")","v":""}]
[null,null,null,null,null,null,null,null,null,null,null,null,{"$f":"IF(ISNUMBER(SEARCH($C$6,#REF!)),MAX($M$1:M39)+1,0)","v":0},null,{"$f":"#REF!","v":{"$error":"#REF!"}},{"$f":"IFERROR(VLOOKUP(ROWS($P$2:P40),$M:$O,3,0),\"\")","v":""}]
[null,null,null,null,null,null,null,null,null,null,null,null,{"$f":"IF(ISNUMBER(SEARCH($C$6,#REF!)),MAX($M$1:M40)+1,0)","v":0},null,{"$f":"#REF!","v":{"$error":"#REF!"}},{"$f":"IFERROR(VLOOKUP(ROWS($P$2:P41),$M:$O,3,0),\"\")","v":""}]
[null,null,null,null,null,null,null,null,null,null,null,null,{"$f":"IF(ISNUMBER(SEARCH($C$6,#REF!)),MAX($M$1:M41)+1,0)","v":0},null,{"$f":"#REF!","v":{"$error":"#REF!"}},{"$f":"IFERROR(VLOOKUP(ROWS($P$2:P42),$M:$O,3,0),\"\")","v":""}]
[null,null,null,null,null,null,null,null,null,null,null,null,{"$f":"IF(ISNUMBER(SEARCH($C$6,#REF!)),MAX($M$1:M42)+1,0)","v":0},null,{"$f":"#REF!","v":{"$error":"#REF!"}},{"$f":"IFERROR(VLOOKUP(ROWS($P$2:P43),$M:$O,3,0),\"\")","v":""}]
[null,null,null,null,null,null,null,null,null,null,null,null,{"$f":"IF(ISNUMBER(SEARCH($C$6,#REF!)),MAX($M$1:M43)+1,0)","v":0},null,{"$f":"#REF!","v":{"$error":"#REF!"}},{"$f":"IFERROR(VLOOKUP(ROWS($P$2:P44),$M:$O,3,0),\"\")","v":""}]
[null,null,null,null,null,null,null,null,null,null,null,null,{"$f":"IF(ISNUMBER(SEARCH($C$6,#REF!)),MAX($M$1:M44)+1,0)","v":0},null,{"$f":"#REF!","v":{"$error":"#REF!"}},{"$f":"IFERROR(VLOOKUP(ROWS($P$2:P45),$M:$O,3,0),\"\")","v":""}]
[null,null,null,null,null,null,null,null,null,null,null,null,{"$f":"IF(ISNUMBER(SEARCH($C$6,#REF!)),MAX($M$1:M45)+1,0)","v":0},null,{"$f":"#REF!","v":{"$error":"#REF!"}},{"$f":"IFERROR(VLOOKUP(ROWS($P$2:P46),$M:$O,3,0),\"\")","v":""}]
[null,null,null,null,null,null,null,null,null,null,null,null,{"$f":"IF(ISNUMBER(SEARCH($C$6,#REF!)),MAX($M$1:M46)+1,0)","v":0},null,{"$f":"#REF!","v":{"$error":"#REF!"}},{"$f":"IFERROR(VLOOKUP(ROWS($P$2:P47),$M:$O,3,0),\"\")","v":""}]
[null,null,null,null,null,null,null,null,null,null,null,null,{"$f":"IF(ISNUMBER(SEARCH($C$6,#REF!)),MAX($M$1:M47)+1,0)","v":0},null,{"$f":"#REF!","v":{"$error":"#REF!"}},{"$f":"IFERROR(VLOOKUP(ROWS($P$2:P48),$M:$O,3,0),\"\")","v":""}]
[null,null,null,null,null,null,null,null,null,null,null,null,{"$f":"IF(ISNUMBER(SEARCH($C$6,#REF!)),MAX($M$1:M48)+1,0)","v":0},null,{"$f":"#REF!","v":{"$error":"#REF!"}},{"$f":"IFERROR(VLOOKUP(ROWS($P$2:P49),$M:$O,3,0),\"\")","v":""}]
[null,null,null,null,null,null,null,null,null,null,null,null,{"$f":"IF(ISNUMBER(SEARCH($C$6,#REF!)),MAX($M$1:M49)+1,0)","v":0},null,{"$f":"#REF!","v":{"$error":"#REF!"}},{"$f":"IFERROR(VLOOKUP(ROWS($P$2:P50),$M:$O,3,0),\"\")","v":""}]
[null,null,null,null,null,null,null,null,null,null,null,null,{"$f":"IF(ISNUMBER(SEARCH($C$6,#REF!)),MAX($M$1:M50)+1,0)","v":0},null,{"$f":"#REF!","v":{"$error":"#REF!"}},{"$f":"IFERROR(VLOOKUP(ROWS($P$2:P51),$M:$O,3,0),\"\")","v":""}]
[null,null,null,null,null,null,null,null,null,null,null,null,{"$f":"IF(ISNUMBER(SEARCH($C$6,#REF!)),MAX($M$1:M51)+1,0)","v":0},null,{"$f":"#REF!","v":{"$error":"#REF!"}},{"$f":"IFERROR(VLOOKUP(ROWS($P$2:P52),$M:$O,3,0),\"\")","v":""}]
[null,null,null,null,null,null,null,null,null,null,null,null,{"$f":"IF(ISNUMBER(SEARCH($C$6,#REF!)),MAX($M$1:M52)+1,0)","v":0},null,{"$f":"#REF!","v":{"$error":"#REF!"}},{"$f":"IFERROR(VLOOKUP(ROWS($P$2:P53),$M:$O,3,0),\"\")","v":""}]
[null,null,null,null,null,null,null,null,null,null,null,null,{"$f":"IF(ISNUMBER(SEARCH($C$6,#REF!)),MAX($M$1:M53)+1,0)","v":0},null,{"$f":"#REF!","v":{"$error":"#REF!"}},{"$f":"IFERROR(VLOOKUP(ROWS($P$2:P54),$M:$O,3,0),\"\")","v":""}]
[null,null,null,null,null,null,null,null,null,null,null,null,{"$f":"IF(ISNUMBER(SEARCH($C$6,#REF!)),MAX($M$1:M54)+1,0)","v":0},null,{"$f":"#REF!","v":{"$error":"#REF!"}},{"$f":"IFERROR(VLOOKUP(ROWS($P$2:P55),$M:$O,3,0),\"\")","v":""}]
[null,null,null,null,null,null,null,null,null,null,null,null,{"$f":"IF(ISNUMBER(SEARCH($C$6,#REF!)),MAX($M$1:M55)+1,0)","v":0},null,{"$f":"#REF!","v":{"$error":"#REF!"}},{"$f":"IFERROR(VLOOKUP(ROWS($P$2:P56),$M:$O,3,0),\"\")","v":""}]
[null,null,null,null,null,null,null,null,null,null,null,null,{"$f":"IF(ISNUMBER(SEARCH($C$6,#REF!)),MAX($M$1:M56)+1,0)","v":0},null,{"$f":"#REF!","v":{"$error":"#REF!"}},{"$f":"IFERROR(VLOOKUP(ROWS($P$2:P57),$M:$O,3,0),\"\")","v":""}]
[null,null,null,null,null,null,null,null,null,null,null,null,{"$f":"IF(ISNUMBER(SEARCH($C$6,#REF!)),MAX($M$1:M57)+1,0)","v":0},null,{"$f":"#REF!","v":{"$error":"#REF!"}},{"$f":"IFERROR(VLOOKUP(ROWS($P$2:P58),$M:$O,3,0),\"\")","v":""}]
[null,null,null,null,null,null,null,null,null,null,null,null,{"$f":"IF(ISNUMBER(SEARCH($C$6,#REF!)),MAX($M$1:M58)+1,0)","v":0},null,{"$f":"#REF!","v":{"$error":"#REF!"}},{"$f":"IFERROR(VLOOKUP(ROWS($P$2:P59),$M:$O,3,0),\"\")","v":""}]
[null,null,null,null,null,null,null,null,null,null,null,null,{"$f":"IF(ISNUMBER(SEARCH($C$6,#REF!)),MAX($M$1:M59)+1,0)","v":0},null,{"$f":"#REF!","v":{"$error":"#REF!"}},{"$f":"IFERROR(VLOOKUP(ROWS($P$2:P60),$M:$O,3,0),\"\")","v":""}]
[null,null,null,null,null,null,null,null,null,null,null,null,{"$f":"IF(ISNUMBER(SEARCH($C$6,#REF!)),MAX($M$1:M60)+1,0)","v":0},null,{"$f":"#REF!","v":{"$error":"#REF!"}},{"$f":"IFERROR(VLOOKUP(ROWS($P$2:P61),$M:$O,3,0),\"\")","v":""}]
[null,null,null,null,null,null,null,null,null,null,null,null,{"$f":"IF(ISNUMBER(SEARCH($C$6,#REF!)),MAX($M$1:M61)+1,0)","v":0},null,{"$f":"#REF!","v":{"$error":"#REF!"}},{"$f":"IFERROR(VLOOKUP(ROWS($P$2:P62),$M:$O,3,0),\"\")","v":""}]
[null,null,null,null,null,null,null,null,null,null,null,null,{"$f":"IF(ISNUMBER(SEARCH($C$6,#REF!)),MAX($M$1:M62)+1,0)","v":0},null,{"$f":"#REF!","v":{"$error":"#REF!"}},{"$f":"IFERROR(VLOOKUP(ROWS($P$2:P63),$M:$O,3,0),\"\")","v":""}]
[null,null,null,null,null,null,null,null,null,null,null,null,{"$f":"IF(ISNUMBER(SEARCH($C$6,#REF!)),MAX($M$1:M63)+1,0)","v":0},null,{"$f":"#REF!","v":{"$error":"#REF!"}},{"$f":"IFERROR(VLOOKUP(ROWS($P$2:P64),$M:$O,3,0),\"\")","v":""}]
[null,null,null,null,null,null,null,null,null,null,null,null,{"$f":"IF(ISNUMBER(SEARCH($C$6,#REF!)),MAX($M$1:M64)+1,0)","v":0},null,{"$f":"#REF!","v":{"$error":"#REF!"}},{"$f":"IFERROR(VLOOKUP(ROWS($P$2:P65),$M:$O,3,0),\"\")","v":""}]
[null,null,null,null,null,null,null,null,null,null,null,null,{"$f":"IF(ISNUMBER(SEARCH($C$6,#REF!)),MAX($M$1:M65)+1,0)","v":0},null,{"$f":"#REF!","v":{"$error":"#REF!"}},{"$f":"IFERROR(VLOOKUP(ROWS($P$2:P66),$M:$O,3,0),\"\")","v":""}]
[null,null,null,null,null,null,null,null,null,null,null,null,{"$f":"IF(ISNUMBER(SEARCH($C$6,#REF!)),MAX($M$1:M66)+1,0)","v":0},null,{"$f":"#REF!","v":{"$error":"#REF!"}},{"$f":"IFERROR(VLOOKUP(ROWS($P$2:P67),$M:$O,3,0),\"\")","v":""}]
[null,null,null,null,null,null,null,null,null,null,null,null,{"$f":"IF(ISNUMBER(SEARCH($C$6,#REF!)),MAX($M$1:M67)+1,0)","v":0},null,{"$f":"#REF!","v":{"$error":"#REF!"}},{"$f":"IFERROR(VLOOKUP(ROWS($P$2:P68),$M:$O,3,0),\"\")","v":""}]
[null,null,null,null,null,null,null,null,null,null,null,null,{"$f":"IF(ISNUMBER(SEARCH($C$6,#REF!)),MAX($M$1:M68)+1,0)","v":0},null,{"$f":"#REF!","v":{"$error":"#REF!"}},{"$f":"IFERROR(VLOOKUP(ROWS($P$2:P69),$M:$O,3,0),\"\")","v":""}]
[null,null,null,null,null,null,null,null,null,null,null,null,{"$f":"IF(ISNUMBER(SEARCH($C$6,#REF!)),MAX($M$1:M69)+1,0)","v":0},null,{"$f":"#REF!","v":{"$error":"#REF!"}},{"$f":"IFERROR(VLOOKUP(ROWS($P$2:P70),$M:$O,3,0),\"\")","v":""}]
[null,null,null,null,null,null,null,null,null,null,null,null,{"$f":"IF(ISNUMBER(SEARCH($C$6,#REF!)),MAX($M$1:M70)+1,0)","v":0},null,{"$f":"#REF!","v":{"$error":"#REF!"}},{"$f":"IFERROR(VLOOKUP(ROWS($P$2:P71),$M:$O,3,0),\"\")","v":""}]
[null,null,null,null,null,null,null,null,null,null,null,null,{"$f":"IF(ISNUMBER(SEARCH($C$6,#REF!)),MAX($M$1:M71)+1,0)","v":0},null,{"$f":"#REF!","v":{"$error":"#REF!"}},{"$f":"IFERROR(VLOOKUP(ROWS($P$2:P72),$M:$O,3,0),\"\")","v":""}]
[null,null,null,null,null,null,null,null,null,null,null,null,{"$f":"IF(ISNUMBER(SEARCH($C$6,#REF!)),MAX($M$1:M72)+1,0)","v":0},null,{"$f":"#REF!","v":{"$error":"#REF!"}},{"$f":"IFERROR(VLOOKUP(ROWS($P$2:P73),$M:$O,3,0),\"\")","v":""}]
[null,null,null,null,null,null,null,null,null,null,null,null,{"$f":"IF(ISNUMBER(SEARCH($C$6,#REF!)),MAX($M$1:M73)+1,0)","v":0},null,{"$f":"#REF!","v":{"$error":"#REF!"}},{"$f":"IFERROR(VLOOKUP(ROWS($P$2:P74),$M:$O,3,0),\"\")","v":""}]
[null,null,null,null,null,null,null,null,null,null,null,null,{"$f":"IF(ISNUMBER(SEARCH($C$6,#REF!)),MAX($M$1:M74)+1,0)","v":0},null,{"$f":"#REF!","v":{"$error":"#REF!"}},{"$f":"IFERROR(VLOOKUP(ROWS($P$2:P75),$M:$O,3,0),\"\")","v":""}]
[null,null,null,null,null,null,null,null,null,null,null,null,{"$f":"IF(ISNUMBER(SEARCH($C$6,#REF!)),MAX($M$1:M75)+1,0)","v":0},null,{"$f":"#REF!","v":{"$error":"#REF!"}},{"$f":"IFERROR(VLOOKUP(ROWS($P$2:P76),$M:$O,3,0),\"\")","v":""}]
[null,null,null,null,null,null,null,null,null,null,null,null,{"$f":"IF(ISNUMBER(SEARCH($C$6,#REF!)),MAX($M$1:M76)+1,0)","v":0},null,{"$f":"#REF!","v":{"$error":"#REF!"}},{"$f":"IFERROR(VLOOKUP(ROWS($P$2:P77),$M:$O,3,0),\"\")","v":""}]
[null,null,null,null,null,null,null,null,null,null,null,null,{"$f":"IF(ISNUMBER(SEARCH($C$6,#REF!)),MAX($M$1:M77)+1,0)","v":0},null,{"$f":"#REF!","v":{"$error":"#REF!"}},{"$f":"IFERROR(VLOOKUP(ROWS($P$2:P78),$M:$O,3,0),\"\")","v":""}]
[null,null,null,null,null,null,null,null,null,null,null,null,{"$f":"IF(ISNUMBER(SEARCH($C$6,#REF!)),MAX($M$1:M78)+1,0)","v":0},null,{"$f":"#REF!","v":{"$error":"#REF!"}},{"$f":"IFERROR(VLOOKUP(ROWS($P$2:P79),$M:$O,3,0),\"\")","v":""}]
[null,null,null,null,null,null,null,null,null,null,null,null,{"$f":"IF(ISNUMBER(SEARCH($C$6,#REF!)),MAX($M$1:M79)+1,0)","v":0},null,{"$f":"#REF!","v":{"$error":"#REF!"}},{"$f":"IFERROR(VLOOKUP(ROWS($P$2:P80),$M:$O,3,0),\"\")","v":""}]
{"$rows_left_out":137}
{"sheet":"قائمة ","index":1,"n_rows":5,"n_cols":2,"rows_kept":5,"cut":false,"hidden":false,"merged":[]}
["احمد ",1]
["علي ",2]
["جاسم ",3]
["قاسم ",4]
["محمد ",5]

{"sheet":"1","index":2,"n_rows":0,"n_cols":0,"rows_kept":0,"cut":false,"hidden":false,"merged":[]}

{"sheet":"2","index":3,"n_rows":0,"n_cols":0,"rows_kept":0,"cut":false,"hidden":false,"merged":[]}

{"sheet":"3","index":4,"n_rows":0,"n_cols":0,"rows_kept":0,"cut":false,"hidden":false,"merged":[]}

{"sheet":"4","index":5,"n_rows":0,"n_cols":0,"rows_kept":0,"cut":false,"hidden":false,"merged":[]}

{"sheet":"5","index":6,"n_rows":0,"n_cols":0,"rows_kept":0,"cut":false,"hidden":false,"merged":[]}