{"text_format":"1","workbook":"xlsx","n_sheets":2,"sheets":["mo1","ورقة2"],"not_rendered":{"charts":0,"images":6,"macros":1,"external_links":2,"defined_names":0,"comments":0,"pivot_tables":0},"unopened":[],"bounds":{"document_bytes":16777216,"sheet_cells":100000,"rows_first":2000,"rows_last":500,"rows_between":2000,"halvings":0,"cell_chars":16384,"cell_head_chars":4096},"cells_cut":0,"cells_raw":0,"read":"whole","date_system":"1900"}

{"sheet":"mo1","index":0,"n_rows":16,"n_cols":7,"rows_kept":16,"cut":false,"hidden":false,"merged":[[5,6,7,7],[0,0,0,1],[0,3,0,7],[1,0,1,7],[2,6,2,7],[3,0,4,0],[3,1,3,2],[3,5,4,5],[3,6,4,7],[5,0,7,0],[5,1,7,1],[5,2,7,2],[5,3,7,3],[5,4,7,4],[15,0,15,7],[13,5,13,7],[14,0,14,7],[8,6,12,7],[8,3,12,3]]}
[]
["بيان توزيع المواد الغدائية"]
[null,"سوبر ماركة",null,"سوبر ماركة المستهلك",null,"سوبر ماركة الجزيرة"]
["ملاحظات","الكمية",null,"العداد ","عبوه ","المواد","الصنف"]
[null,"حبة","كرتون","المطلوب "," الكرتون"]
[null,{"$f":"IFERROR(MOD($D$6,E6),\"\")","v":14},{"$f":"IFERROR(INT(D6/E6),\"\")","v":14},{"$f":"SUMIF(ورقة2!C:C,D3,ورقة2!B:B)","v":266},{"$f":"IFERROR(INDEX('[1]1001'!$G$1:$G$23,'[1]1001'!E2),\"\")","v":18},"جبنة فيتا","الاجبان"]
[null,null,null,null,null,"جبة سائلة"]
[null,null,null,null,null,"جبة دمياطي"]
[null,{"$f":"IFERROR(MOD($D$9,E9),\"\")","v":45},{"$f":"IFERROR(INT(D9/E9),\"\")","v":2},{"$f":"SUMIF(ورقة2!C:C,D3,ورقة2!A:A)","v":185},{"$f":"IFERROR(INDEX('[1]1001'!$M$1:$M$20,'[1]1001'!K2),\"\")","v":70},"بيبسي","المشروبات"]
[null,{"$f":"IFERROR(MOD($D$9,E10),\"\")","v":5},{"$f":"IFERROR(INT(D9/E10),\"\")","v":3},null,{"$f":"IFERROR(INDEX('[1]1001'!$M$1:$M$20,'[1]1001'!K3),\"\")","v":60},"فانتا"]
[null,35,{"$f":"IFERROR(INT(D9/E11),\"\")","v":3},null,{"$f":"IFERROR(INDEX('[1]1001'!$M$1:$M$20,'[1]1001'!K4),\"\")","v":50},"ميرندا"]
[null,25,{"$f":"IFERROR(INT(D9/E12),\"\")","v":4},null,{"$f":"IFERROR(INDEX('[1]1001'!$M$1:$M$20,'[1]1001'!K5),\"\")","v":40},"شاني"]
[null,{"$f":"IFERROR(MOD($D$9,E13),\"\")","v":25},{"$f":"IFERROR(INT(D9/E13),\"\")","v":4},null,{"$f":"IFERROR(INDEX('[1]1001'!$M$1:$M$20,'[1]1001'!K6),\"\")","v":40},"عصير راني"]
[null,{"$f":"SUM(B6:B13)","v":149},{"$f":"SUM(C6:C13)","v":30},{"$f":"SUM(D6:D13)","v":451},"المجموع  الكلي "]
["لقد تم جرد المواد الموضحة اعلاه وعلى ذلك تم التوقيع"]
[{"$f":"IF(A2<>\"\", IF(E2=\"\",NOW(),E2),\"\")","v":"2023-01-29T10:24:16.070"}]

{"sheet":"ورقة2","index":1,"n_rows":19,"n_cols":4,"rows_kept":19,"cut":false,"hidden":false,"merged":[]}
["المشروبات","الاجبان"]
[98,160,"محل العمدة",1]
[165,232,"سوبر ماركة بدير",2]
[159,244,"سوبر ماركة الجزيرة",3]
[110,150,"سوبر ماركة اسيا",4]
[93,103,"سوبر ماركة الاحمدي",5]
[130,165,"سوبر ماركة الصمة",6]
[185,266,"سوبر ماركة المستهلك",7]
[175,138,"سوبر ماركة العرجان",8]
[92,173,"سوبر ماركة القبلي",9]
[163,163,"سوبر ماركة التوفير",10]
[87,97,"سوبر ماركة استرا",11]
[112,146,"سوبر ماركة الشمال",12]
[69,85,"سوبر ماركة تي ام",13]
[134,157,"سوبر ماركة بن جحلان",14]
[124,152,"سوبر ماركة الروضة",15]
[115,138,"سوبر ماركة النهضة",16]
[74,119,"سوبر ماركة المصيف",17]
[79,140,"سوبر ماركة القادسية",18]