{"text_format":"1","workbook":"xlsx","n_sheets":5,"sheets":["Vehicle","Data","Sample","2","1"],"not_rendered":{"charts":12,"images":0,"macros":1,"external_links":1,"defined_names":4,"comments":0,"pivot_tables":0},"unopened":[],"bounds":{"document_bytes":16777216,"sheet_cells":100000,"rows_first":2000,"rows_last":500,"rows_between":2000,"halvings":0,"cell_chars":16384,"cell_head_chars":4096},"cells_cut":0,"cells_raw":0,"read":"whole","date_system":"1900"}

{"sheet":"Vehicle","index":0,"n_rows":500,"n_cols":9,"rows_kept":500,"cut":false,"hidden":false,"merged":[]}
[null,"Worker No","Name","Worker No","Name","Worker No","Name","الارقام المطلوب عمل شيتات لها",1]
[null,2,{"$f":"IFERROR(VLOOKUP(B2,Data!$A:$B,2,0),\"\")","v":"أشرف أحمد حسن"},null,{"$f":"IFERROR(VLOOKUP(D2,Data!$A:$B,2,0),\"\")","v":""},null,{"$f":"IFERROR(VLOOKUP(F2,Data!$A:$B,2,0),\"\")","v":""},1]
[null,1,{"$f":"IFERROR(VLOOKUP(B3,Data!$A:$B,2,0),\"\")","v":"احمد ايمن مصطفى"},null,{"$f":"IFERROR(VLOOKUP(D3,Data!$A:$B,2,0),\"\")","v":""},null,{"$f":"IFERROR(VLOOKUP(F3,Data!$A:$B,2,0),\"\")","v":""},2]
[null,null,{"$f":"IFERROR(VLOOKUP(B4,Data!$A:$B,2,0),\"\")","v":""},null,{"$f":"IFERROR(VLOOKUP(D4,Data!$A:$B,2,0),\"\")","v":""},null,{"$f":"IFERROR(VLOOKUP(F4,Data!$A:$B,2,0),\"\")","v":""},3]
[null,null,{"$f":"IFERROR(VLOOKUP(B5,Data!$A:$B,2,0),\"\")","v":""},null,{"$f":"IFERROR(VLOOKUP(D5,Data!$A:$B,2,0),\"\")","v":""},null,{"$f":"IFERROR(VLOOKUP(F5,Data!$A:$B,2,0),\"\")","v":""},4]
[null,null,{"$f":"IFERROR(VLOOKUP(B6,Data!$A:$B,2,0),\"\")","v":""},null,{"$f":"IFERROR(VLOOKUP(D6,Data!$A:$B,2,0),\"\")","v":""},null,{"$f":"IFERROR(VLOOKUP(F6,Data!$A:$B,2,0),\"\")","v":""},5]
[null,null,{"$f":"IFERROR(VLOOKUP(B7,Data!$A:$B,2,0),\"\")","v":""},null,{"$f":"IFERROR(VLOOKUP(D7,Data!$A:$B,2,0),\"\")","v":""},null,{"$f":"IFERROR(VLOOKUP(F7,Data!$A:$B,2,0),\"\")","v":""},6]
[null,null,{"$f":"IFERROR(VLOOKUP(B8,Data!$A:$B,2,0),\"\")","v":""},null,{"$f":"IFERROR(VLOOKUP(D8,Data!$A:$B,2,0),\"\")","v":""},null,{"$f":"IFERROR(VLOOKUP(F8,Data!$A:$B,2,0),\"\")","v":""},7]
[null,null,{"$f":"IFERROR(VLOOKUP(B9,Data!$A:$B,2,0),\"\")","v":""},null,{"$f":"IFERROR(VLOOKUP(D9,Data!$A:$B,2,0),\"\")","v":""},null,{"$f":"IFERROR(VLOOKUP(F9,Data!$A:$B,2,0),\"\")","v":""},8]
[null,null,{"$f":"IFERROR(VLOOKUP(B10,Data!$A:$B,2,0),\"\")","v":""},null,{"$f":"IFERROR(VLOOKUP(D10,Data!$A:$B,2,0),\"\")","v":""},null,{"$f":"IFERROR(VLOOKUP(F10,Data!$A:$B,2,0),\"\")","v":""},9]
[null,null,{"$f":"IFERROR(VLOOKUP(B11,Data!$A:$B,2,0),\"\")","v":""},null,{"$f":"IFERROR(VLOOKUP(D11,Data!$A:$B,2,0),\"\")","v":""},null,{"$f":"IFERROR(VLOOKUP(F11,Data!$A:$B,2,0),\"\")","v":""},10]
[null,null,{"$f":"IFERROR(VLOOKUP(B12,Data!$A:$B,2,0),\"\")","v":""},null,{"$f":"IFERROR(VLOOKUP(D12,Data!$A:$B,2,0),\"\")","v":""},null,{"$f":"IFERROR(VLOOKUP(F12,Data!$A:$B,2,0),\"\")","v":""},11]
[null,null,{"$f":"IFERROR(VLOOKUP(B13,Data!$A:$B,2,0),\"\")","v":""},null,{"$f":"IFERROR(VLOOKUP(D13,Data!$A:$B,2,0),\"\")","v":""},null,{"$f":"IFERROR(VLOOKUP(F13,Data!$A:$B,2,0),\"\")","v":""},12]
[null,null,{"$f":"IFERROR(VLOOKUP(B14,Data!$A:$B,2,0),\"\")","v":""},null,{"$f":"IFERROR(VLOOKUP(D14,Data!$A:$B,2,0),\"\")","v":""},null,{"$f":"IFERROR(VLOOKUP(F14,Data!$A:$B,2,0),\"\")","v":""},13]
[null,null,{"$f":"IFERROR(VLOOKUP(B15,Data!$A:$B,2,0),\"\")","v":""},null,{"$f":"IFERROR(VLOOKUP(D15,Data!$A:$B,2,0),\"\")","v":""},null,{"$f":"IFERROR(VLOOKUP(F15,Data!$A:$B,2,0),\"\")","v":""},14]
[null,null,{"$f":"IFERROR(VLOOKUP(B16,Data!$A:$B,2,0),\"\")","v":""},null,{"$f":"IFERROR(VLOOKUP(D16,Data!$A:$B,2,0),\"\")","v":""},null,{"$f":"IFERROR(VLOOKUP(F16,Data!$A:$B,2,0),\"\")","v":""},15]
[null,null,{"$f":"IFERROR(VLOOKUP(B17,Data!$A:$B,2,0),\"\")","v":""},null,{"$f":"IFERROR(VLOOKUP(D17,Data!$A:$B,2,0),\"\")","v":""},null,{"$f":"IFERROR(VLOOKUP(F17,Data!$A:$B,2,0),\"\")","v":""},16]
[null,null,{"$f":"IFERROR(VLOOKUP(B18,Data!$A:$B,2,0),\"\")","v":""},null,{"$f":"IFERROR(VLOOKUP(D18,Data!$A:$B,2,0),\"\")","v":""},null,{"$f":"IFERROR(VLOOKUP(F18,Data!$A:$B,2,0),\"\")","v":""},17]
[null,null,{"$f":"IFERROR(VLOOKUP(B19,Data!$A:$B,2,0),\"\")","v":""},null,{"$f":"IFERROR(VLOOKUP(D19,Data!$A:$B,2,0),\"\")","v":""},null,{"$f":"IFERROR(VLOOKUP(F19,Data!$A:$B,2,0),\"\")","v":""},18]
[null,null,{"$f":"IFERROR(VLOOKUP(B20,Data!$A:$B,2,0),\"\")","v":""},null,{"$f":"IFERROR(VLOOKUP(D20,Data!$A:$B,2,0),\"\")","v":""},null,{"$f":"IFERROR(VLOOKUP(F20,Data!$A:$B,2,0),\"\")","v":""},19]
[null,null,{"$f":"IFERROR(VLOOKUP(B21,Data!$A:$B,2,0),\"\")","v":""},null,{"$f":"IFERROR(VLOOKUP(D21,Data!$A:$B,2,0),\"\")","v":""},null,{"$f":"IFERROR(VLOOKUP(F21,Data!$A:$B,2,0),\"\")","v":""},20]
[null,null,{"$f":"IFERROR(VLOOKUP(B22,Data!$A:$B,2,0),\"\")","v":""},null,{"$f":"IFERROR(VLOOKUP(D22,Data!$A:$B,2,0),\"\")","v":""},null,{"$f":"IFERROR(VLOOKUP(F22,Data!$A:$B,2,0),\"\")","v":""},21]
[null,null,{"$f":"IFERROR(VLOOKUP(B23,Data!$A:$B,2,0),\"\")","v":""},null,{"$f":"IFERROR(VLOOKUP(D23,Data!$A:$B,2,0),\"\")","v":""},null,{"$f":"IFERROR(VLOOKUP(F23,Data!$A:$B,2,0),\"\")","v":""},22]
[null,null,{"$f":"IFERROR(VLOOKUP(B24,Data!$A:$B,2,0),\"\")","v":""},null,{"$f":"IFERROR(VLOOKUP(D24,Data!$A:$B,2,0),\"\")","v":""},null,{"$f":"IFERROR(VLOOKUP(F24,Data!$A:$B,2,0),\"\")","v":""},23]
[null,null,{"$f":"IFERROR(VLOOKUP(B25,Data!$A:$B,2,0),\"\")","v":""},null,{"$f":"IFERROR(VLOOKUP(D25,Data!$A:$B,2,0),\"\")","v":""},null,{"$f":"IFERROR(VLOOKUP(F25,Data!$A:$B,2,0),\"\")","v":""},24]
[null,null,{"$f":"IFERROR(VLOOKUP(B26,Data!$A:$B,2,0),\"\")","v":""},null,{"$f":"IFERROR(VLOOKUP(D26,Data!$A:$B,2,0),\"\")","v":""},null,{"$f":"IFERROR(VLOOKUP(F26,Data!$A:$B,2,0),\"\")","v":""},25]
[null,null,{"$f":"IFERROR(VLOOKUP(B27,Data!$A:$B,2,0),\"\")","v":""},null,{"$f":"IFERROR(VLOOKUP(D27,Data!$A:$B,2,0),\"\")","v":""},null,{"$f":"IFERROR(VLOOKUP(F27,Data!$A:$B,2,0),\"\")","v":""},26]
[null,null,{"$f":"IFERROR(VLOOKUP(B28,Data!$A:$B,2,0),\"\")","v":""},null,{"$f":"IFERROR(VLOOKUP(D28,Data!$A:$B,2,0),\"\")","v":""},null,{"$f":"IFERROR(VLOOKUP(F28,Data!$A:$B,2,0),\"\")","v":""},27]
[null,null,{"$f":"IFERROR(VLOOKUP(B29,Data!$A:$B,2,0),\"\")","v":""},null,{"$f":"IFERROR(VLOOKUP(D29,Data!$A:$B,2,0),\"\")","v":""},null,{"$f":"IFERROR(VLOOKUP(F29,Data!$A:$B,2,0),\"\")","v":""},28]
[null,null,{"$f":"IFERROR(VLOOKUP(B30,Data!$A:$B,2,0),\"\")","v":""},null,{"$f":"IFERROR(VLOOKUP(D30,Data!$A:$B,2,0),\"\")","v":""},null,{"$f":"IFERROR(VLOOKUP(F30,Data!$A:$B,2,0),\"\")","v":""},29]
[null,null,{"$f":"IFERROR(VLOOKUP(B31,Data!$A:$B,2,0),\"\")","v":""},null,{"$f":"IFERROR(VLOOKUP(D31,Data!$A:$B,2,0),\"\")","v":""},null,{"$f":"IFERROR(VLOOKUP(F31,Data!$A:$B,2,0),\"\")","v":""},30]
[null,null,{"$f":"IFERROR(VLOOKUP(B32,Data!$A:$B,2,0),\"\")","v":""},null,{"$f":"IFERROR(VLOOKUP(D32,Data!$A:$B,2,0),\"\")","v":""},null,{"$f":"IFERROR(VLOOKUP(F32,Data!$A:$B,2,0),\"\")","v":""},31]
[null,null,{"$f":"IFERROR(VLOOKUP(B33,Data!$A:$B,2,0),\"\")","v":""},null,{"$f":"IFERROR(VLOOKUP(D33,Data!$A:$B,2,0),\"\")","v":""},null,{"$f":"IFERROR(VLOOKUP(F33,Data!$A:$B,2,0),\"\")","v":""},32]
[null,null,{"$f":"IFERROR(VLOOKUP(B34,Data!$A:$B,2,0),\"\")","v":""},null,{"$f":"IFERROR(VLOOKUP(D34,Data!$A:$B,2,0),\"\")","v":""},null,{"$f":"IFERROR(VLOOKUP(F34,Data!$A:$B,2,0),\"\")","v":""},33]
[null,null,{"$f":"IFERROR(VLOOKUP(B35,Data!$A:$B,2,0),\"\")","v":""},null,{"$f":"IFERROR(VLOOKUP(D35,Data!$A:$B,2,0),\"\")","v":""},null,{"$f":"IFERROR(VLOOKUP(F35,Data!$A:$B,2,0),\"\")","v":""},34]
[null,null,{"$f":"IFERROR(VLOOKUP(B36,Data!$A:$B,2,0),\"\")","v":""},null,{"$f":"IFERROR(VLOOKUP(D36,Data!$A:$B,2,0),\"\")","v":""},null,{"$f":"IFERROR(VLOOKUP(F36,Data!$A:$B,2,0),\"\")","v":""},35]
[null,null,{"$f":"IFERROR(VLOOKUP(B37,Data!$A:$B,2,0),\"\")","v":""},null,{"$f":"IFERROR(VLOOKUP(D37,Data!$A:$B,2,0),\"\")","v":""},null,{"$f":"IFERROR(VLOOKUP(F37,Data!$A:$B,2,0),\"\")","v":""},36]
[null,null,{"$f":"IFERROR(VLOOKUP(B38,Data!$A:$B,2,0),\"\")","v":""},null,{"$f":"IFERROR(VLOOKUP(D38,Data!$A:$B,2,0),\"\")","v":""},null,{"$f":"IFERROR(VLOOKUP(F38,Data!$A:$B,2,0),\"\")","v":""},37]
[null,null,{"$f":"IFERROR(VLOOKUP(B39,Data!$A:$B,2,0),\"\")","v":""},null,{"$f":"IFERROR(VLOOKUP(D39,Data!$A:$B,2,0),\"\")","v":""},null,{"$f":"IFERROR(VLOOKUP(F39,Data!$A:$B,2,0),\"\")","v":""},38]
[null,null,{"$f":"IFERROR(VLOOKUP(B40,Data!$A:$B,2,0),\"\")","v":""},null,{"$f":"IFERROR(VLOOKUP(D40,Data!$A:$B,2,0),\"\")","v":""},null,{"$f":"IFERROR(VLOOKUP(F40,Data!$A:$B,2,0),\"\")","v":""},39]
[null,null,{"$f":"IFERROR(VLOOKUP(B41,Data!$A:$B,2,0),\"\")","v":""},null,{"$f":"IFERROR(VLOOKUP(D41,Data!$A:$B,2,0),\"\")","v":""},null,{"$f":"IFERROR(VLOOKUP(F41,Data!$A:$B,2,0),\"\")","v":""},40]
[null,null,{"$f":"IFERROR(VLOOKUP(B42,Data!$A:$B,2,0),\"\")","v":""},null,{"$f":"IFERROR(VLOOKUP(D42,Data!$A:$B,2,0),\"\")","v":""},null,{"$f":"IFERROR(VLOOKUP(F42,Data!$A:$B,2,0),\"\")","v":""},41]
[null,null,{"$f":"IFERROR(VLOOKUP(B43,Data!$A:$B,2,0),\"\")","v":""},null,{"$f":"IFERROR(VLOOKUP(D43,Data!$A:$B,2,0),\"\")","v":""},null,{"$f":"IFERROR(VLOOKUP(F43,Data!$A:$B,2,0),\"\")","v":""},42]
[null,null,{"$f":"IFERROR(VLOOKUP(B44,Data!$A:$B,2,0),\"\")","v":""},null,{"$f":"IFERROR(VLOOKUP(D44,Data!$A:$B,2,0),\"\")","v":""},null,{"$f":"IFERROR(VLOOKUP(F44,Data!$A:$B,2,0),\"\")","v":""},43]
[null,null,{"$f":"IFERROR(VLOOKUP(B45,Data!$A:$B,2,0),\"\")","v":""},null,{"$f":"IFERROR(VLOOKUP(D45,Data!$A:$B,2,0),\"\")","v":""},null,{"$f":"IFERROR(VLOOKUP(F45,Data!$A:$B,2,0),\"\")","v":""},44]
[null,null,{"$f":"IFERROR(VLOOKUP(B46,Data!$A:$B,2,0),\"\")","v":""},null,{"$f":"IFERROR(VLOOKUP(D46,Data!$A:$B,2,0),\"\")","v":""},null,{"$f":"IFERROR(VLOOKUP(F46,Data!$A:$B,2,0),\"\")","v":""},45]
[null,null,{"$f":"IFERROR(VLOOKUP(B47,Data!$A:$B,2,0),\"\")","v":""},null,{"$f":"IFERROR(VLOOKUP(D47,Data!$A:$B,2,0),\"\")","v":""},null,{"$f":"IFERROR(VLOOKUP(F47,Data!$A:$B,2,0),\"\")","v":""},46]
[null,null,{"$f":"IFERROR(VLOOKUP(B48,Data!$A:$B,2,0),\"\")","v":""},null,{"$f":"IFERROR(VLOOKUP(D48,Data!$A:$B,2,0),\"\")","v":""},null,{"$f":"IFERROR(VLOOKUP(F48,Data!$A:$B,2,0),\"\")","v":""},47]
[null,null,{"$f":"IFERROR(VLOOKUP(B49,Data!$A:$B,2,0),\"\")","v":""},null,{"$f":"IFERROR(VLOOKUP(D49,Data!$A:$B,2,0),\"\")","v":""},null,{"$f":"IFERROR(VLOOKUP(F49,Data!$A:$B,2,0),\"\")","v":""},48]
[null,null,{"$f":"IFERROR(VLOOKUP(B50,Data!$A:$B,2,0),\"\")","v":""},null,{"$f":"IFERROR(VLOOKUP(D50,Data!$A:$B,2,0),\"\")","v":""},null,{"$f":"IFERROR(VLOOKUP(F50,Data!$A:$B,2,0),\"\")","v":""},49]
[null,null,{"$f":"IFERROR(VLOOKUP(B51,Data!$A:$B,2,0),\"\")","v":""},null,{"$f":"IFERROR(VLOOKUP(D51,Data!$A:$B,2,0),\"\")","v":""},null,{"$f":"IFERROR(VLOOKUP(F51,Data!$A:$B,2,0),\"\")","v":""},50]
[null,null,{"$f":"IFERROR(VLOOKUP(B52,Data!$A:$B,2,0),\"\")","v":""},null,{"$f":"IFERROR(VLOOKUP(D52,Data!$A:$B,2,0),\"\")","v":""},null,{"$f":"IFERROR(VLOOKUP(F52,Data!$A:$B,2,0),\"\")","v":""},51]
[null,null,{"$f":"IFERROR(VLOOKUP(B53,Data!$A:$B,2,0),\"\")","v":""},null,{"$f":"IFERROR(VLOOKUP(D53,Data!$A:$B,2,0),\"\")","v":""},null,{"$f":"IFERROR(VLOOKUP(F53,Data!$A:$B,2,0),\"\")","v":""},52]
[null,null,{"$f":"IFERROR(VLOOKUP(B54,Data!$A:$B,2,0),\"\")","v":""},null,{"$f":"IFERROR(VLOOKUP(D54,Data!$A:$B,2,0),\"\")","v":""},null,{"$f":"IFERROR(VLOOKUP(F54,Data!$A:$B,2,0),\"\")","v":""},53]
[null,null,{"$f":"IFERROR(VLOOKUP(B55,Data!$A:$B,2,0),\"\")","v":""},null,{"$f":"IFERROR(VLOOKUP(D55,Data!$A:$B,2,0),\"\")","v":""},null,{"$f":"IFERROR(VLOOKUP(F55,Data!$A:$B,2,0),\"\")","v":""},54]
[null,null,{"$f":"IFERROR(VLOOKUP(B56,Data!$A:$B,2,0),\"\")","v":""},null,{"$f":"IFERROR(VLOOKUP(D56,Data!$A:$B,2,0),\"\")","v":""},null,{"$f":"IFERROR(VLOOKUP(F56,Data!$A:$B,2,0),\"\")","v":""},55]
[null,null,{"$f":"IFERROR(VLOOKUP(B57,Data!$A:$B,2,0),\"\")","v":""},null,{"$f":"IFERROR(VLOOKUP(D57,Data!$A:$B,2,0),\"\")","v":""},null,{"$f":"IFERROR(VLOOKUP(F57,Data!$A:$B,2,0),\"\")","v":""},56]
[null,null,{"$f":"IFERROR(VLOOKUP(B58,Data!$A:$B,2,0),\"\")","v":""},null,{"$f":"IFERROR(VLOOKUP(D58,Data!$A:$B,2,0),\"\")","v":""},null,{"$f":"IFERROR(VLOOKUP(F58,Data!$A:$B,2,0),\"\")","v":""},57]
[null,null,{"$f":"IFERROR(VLOOKUP(B59,Data!$A:$B,2,0),\"\")","v":""},null,{"$f":"IFERROR(VLOOKUP(D59,Data!$A:$B,2,0),\"\")","v":""},null,{"$f":"IFERROR(VLOOKUP(F59,Data!$A:$B,2,0),\"\")","v":""},58]
[null,null,{"$f":"IFERROR(VLOOKUP(B60,Data!$A:$B,2,0),\"\")","v":""},null,{"$f":"IFERROR(VLOOKUP(D60,Data!$A:$B,2,0),\"\")","v":""},null,{"$f":"IFERROR(VLOOKUP(F60,Data!$A:$B,2,0),\"\")","v":""},59]
{"$rows_left_out":441}
{"sheet":"Data","index":1,"n_rows":318,"n_cols":7,"rows_kept":318,"cut":false,"hidden":false,"merged":[]}
["Worker No","Name","Arabic Job","English Job","Date Of Birth","Date Of Hiring","Cost Center"]
[1,"احمد ايمن مصطفى","حارس امن ","Security Guard"]
[2,"أشرف أحمد حسن","حارس امن ","Security Guard"]
[3,"شاذلى سيد احمد","حارس امن ","Security Guard"]
[4,"عاشور فرج محمد","حارس امن ","Security Guard"]
[5,"عبدالخالق توفيق محمود","حارس امن ","Security Guard"]
[6,"علاء محمد نجيب","حارس امن ","Security Guard"]
[7,"مجدي عبد العليم عيسى","حارس امن ","Security Guard"]
[8,"محمد عزت عطيه","حارس امن ","Security Guard"]
[9,"محمد محمد وفيق محمود","حارس امن ","Security Guard"]
[10,"مصطفى نصر محمد","حارس امن ","Security Guard"]
[11,"نصر عبدالموجود عبدالعزيز","حارس امن ","Security Guard"]
[12,"وائل ابراهيم خالد","حارس امن ","Security Guard"]
[13,"وائل ابراهيم هلال","حارس امن ","Security Guard"]
[14,"ابراهيم احمد عبدالمنعم","سائق نقل خفيف","Driver Light Truck"]
[15,"ابراهيم ادم عوض الله","سائق نقل خفيف","Driver Light Truck"]
[16,"ابراهيم عبدالحميد ابراهيم","سائق نقل خفيف","Driver Light Truck"]
[17,"احمد السيد عبده","سائق نقل خفيف","Driver Light Truck"]
[18,"احمد حامد احمد","سائق نقل خفيف","Driver Light Truck"]
[19,"احمد عبد الرحمن محمد","سائق نقل خفيف","Driver Light Truck"]
[20,"احمد محمد محمد ابراهيم","سائق نقل خفيف","Driver Light Truck"]
[21,"اسامة محمد ابراهيم مرسى","سائق نقل خفيف","Driver Light Truck"]
[22,"اشرف عبد الرازق محمد","سائق نقل خفيف","Driver Light Truck"]
[23,"المتولى محمود المتولى","سائق نقل خفيف","Driver Light Truck"]
[24,"احمد محمد محمد","سائق نقل خفيف","Driver Light Truck"]
[25,"إبراهيم أحمد إبراهيم","سائق نقل خفيف","Driver Light Truck"]
[26,"تامر خميس عبد الله ابو زيد","سائق نقل خفيف","Driver Light Truck"]
[27,"تامر عبدالرحمن السيد","سائق نقل خفيف","Driver Light Truck"]
[28,"حسين عادل محمد محمد","سائق نقل خفيف","Driver Light Truck"]
[29,"حماده عبدالهادى سيد احمد","سائق نقل خفيف","Driver Light Truck"]
[30,"خالد السيد السيد","سائق نقل خفيف","Driver Light Truck"]
[31,"خالد محمد ابوالدهب","سائق نقل خفيف","Driver Light Truck"]
[32,"خليل عبدالوارث خليل","سائق نقل خفيف","Driver Light Truck"]
[33,"درويش السيد حسين محمد","سائق نقل خفيف","Driver Light Truck"]
[34,"رمضان فضل عبدالمحسن","سائق نقل خفيف","Driver Light Truck"]
[35,"زكريا امان محمود","سائق نقل خفيف","Driver Light Truck"]
[36,"سمير حسين احمد","سائق نقل خفيف","Driver Light Truck"]
[37,"طارق محمود محمد","سائق نقل خفيف","Driver Light Truck"]
[38,"كمال يوسف كمال عبدالفتاح","سائق نقل خفيف","Driver Light Truck"]
[39,"محمد حمايه عبدالقادر","سائق نقل خفيف","Driver Light Truck"]
[40,"محمد عبدالرحمن عبدالشافى","سائق نقل خفيف","Driver Light Truck"]
[41,"محمد على عبداللطيف","سائق نقل خفيف","Driver Light Truck"]
[42,"محمد عيد عبد العظيم","سائق نقل خفيف","Driver Light Truck"]
[43,"محمد مصطفى حنفى","سائق نقل خفيف","Driver Light Truck"]
[44,"محمود بسيونى عبدالعزيز","سائق نقل خفيف","Driver Light Truck"]
[45,"محمود محمد محمود","سائق نقل خفيف","Driver Light Truck"]
[46,"موسى حسن موسى","سائق نقل خفيف","Driver Light Truck"]
[47,"نصر الدين محمود التهامى","سائق نقل خفيف","Driver Light Truck"]
[48,"هيثم عبد الوارث خليل","سائق نقل خفيف","Driver Light Truck"]
[49,"احمد عبدالحميد عبدالصابر","عامل","Worker"]
[50,"احمد عبدالرازق محمد","عامل","Worker"]
[51,"احمد عبدالنبى السباعى الحاج","عامل","Worker"]
[52,"احمد عبيد عبدالغنى","عامل","Worker"]
[53,"احمد علاء جمعه احمد","عامل","Worker"]
[54,"احمد عماد محمود","عامل","Worker"]
[55,"احمد فتحى المحمدى محمد","عامل","Worker"]
[56,"احمد كمال عبدالرازق","عامل","Worker"]
[57,"احمد محمد ابوزيد","عامل","Worker"]
[58,"احمد محمد العربى","عامل","Worker"]
[59,"احمد محمد جمال الدين","عامل","Worker"]
{"$rows_left_out":259}
{"sheet":"Sample","index":2,"n_rows":27,"n_cols":14,"rows_kept":27,"cut":false,"hidden":true,"merged":[[21,8,21,9],[22,8,22,9],[23,8,23,9],[24,8,24,9],[18,8,18,9],[19,8,19,9],[20,8,20,9]]}
[]
["Months",null,"Salary","Medical","Training","Rewards & Profits","P.P.E","Catering","Transitions","Other","Total","Cost Center","Workdays","Average Month Cost"]
["January",null,null,null,null,null,null,null,null,null,{"$f":"SUM(C3:J3)","v":0},null,null,{"$f":"IFERROR(F3/M3,0)","v":0}]
["February",null,null,null,null,null,null,null,null,null,{"$f":"SUM(C4:J4)","v":0},null,null,0]
["March",null,null,null,null,null,null,null,null,null,0,null,null,0]
["April",null,null,null,null,null,null,null,null,null,0,null,null,0]
["May",null,null,null,null,null,null,null,null,null,0,null,null,0]
["June",null,null,null,null,null,null,null,null,null,0,null,null,0]
["July",null,null,null,null,null,null,null,null,null,0,null,null,0]
["August",null,null,null,null,null,null,null,null,null,0,null,null,0]
["September",null,null,null,null,null,null,null,null,null,0,null,null,0]
["October",null,null,null,null,null,null,null,null,null,0,null,null,0]
["November",null,null,null,null,null,null,null,null,null,0,null,null,0]
["December",null,null,null,null,null,null,null,null,null,0,null,null,0]
["Total",null,{"$f":"SUM(C3:C14)","v":0},0,0,{"$f":"SUM(F3:F14)","v":0},0,0,0,0,{"$f":"SUM(K3:K14)","v":0},0,0,{"$f":"IFERROR(SUM(N3:N14)/COUNTIF(N3:N14,\">1\"),0)","v":0}]
[]
["Salary",null,{"$f":"+C15","v":0},{"$f":"IFERROR(C17/$C$25,0)","v":0}]
["Medical",null,{"$f":"+D15","v":0},0]
["Training",null,{"$f":"+E15","v":0},0,null,null,null,"Worker No",{"$f":"+A1","v":0}]
["Rewards & Profits",null,{"$f":"+F15","v":0},0,null,null,null,"Name",{"$f":"IFERROR(VLOOKUP(I19,Data!A:H,2,0),\"\")","v":""}]
["P.P.E",null,{"$f":"+G15","v":0},0,null,null,null,"Arabic Job",{"$f":"IFERROR(VLOOKUP(I19,Data!A:H,3,0),\"\")","v":""}]
["Catering",null,{"$f":"+H15","v":0},0,null,null,null,"English Job",{"$f":"IFERROR(VLOOKUP(I19,Data!A:H,4,0),\"\")","v":""}]
["Transitions",null,{"$f":"+I15","v":0},0,null,null,null,"Date Of Birth",{"$f":"IFERROR(VLOOKUP(I19,Data!A:H,5,0),\"\")","v":""}]
["Other",null,{"$f":"+J15","v":0},0,null,null,null,"Date Of Hiring",{"$f":"IFERROR(VLOOKUP(I19,Data!A:H,6,0),\"\")","v":""}]
["Total",null,{"$f":"+K15","v":0},null,null,null,null,"Cost Center",{"$f":"IFERROR(VLOOKUP(I19,Data!A:H,7,0),\"\")","v":""}]
["Workdays",null,{"$f":"+M15","v":0}]
["Average Month Cost",null,{"$f":"+N15","v":0}]

{"sheet":"2","index":3,"n_rows":27,"n_cols":14,"rows_kept":27,"cut":false,"hidden":false,"merged":[[24,8,24,9],[18,8,18,9],[19,8,19,9],[20,8,20,9],[21,8,21,9],[22,8,22,9],[23,8,23,9]]}
[2]
["Months",null,"Salary","Medical","Training","Rewards & Profits","P.P.E","Catering","Transitions","Other","Total","Cost Center","Workdays","Average Month Cost"]
["January",null,null,null,null,null,null,null,null,null,{"$f":"SUM(C3:J3)","v":0},null,null,{"$f":"IFERROR(F3/M3,0)","v":0}]
["February",null,null,null,null,null,null,null,null,null,{"$f":"SUM(C4:J4)","v":0},null,null,0]
["March",null,null,null,null,null,null,null,null,null,0,null,null,0]
["April",null,null,null,null,null,null,null,null,null,0,null,null,0]
["May",null,null,null,null,null,null,null,null,null,0,null,null,0]
["June",null,null,null,null,null,null,null,null,null,0,null,null,0]
["July",null,null,null,null,null,null,null,null,null,0,null,null,0]
["August",null,null,null,null,null,null,null,null,null,0,null,null,0]
["September",null,null,null,null,null,null,null,null,null,0,null,null,0]
["October",null,null,null,null,null,null,null,null,null,0,null,null,0]
["November",null,null,null,null,null,null,null,null,null,0,null,null,0]
["December",null,null,null,null,null,null,null,null,null,0,null,null,0]
["Total",null,{"$f":"SUM(C3:C14)","v":0},0,0,{"$f":"SUM(F3:F14)","v":0},0,0,0,0,{"$f":"SUM(K3:K14)","v":0},0,0,{"$f":"IFERROR(SUM(N3:N14)/COUNTIF(N3:N14,\">1\"),0)","v":0}]
[]
["Salary",null,{"$f":"+C15","v":0},{"$f":"IFERROR(C17/$C$25,0)","v":0}]
["Medical",null,{"$f":"+D15","v":0},0]
["Training",null,{"$f":"+E15","v":0},0,null,null,null,"Worker No",{"$f":"+A1","v":2}]
["Rewards & Profits",null,{"$f":"+F15","v":0},0,null,null,null,"Name",{"$f":"IFERROR(VLOOKUP(I19,Data!A:H,2,0),\"\")","v":"أشرف أحمد حسن"}]
["P.P.E",null,{"$f":"+G15","v":0},0,null,null,null,"Arabic Job",{"$f":"IFERROR(VLOOKUP(I19,Data!A:H,3,0),\"\")","v":"حارس امن "}]
["Catering",null,{"$f":"+H15","v":0},0,null,null,null,"English Job",{"$f":"IFERROR(VLOOKUP(I19,Data!A:H,4,0),\"\")","v":"Security Guard"}]
["Transitions",null,{"$f":"+I15","v":0},0,null,null,null,"Date Of Birth",{"$f":"IFERROR(VLOOKUP(I19,Data!A:H,5,0),\"\")","v":"00:00:00"}]
["Other",null,{"$f":"+J15","v":0},0,null,null,null,"Date Of Hiring",{"$f":"IFERROR(VLOOKUP(I19,Data!A:H,6,0),\"\")","v":"00:00:00"}]
["Total",null,{"$f":"+K15","v":0},null,null,null,null,"Cost Center",{"$f":"IFERROR(VLOOKUP(I19,Data!A:H,7,0),\"\")","v":0}]
["Workdays",null,{"$f":"+M15","v":0}]
["Average Month Cost",null,{"$f":"+N15","v":0}]

{"sheet":"1","index":4,"n_rows":27,"n_cols":14,"rows_kept":27,"cut":false,"hidden":false,"merged":[[24,8,24,9],[18,8,18,9],[19,8,19,9],[20,8,20,9],[21,8,21,9],[22,8,22,9],[23,8,23,9]]}
[1]
["Months",null,"Salary","Medical","Training","Rewards & Profits","P.P.E","Catering","Transitions","Other","Total","Cost Center","Workdays","Average Month Cost"]
["January",null,null,null,null,null,null,null,null,null,{"$f":"SUM(C3:J3)","v":0},null,null,{"$f":"IFERROR(F3/M3,0)","v":0}]
["February",null,null,null,null,null,null,null,null,null,{"$f":"SUM(C4:J4)","v":0},null,null,0]
["March",null,null,null,null,null,null,null,null,null,0,null,null,0]
["April",null,null,null,null,null,null,null,null,null,0,null,null,0]
["May",null,null,null,null,null,null,null,null,null,0,null,null,0]
["June",null,null,null,null,null,null,null,null,null,0,null,null,0]
["July",null,null,null,null,null,null,null,null,null,0,null,null,0]
["August",null,null,null,null,null,null,null,null,null,0,null,null,0]
["September",null,null,null,null,null,null,null,null,null,0,null,null,0]
["October",null,null,null,null,null,null,null,null,null,0,null,null,0]
["November",null,null,null,null,null,null,null,null,null,0,null,null,0]
["December",null,null,null,null,null,null,null,null,null,0,null,null,0]
["Total",null,{"$f":"SUM(C3:C14)","v":0},0,0,{"$f":"SUM(F3:F14)","v":0},0,0,0,0,{"$f":"SUM(K3:K14)","v":0},0,0,{"$f":"IFERROR(SUM(N3:N14)/COUNTIF(N3:N14,\">1\"),0)","v":0}]
[]
["Salary",null,{"$f":"+C15","v":0},{"$f":"IFERROR(C17/$C$25,0)","v":0}]
["Medical",null,{"$f":"+D15","v":0},0]
["Training",null,{"$f":"+E15","v":0},0,null,null,null,"Worker No",{"$f":"+A1","v":1}]
["Rewards & Profits",null,{"$f":"+F15","v":0},0,null,null,null,"Name",{"$f":"IFERROR(VLOOKUP(I19,Data!A:H,2,0),\"\")","v":"احمد ايمن مصطفى"}]
["P.P.E",null,{"$f":"+G15","v":0},0,null,null,null,"Arabic Job",{"$f":"IFERROR(VLOOKUP(I19,Data!A:H,3,0),\"\")","v":"حارس امن "}]
["Catering",null,{"$f":"+H15","v":0},0,null,null,null,"English Job",{"$f":"IFERROR(VLOOKUP(I19,Data!A:H,4,0),\"\")","v":"Security Guard"}]
["Transitions",null,{"$f":"+I15","v":0},0,null,null,null,"Date Of Birth",{"$f":"IFERROR(VLOOKUP(I19,Data!A:H,5,0),\"\")","v":"00:00:00"}]
["Other",null,{"$f":"+J15","v":0},0,null,null,null,"Date Of Hiring",{"$f":"IFERROR(VLOOKUP(I19,Data!A:H,6,0),\"\")","v":"00:00:00"}]
["Total",null,{"$f":"+K15","v":0},null,null,null,null,"Cost Center",{"$f":"IFERROR(VLOOKUP(I19,Data!A:H,7,0),\"\")","v":0}]
["Workdays",null,{"$f":"+M15","v":0}]
["Average Month Cost",null,{"$f":"+N15","v":0}]