{"text_format":"1","workbook":"xlsx","n_sheets":4,"sheets":["رقم1","رقم2","Sheet1","Sheet2"],"not_rendered":{"charts":0,"images":0,"macros":1,"external_links":0,"defined_names":0,"comments":0,"pivot_tables":0},"unopened":[],"bounds":{"document_bytes":16777216,"sheet_cells":100000,"rows_first":2000,"rows_last":500,"rows_between":2000,"halvings":0,"cell_chars":16384,"cell_head_chars":4096},"cells_cut":0,"cells_raw":0,"read":"whole","date_system":"1900"}

{"sheet":"رقم1","index":0,"n_rows":5,"n_cols":2,"rows_kept":5,"cut":false,"hidden":false,"merged":[]}
[1,"أحمد"]
[2,"محمد"]
[3,"سالم"]
[4,"سعيد"]
[6,"محمود"]

{"sheet":"رقم2","index":1,"n_rows":5,"n_cols":1,"rows_kept":5,"cut":false,"hidden":false,"merged":[]}
[1]
[2]
[3]
[4]
[6]

{"sheet":"Sheet1","index":2,"n_rows":18,"n_cols":2,"rows_kept":18,"cut":false,"hidden":false,"merged":[]}
[1,"أحمد"]
[2,"محمد"]
[3,"سالم"]
[4,"سعيد"]
[6,"محمود"]
[]
[]
[]
[]
[7,"تجربة1"]
[]
[]
[8,"تجربة2"]
[]
[9,"تجربة3"]
[]
[]
["officena","alsaeed"]

{"sheet":"Sheet2","index":3,"n_rows":25,"n_cols":2,"rows_kept":25,"cut":false,"hidden":false,"merged":[]}
[1,{"$f":"IF(A1<>\"\",IFERROR(INDEX(Sheet1!$B$1:$B$50000, MATCH(0, IF(A1=Sheet1!$A$1:$A$50000, COUNTIF(Sheet1!$C$1:$C1, Sheet1!$B$1:$B$50000), \"\"), 0)),\"\"),\"\")","v":"أحمد"}]
[2,{"$f":"IF(A2<>\"\",IFERROR(INDEX(Sheet1!$B$1:$B$50000, MATCH(0, IF(A2=Sheet1!$A$1:$A$50000, COUNTIF(Sheet1!$C$1:$C2, Sheet1!$B$1:$B$50000), \"\"), 0)),\"\"),\"\")","v":"محمد"}]
[3,{"$f":"IF(A3<>\"\",IFERROR(INDEX(Sheet1!$B$1:$B$50000, MATCH(0, IF(A3=Sheet1!$A$1:$A$50000, COUNTIF(Sheet1!$C$1:$C3, Sheet1!$B$1:$B$50000), \"\"), 0)),\"\"),\"\")","v":"سالم"}]
[4,{"$f":"IF(A4<>\"\",IFERROR(INDEX(Sheet1!$B$1:$B$50000, MATCH(0, IF(A4=Sheet1!$A$1:$A$50000, COUNTIF(Sheet1!$C$1:$C4, Sheet1!$B$1:$B$50000), \"\"), 0)),\"\"),\"\")","v":"سعيد"}]
[6,{"$f":"IF(A5<>\"\",IFERROR(INDEX(Sheet1!$B$1:$B$50000, MATCH(0, IF(A5=Sheet1!$A$1:$A$50000, COUNTIF(Sheet1!$C$1:$C5, Sheet1!$B$1:$B$50000), \"\"), 0)),\"\"),\"\")","v":"محمود"}]
[null,{"$f":"IF(A6<>\"\",IFERROR(INDEX(Sheet1!$B$1:$B$50000, MATCH(0, IF(A6=Sheet1!$A$1:$A$50000, COUNTIF(Sheet1!$C$1:$C6, Sheet1!$B$1:$B$50000), \"\"), 0)),\"\"),\"\")","v":""}]
[null,{"$f":"IF(A7<>\"\",IFERROR(INDEX(Sheet1!$B$1:$B$50000, MATCH(0, IF(A7=Sheet1!$A$1:$A$50000, COUNTIF(Sheet1!$C$1:$C7, Sheet1!$B$1:$B$50000), \"\"), 0)),\"\"),\"\")","v":""}]
[8,{"$f":"IF(A8<>\"\",IFERROR(INDEX(Sheet1!$B$1:$B$50000, MATCH(0, IF(A8=Sheet1!$A$1:$A$50000, COUNTIF(Sheet1!$C$1:$C8, Sheet1!$B$1:$B$50000), \"\"), 0)),\"\"),\"\")","v":"تجربة2"}]
[null,{"$f":"IF(A9<>\"\",IFERROR(INDEX(Sheet1!$B$1:$B$50000, MATCH(0, IF(A9=Sheet1!$A$1:$A$50000, COUNTIF(Sheet1!$C$1:$C9, Sheet1!$B$1:$B$50000), \"\"), 0)),\"\"),\"\")","v":""}]
[null,{"$f":"IF(A10<>\"\",IFERROR(INDEX(Sheet1!$B$1:$B$50000, MATCH(0, IF(A10=Sheet1!$A$1:$A$50000, COUNTIF(Sheet1!$C$1:$C10, Sheet1!$B$1:$B$50000), \"\"), 0)),\"\"),\"\")","v":""}]
[null,{"$f":"IF(A11<>\"\",IFERROR(INDEX(Sheet1!$B$1:$B$50000, MATCH(0, IF(A11=Sheet1!$A$1:$A$50000, COUNTIF(Sheet1!$C$1:$C11, Sheet1!$B$1:$B$50000), \"\"), 0)),\"\"),\"\")","v":""}]
[9,{"$f":"IF(A12<>\"\",IFERROR(INDEX(Sheet1!$B$1:$B$50000, MATCH(0, IF(A12=Sheet1!$A$1:$A$50000, COUNTIF(Sheet1!$C$1:$C12, Sheet1!$B$1:$B$50000), \"\"), 0)),\"\"),\"\")","v":"تجربة3"}]
[null,{"$f":"IF(A13<>\"\",IFERROR(INDEX(Sheet1!$B$1:$B$50000, MATCH(0, IF(A13=Sheet1!$A$1:$A$50000, COUNTIF(Sheet1!$C$1:$C13, Sheet1!$B$1:$B$50000), \"\"), 0)),\"\"),\"\")","v":""}]
[null,{"$f":"IF(A14<>\"\",IFERROR(INDEX(Sheet1!$B$1:$B$50000, MATCH(0, IF(A14=Sheet1!$A$1:$A$50000, COUNTIF(Sheet1!$C$1:$C14, Sheet1!$B$1:$B$50000), \"\"), 0)),\"\"),\"\")","v":""}]
[null,{"$f":"IF(A15<>\"\",IFERROR(INDEX(Sheet1!$B$1:$B$50000, MATCH(0, IF(A15=Sheet1!$A$1:$A$50000, COUNTIF(Sheet1!$C$1:$C15, Sheet1!$B$1:$B$50000), \"\"), 0)),\"\"),\"\")","v":""}]
[null,{"$f":"IF(A16<>\"\",IFERROR(INDEX(Sheet1!$B$1:$B$50000, MATCH(0, IF(A16=Sheet1!$A$1:$A$50000, COUNTIF(Sheet1!$C$1:$C16, Sheet1!$B$1:$B$50000), \"\"), 0)),\"\"),\"\")","v":""}]
[null,{"$f":"IF(A17<>\"\",IFERROR(INDEX(Sheet1!$B$1:$B$50000, MATCH(0, IF(A17=Sheet1!$A$1:$A$50000, COUNTIF(Sheet1!$C$1:$C17, Sheet1!$B$1:$B$50000), \"\"), 0)),\"\"),\"\")","v":""}]
[null,{"$f":"IF(A18<>\"\",IFERROR(INDEX(Sheet1!$B$1:$B$50000, MATCH(0, IF(A18=Sheet1!$A$1:$A$50000, COUNTIF(Sheet1!$C$1:$C18, Sheet1!$B$1:$B$50000), \"\"), 0)),\"\"),\"\")","v":""}]
[null,{"$f":"IF(A19<>\"\",IFERROR(INDEX(Sheet1!$B$1:$B$50000, MATCH(0, IF(A19=Sheet1!$A$1:$A$50000, COUNTIF(Sheet1!$C$1:$C19, Sheet1!$B$1:$B$50000), \"\"), 0)),\"\"),\"\")","v":""}]
[null,{"$f":"IF(A20<>\"\",IFERROR(INDEX(Sheet1!$B$1:$B$50000, MATCH(0, IF(A20=Sheet1!$A$1:$A$50000, COUNTIF(Sheet1!$C$1:$C20, Sheet1!$B$1:$B$50000), \"\"), 0)),\"\"),\"\")","v":""}]
[7,{"$f":"IF(A21<>\"\",IFERROR(INDEX(Sheet1!$B$1:$B$50000, MATCH(0, IF(A21=Sheet1!$A$1:$A$50000, COUNTIF(Sheet1!$C$1:$C21, Sheet1!$B$1:$B$50000), \"\"), 0)),\"\"),\"\")","v":"تجربة1"}]
[null,{"$f":"IF(A22<>\"\",IFERROR(INDEX(Sheet1!$B$1:$B$50000, MATCH(0, IF(A22=Sheet1!$A$1:$A$50000, COUNTIF(Sheet1!$C$1:$C22, Sheet1!$B$1:$B$50000), \"\"), 0)),\"\"),\"\")","v":""}]
["officena",{"$f":"IF(A23<>\"\",IFERROR(INDEX(Sheet1!$B$1:$B$50000, MATCH(0, IF(A23=Sheet1!$A$1:$A$50000, COUNTIF(Sheet1!$C$1:$C23, Sheet1!$B$1:$B$50000), \"\"), 0)),\"\"),\"\")","v":"alsaeed"}]
[null,{"$f":"IF(A24<>\"\",IFERROR(INDEX(Sheet1!$B$1:$B$50000, MATCH(0, IF(A24=Sheet1!$A$1:$A$50000, COUNTIF(Sheet1!$C$1:$C24, Sheet1!$B$1:$B$50000), \"\"), 0)),\"\"),\"\")","v":""}]
[null,{"$f":"IF(A25<>\"\",IFERROR(INDEX(Sheet1!$B$1:$B$50000, MATCH(0, IF(A25=Sheet1!$A$1:$A$50000, COUNTIF(Sheet1!$C$1:$C25, Sheet1!$B$1:$B$50000), \"\"), 0)),\"\"),\"\")","v":""}]