{"text_format":"1","workbook":"xlsx","n_sheets":3,"sheets":["الرئيسي","القيود","كشف الترحيل"],"not_rendered":{"charts":0,"images":0,"macros":1,"external_links":0,"defined_names":0,"comments":0,"pivot_tables":0},"unopened":[],"bounds":{"document_bytes":16777216,"sheet_cells":100000,"rows_first":2000,"rows_last":500,"rows_between":2000,"halvings":0,"cell_chars":16384,"cell_head_chars":4096},"cells_cut":0,"cells_raw":0,"read":"whole","date_system":"1900"}

{"sheet":"الرئيسي","index":0,"n_rows":26,"n_cols":5,"rows_kept":26,"cut":false,"hidden":false,"merged":[]}
[]
[null,null,5]
[]
[]
[]
[]
[]
[]
[]
[]
[]
[]
[]
[]
[null,null,"يوم الحضور","الكود","الاسم"]
[null,null,5,"S1001","محمد"]
[null,null,5,"S1002","أحمد"]
[null,null,5,"S1003","محمود"]
[null,null,null,"S1004","حسن"]
[null,null,5,"S1005","خالد"]
[null,null,null,"S1006","السيد"]
[null,null,null,"S1007","ياسين"]
[null,null,null,"S1008","يوسف"]
[null,null,null,"S1009","على"]
[null,null,5,"S1010","أكرم"]
[null,null,null,"S1011","حسن"]

{"sheet":"القيود","index":1,"n_rows":14,"n_cols":14,"rows_kept":14,"cut":false,"hidden":false,"merged":[]}
[]
[]
[]
[]
[]
[]
[]
[]
[]
[null,null,null,null,"المجموعات"]
[null,null,null,null,"الاولى","الثانية","الثالثة","الرابعة","الخامسة","السادسة","السابعة","الثامنة","التاسعة","العاشرة"]
[null,null,null,null,"S1003","S1002","S1007","S201","S305","S304"]
[null,null,null,null,"S1005","S1010","S1011"]
[null,null,null,null,"S1020"]

{"sheet":"كشف الترحيل","index":2,"n_rows":14,"n_cols":12,"rows_kept":14,"cut":false,"hidden":false,"merged":[]}
[null,null,null,null,null,null,null,null,null,null,null,{"$f":"الرئيسي!C2","v":5}]
[null,null,"الكود","الاسم","الحالة","رقم التليلفون"]
[null,null,{"$f":"IF(COUNTIF(الرئيسي!$C$16:$C$560,$L$1)<ROWS(B$1:B1),\"\",INDEX(الرئيسي!$D$16:$D$560,100000-SUMPRODUCT(LARGE((الرئيسي!$C$16:$C$560=$L$1)*(100000-ROW(الرئيسي!$C$16:$C$560)),ROWS(B$1:B1)))-15))","v":"S1001"},{"$f":"IF(COUNTIF(الرئيسي!$C$16:$C$560,$L$1)<ROWS(B$1:B1),\"\",INDEX(الرئيسي!$E$16:$E$560,100000-SUMPRODUCT(LARGE((الرئيسي!$C$16:$C$560=$L$1)*(100000-ROW(الرئيسي!$C$16:$C$560)),ROWS(B$1:B1)))-15))","v":"محمد"}]
[null,null,{"$f":"IF(COUNTIF(الرئيسي!$C$16:$C$560,$L$1)<ROWS(B$1:B2),\"\",INDEX(الرئيسي!$D$16:$D$560,100000-SUMPRODUCT(LARGE((الرئيسي!$C$16:$C$560=$L$1)*(100000-ROW(الرئيسي!$C$16:$C$560)),ROWS(B$1:B2)))-15))","v":"S1002"},{"$f":"IF(COUNTIF(الرئيسي!$C$16:$C$560,$L$1)<ROWS(B$1:B2),\"\",INDEX(الرئيسي!$E$16:$E$560,100000-SUMPRODUCT(LARGE((الرئيسي!$C$16:$C$560=$L$1)*(100000-ROW(الرئيسي!$C$16:$C$560)),ROWS(B$1:B2)))-15))","v":"أحمد"}]
[null,null,{"$f":"IF(COUNTIF(الرئيسي!$C$16:$C$560,$L$1)<ROWS(B$1:B3),\"\",INDEX(الرئيسي!$D$16:$D$560,100000-SUMPRODUCT(LARGE((الرئيسي!$C$16:$C$560=$L$1)*(100000-ROW(الرئيسي!$C$16:$C$560)),ROWS(B$1:B3)))-15))","v":"S1003"},{"$f":"IF(COUNTIF(الرئيسي!$C$16:$C$560,$L$1)<ROWS(B$1:B3),\"\",INDEX(الرئيسي!$E$16:$E$560,100000-SUMPRODUCT(LARGE((الرئيسي!$C$16:$C$560=$L$1)*(100000-ROW(الرئيسي!$C$16:$C$560)),ROWS(B$1:B3)))-15))","v":"محمود"}]
[null,null,{"$f":"IF(COUNTIF(الرئيسي!$C$16:$C$560,$L$1)<ROWS(B$1:B4),\"\",INDEX(الرئيسي!$D$16:$D$560,100000-SUMPRODUCT(LARGE((الرئيسي!$C$16:$C$560=$L$1)*(100000-ROW(الرئيسي!$C$16:$C$560)),ROWS(B$1:B4)))-15))","v":"S1005"},{"$f":"IF(COUNTIF(الرئيسي!$C$16:$C$560,$L$1)<ROWS(B$1:B4),\"\",INDEX(الرئيسي!$E$16:$E$560,100000-SUMPRODUCT(LARGE((الرئيسي!$C$16:$C$560=$L$1)*(100000-ROW(الرئيسي!$C$16:$C$560)),ROWS(B$1:B4)))-15))","v":"خالد"}]
[null,null,{"$f":"IF(COUNTIF(الرئيسي!$C$16:$C$560,$L$1)<ROWS(B$1:B5),\"\",INDEX(الرئيسي!$D$16:$D$560,100000-SUMPRODUCT(LARGE((الرئيسي!$C$16:$C$560=$L$1)*(100000-ROW(الرئيسي!$C$16:$C$560)),ROWS(B$1:B5)))-15))","v":"S1010"},{"$f":"IF(COUNTIF(الرئيسي!$C$16:$C$560,$L$1)<ROWS(B$1:B5),\"\",INDEX(الرئيسي!$E$16:$E$560,100000-SUMPRODUCT(LARGE((الرئيسي!$C$16:$C$560=$L$1)*(100000-ROW(الرئيسي!$C$16:$C$560)),ROWS(B$1:B5)))-15))","v":"أكرم"}]
[null,null,{"$f":"IF(COUNTIF(الرئيسي!$C$16:$C$560,$L$1)<ROWS(B$1:B6),\"\",INDEX(الرئيسي!$D$16:$D$560,100000-SUMPRODUCT(LARGE((الرئيسي!$C$16:$C$560=$L$1)*(100000-ROW(الرئيسي!$C$16:$C$560)),ROWS(B$1:B6)))-15))","v":""},{"$f":"IF(COUNTIF(الرئيسي!$C$16:$C$560,$L$1)<ROWS(B$1:B6),\"\",INDEX(الرئيسي!$E$16:$E$560,100000-SUMPRODUCT(LARGE((الرئيسي!$C$16:$C$560=$L$1)*(100000-ROW(الرئيسي!$C$16:$C$560)),ROWS(B$1:B6)))-15))","v":""}]
[null,null,{"$f":"IF(COUNTIF(الرئيسي!$C$16:$C$560,$L$1)<ROWS(B$1:B7),\"\",INDEX(الرئيسي!$D$16:$D$560,100000-SUMPRODUCT(LARGE((الرئيسي!$C$16:$C$560=$L$1)*(100000-ROW(الرئيسي!$C$16:$C$560)),ROWS(B$1:B7)))-15))","v":""},{"$f":"IF(COUNTIF(الرئيسي!$C$16:$C$560,$L$1)<ROWS(B$1:B7),\"\",INDEX(الرئيسي!$E$16:$E$560,100000-SUMPRODUCT(LARGE((الرئيسي!$C$16:$C$560=$L$1)*(100000-ROW(الرئيسي!$C$16:$C$560)),ROWS(B$1:B7)))-15))","v":""}]
[null,null,{"$f":"IF(COUNTIF(الرئيسي!$C$16:$C$560,$L$1)<ROWS(B$1:B8),\"\",INDEX(الرئيسي!$D$16:$D$560,100000-SUMPRODUCT(LARGE((الرئيسي!$C$16:$C$560=$L$1)*(100000-ROW(الرئيسي!$C$16:$C$560)),ROWS(B$1:B8)))-15))","v":""},{"$f":"IF(COUNTIF(الرئيسي!$C$16:$C$560,$L$1)<ROWS(B$1:B8),\"\",INDEX(الرئيسي!$E$16:$E$560,100000-SUMPRODUCT(LARGE((الرئيسي!$C$16:$C$560=$L$1)*(100000-ROW(الرئيسي!$C$16:$C$560)),ROWS(B$1:B8)))-15))","v":""}]
[null,null,{"$f":"IF(COUNTIF(الرئيسي!$C$16:$C$560,$L$1)<ROWS(B$1:B9),\"\",INDEX(الرئيسي!$D$16:$D$560,100000-SUMPRODUCT(LARGE((الرئيسي!$C$16:$C$560=$L$1)*(100000-ROW(الرئيسي!$C$16:$C$560)),ROWS(B$1:B9)))-15))","v":""},{"$f":"IF(COUNTIF(الرئيسي!$C$16:$C$560,$L$1)<ROWS(B$1:B9),\"\",INDEX(الرئيسي!$E$16:$E$560,100000-SUMPRODUCT(LARGE((الرئيسي!$C$16:$C$560=$L$1)*(100000-ROW(الرئيسي!$C$16:$C$560)),ROWS(B$1:B9)))-15))","v":""}]
[null,null,{"$f":"IF(COUNTIF(الرئيسي!$C$16:$C$560,$L$1)<ROWS(B$1:B10),\"\",INDEX(الرئيسي!$D$16:$D$560,100000-SUMPRODUCT(LARGE((الرئيسي!$C$16:$C$560=$L$1)*(100000-ROW(الرئيسي!$C$16:$C$560)),ROWS(B$1:B10)))-15))","v":""},{"$f":"IF(COUNTIF(الرئيسي!$C$16:$C$560,$L$1)<ROWS(B$1:B10),\"\",INDEX(الرئيسي!$E$16:$E$560,100000-SUMPRODUCT(LARGE((الرئيسي!$C$16:$C$560=$L$1)*(100000-ROW(الرئيسي!$C$16:$C$560)),ROWS(B$1:B10)))-15))","v":""}]
[null,null,{"$f":"IF(COUNTIF(الرئيسي!$C$16:$C$560,$L$1)<ROWS(B$1:B11),\"\",INDEX(الرئيسي!$D$16:$D$560,100000-SUMPRODUCT(LARGE((الرئيسي!$C$16:$C$560=$L$1)*(100000-ROW(الرئيسي!$C$16:$C$560)),ROWS(B$1:B11)))-15))","v":""},{"$f":"IF(COUNTIF(الرئيسي!$C$16:$C$560,$L$1)<ROWS(B$1:B11),\"\",INDEX(الرئيسي!$E$16:$E$560,100000-SUMPRODUCT(LARGE((الرئيسي!$C$16:$C$560=$L$1)*(100000-ROW(الرئيسي!$C$16:$C$560)),ROWS(B$1:B11)))-15))","v":""}]
[null,null,{"$f":"IF(COUNTIF(الرئيسي!$C$16:$C$560,$L$1)<ROWS(B$1:B12),\"\",INDEX(الرئيسي!$D$16:$D$560,100000-SUMPRODUCT(LARGE((الرئيسي!$C$16:$C$560=$L$1)*(100000-ROW(الرئيسي!$C$16:$C$560)),ROWS(B$1:B12)))-15))","v":""},{"$f":"IF(COUNTIF(الرئيسي!$C$16:$C$560,$L$1)<ROWS(B$1:B12),\"\",INDEX(الرئيسي!$E$16:$E$560,100000-SUMPRODUCT(LARGE((الرئيسي!$C$16:$C$560=$L$1)*(100000-ROW(الرئيسي!$C$16:$C$560)),ROWS(B$1:B12)))-15))","v":""}]