{"text_format":"1","workbook":"xlsx","n_sheets":11,"sheets":["Attendance","PivotTable","Tray","Edb","EvalReport","Data","Report","Evaluation (2)","Att2","Attendance (2)","10-2022"],"not_rendered":{"charts":9,"images":17,"macros":1,"external_links":0,"defined_names":79,"comments":0,"pivot_tables":10},"unopened":[],"bounds":{"document_bytes":16777216,"sheet_cells":100000,"rows_first":2000,"rows_last":500,"rows_between":2000,"halvings":0,"cell_chars":16384,"cell_head_chars":4096},"cells_cut":0,"cells_raw":0,"read":"whole","date_system":"1900"}

{"sheet":"Attendance","index":0,"n_rows":28,"n_cols":52,"rows_kept":28,"cut":false,"hidden":false,"merged":[[9,5,11,10],[11,14,11,16],[11,18,11,20],[11,22,11,24],[11,26,11,28],[11,34,11,36],[11,38,11,40],[14,44,15,51],[16,44,16,51],[6,20,6,24],[6,26,6,30],[7,20,7,24],[7,26,7,30],[11,30,11,32]]}
[]
[]
[]
[]
[]
[]
[null,null,null,null,null,null,null,null,null,null,null,null,null,null,null,null,null,null,null,null,"الشهر ",null,null,null,null,null,"السنة"]
[null,null,null,null,null,null,null,null,null,null,null,null,null,null,null,null,null,null,null,null,11,null,null,null,null,null,2022]
[]
[null,null,null,null,null,"حضور الموظفين",null,null,null,null,null,null,null,null,null,null,null,null,null,null,{"$f":"(U8&\"-\"&AA8)","v":"11-2022"}]
[]
[null,null,null,null,null,null,null,null,null,null,null,null,"مفتاح نوع الغياب ",1,"إجازة إعتيادية ",null,null,2,"إجازة مرضية ",null,null,3,"استئذان ",null,null,4,"تأخير ",null,null,5,"غياب ",null,null,6,"مكلف خارج الإدارة",null,null,7,"دورة "]
[]
[]
[null,null,null,null,null,null,null,null,null,null,null,null,null,null,null,null,null,null,null,null,null,null,null,null,null,null,null,null,null,null,null,null,null,null,null,null,null,null,null,null,null,null,null,null,{"$f":"DATE($AA8,$U8,COLUMN(A:A))","v":"2022-11-01"}]
[]
[null,null,null,null,null,null,null,null,null,null,null,null,null,{"$f":"TEXT(N18,\"DDD\")","v":"الثلاثاء"},{"$f":"TEXT(O18,\"DDD\")","v":"الأربعاء"},"الخميس","الجمعة","السبت","الأحد","الإثنين","الثلاثاء","الأربعاء","الخميس","الجمعة","السبت","الأحد","الإثنين","الثلاثاء","الأربعاء","الخميس","الجمعة","السبت","الأحد","الإثنين","الثلاثاء","الأربعاء","الخميس","الجمعة","السبت","الأحد","الإثنين","الثلاثاء","الأربعاء","الخميس","إجمالي الحضور و الإنصراف "]
[null,null,null,null,null,null,null,null,null,null,null,null,"اسم الموظف",{"$f":"DATE($AA8,$U8,COLUMN(A:A))","v":"2022-11-01"},{"$f":"DATE($AA8,$U8,COLUMN(B:B))","v":"2022-11-02"},{"$f":"DATE($AA8,$U8,COLUMN(C:C))","v":"2022-11-03"},{"$f":"DATE($AA8,$U8,COLUMN(D:D))","v":"2022-11-04"},{"$f":"DATE($AA8,$U8,COLUMN(E:E))","v":"2022-11-05"},{"$f":"DATE($AA8,$U8,COLUMN(F:F))","v":"2022-11-06"},{"$f":"DATE($AA8,$U8,COLUMN(G:G))","v":"2022-11-07"},{"$f":"DATE($AA8,$U8,COLUMN(H:H))","v":"2022-11-08"},{"$f":"DATE($AA8,$U8,COLUMN(I:I))","v":"2022-11-09"},{"$f":"DATE($AA8,$U8,COLUMN(J:J))","v":"2022-11-10"},{"$f":"DATE($AA8,$U8,COLUMN(K:K))","v":"2022-11-11"},{"$f":"DATE($AA8,$U8,COLUMN(L:L))","v":"2022-11-12"},{"$f":"DATE($AA8,$U8,COLUMN(M:M))","v":"2022-11-13"},{"$f":"DATE($AA8,$U8,COLUMN(N:N))","v":"2022-11-14"},{"$f":"DATE($AA8,$U8,COLUMN(O:O))","v":"2022-11-15"},{"$f":"DATE($AA8,$U8,COLUMN(P:P))","v":"2022-11-16"},{"$f":"DATE($AA8,$U8,COLUMN(Q:Q))","v":"2022-11-17"},{"$f":"DATE($AA8,$U8,COLUMN(R:R))","v":"2022-11-18"},{"$f":"DATE($AA8,$U8,COLUMN(S:S))","v":"2022-11-19"},{"$f":"DATE($AA8,$U8,COLUMN(T:T))","v":"2022-11-20"},{"$f":"DATE($AA8,$U8,COLUMN(U:U))","v":"2022-11-21"},{"$f":"DATE($AA8,$U8,COLUMN(V:V))","v":"2022-11-22"},{"$f":"DATE($AA8,$U8,COLUMN(W:W))","v":"2022-11-23"},{"$f":"DATE($AA8,$U8,COLUMN(X:X))","v":"2022-11-24"},{"$f":"DATE($AA8,$U8,COLUMN(Y:Y))","v":"2022-11-25"},{"$f":"DATE($AA8,$U8,COLUMN(Z:Z))","v":"2022-11-26"},{"$f":"DATE($AA8,$U8,COLUMN(AA:AA))","v":"2022-11-27"},{"$f":"DATE($AA8,$U8,COLUMN(AB:AB))","v":"2022-11-28"},{"$f":"DATE($AA8,$U8,COLUMN(AC:AC))","v":"2022-11-29"},{"$f":"DATE($AA8,$U8,COLUMN(AD:AD))","v":"2022-11-30"},{"$f":"DATE($AA8,$U8,COLUMN(AE:AE))","v":"2022-12-01"},{"$f":"KeyVacationLable","v":"إجازة إعتيادية "},{"$f":"KeySickLable","v":"إجازة مرضية "},{"$f":"KeyPermissionLable","v":"استئذان "},{"$f":"KeyDelayLable","v":"تأخير "},{"$f":"KeyAbsenceLable","v":"غياب "},{"$f":"KeyWorkLable","v":"مكلف خارج الإدارة"},{"$f":"KeyCourseLable","v":"دورة "},"الإجمالي"]
[null,null,null,null,null,null,null,null,null,null,null,null,"أحمد حمدي ",null,null,null,null,null,null,null,null,null,null,null,null,null,null,null,null,null,null,null,null,null,null,null,null,null,null,null,null,null,null,null,{"$f":"COUNTIF($N19:$AR19,\"1\")","v":0},{"$f":"COUNTIF($N19:$AR19,\"2\")","v":0},{"$f":"COUNTIF($N19:$AR19,\"3\")","v":0},{"$f":"COUNTIF($N19:$AR19,\"4\")","v":0},{"$f":"COUNTIF($N19:$AR19,\"5\")","v":0},{"$f":"COUNTIF($N19:$AR19,\"6\")","v":0},{"$f":"COUNTIF($N19:$AR19,\"7\")","v":0},{"$f":"COUNTA($N19:$AR19)","v":0}]
[null,null,null,null,null,null,null,null,null,null,null,null,"خالد الطويل "]
{"$rows_left_out":9}
{"sheet":"PivotTable","index":1,"n_rows":116,"n_cols":9,"rows_kept":116,"cut":false,"hidden":true,"merged":[]}
[]
[]
[null,"تسميات الأعمدة"]
["تسميات الصفوف",2022,"الإجمالي الكلي"]
["oct"]
["الإجمالي الكلي"]
[]
[]
[]
[]
[]
[]
[]
[]
[]
[]
[]
[]
["تسميات الصفوف","مجموع من درجة تقييم الأداء  "]
["سلمان بن إبراهيم الزهراني ",0.68]
{"$rows_left_out":97}
{"sheet":"Tray","index":2,"n_rows":35,"n_cols":21,"rows_kept":35,"cut":false,"hidden":true,"merged":[]}
[]
[]
[]
[]
[]
[null,null,null,null,null,{"$f":"EvaluationReport","v":{"$error":"#REF!"}},{"$f":"EvaluationReport","v":{"$error":"#REF!"}},{"$f":"EvaluationReport","v":{"$error":"#REF!"}},{"$f":"EvaluationReport","v":{"$error":"#REF!"}},{"$f":"EvaluationReport","v":{"$error":"#REF!"}},{"$f":"EvaluationReport","v":{"$error":"#REF!"}}]
[]
[null,null,null,null,null,null,null,null,null,null,null,null,null,null,null,null,{"$f":"IDs","v":{"$error":"#REF!"}}]
[]
[]
[]
[]
[null,null,null,null,null,null,null,null,null,null,null,{"$f":"IDs","v":{"$error":"#REF!"}}]
[]
[]
[]
[]
[]
[null,null,null,null,null,{"$f":"IDs","v":{"$error":"#REF!"}}]
[]
{"$rows_left_out":16}
{"sheet":"Edb","index":3,"n_rows":21,"n_cols":24,"rows_kept":21,"cut":false,"hidden":true,"merged":[[9,4,11,9]]}
[]
[]
[]
[3]
[]
[]
[]
[]
[]
[null,null,null,null,"تقييم أداء وحضور الموظفين"]
[]
[]
[]
[null,null,null,null,null,null,null,null,null,null,null,"الرقم الوظيفي ","اسم الموظف ","الشعبة / القسم ","الرتبة / المرتبة ","السنة ","الشهر ","المعرفة الفنية بمجال العمل ","جودة مخرجات العمل ","توثيق المستندات ","إعداد / تقديم التقارير ","علاقة الموظف مع إدارته وزملائه ","درجة تقييم الأداء  ","تقييم الأداء النهائي"]
[1,null,null,null,null,null,null,null,null,null,null,1,"عمر بن فوزان المحارب ","شعبة الحيز الفضائي","نقيب",2022,"oct",5,5,5,5,5,1," عالي جداً "]
[2,null,null,null,null,null,null,null,null,null,null,2,"عبدالكريم بن مبروك الطويرقي","شعبة الحيز الفضائي","نقيب",2022,"oct",4,4,5,5,5,0.91999999999999993," عالي جداً "]
[3,null,null,null,null,null,null,null,null,null,null,3,"سلمان بن إبراهيم الزهراني ","شعبة الحيز الفضائي","نقيب",2022,"oct",4,4,3,3,3,0.68," يحقق التوقعات "]
[4,null,null,null,null,null,null,null,null,null,null,4,"حسن بن عبدالعزيز زقزوق ","شعبة الحيز الفضائي","التاسعة",2022,"oct",3,3,2,2,2,0.48000000000000004," أقل من المتوقع "]
[5,null,null,null,null,null,null,null,null,null,null,5,"مهنا بن ناصر العتيبي ","شعبة الحيز الفضائي","ملازم أول",2022,"oct",2,1,1,1,2,0.28000000000000003,"يحتاج تطوير"]
[6,null,null,null,null,null,null,null,null,null,null,1,"عمر بن فوزان المحارب ","شعبة الحيز الفضائي","نقيب",2022,"sep",1,1,1,2,5,0.4," أقل من المتوقع "]
{"$rows_left_out":2}
{"sheet":"EvalReport","index":4,"n_rows":24,"n_cols":30,"rows_kept":24,"cut":false,"hidden":true,"merged":[[20,27,20,28],[22,27,22,28],[20,29,20,30],[22,29,22,30],[9,4,11,9],[20,15,20,16],[22,15,22,16],[20,17,20,21],[22,17,22,21],[12,14,15,34]]}
[]
[]
[null,null,null,null,null,null,null,null,null,null,null,null,null,null,null,null,null,null,null,null,null,null,2022]
[]
[]
[]
[]
[]
[]
[null,null,null,null,"تقييم أداء وحضور الموظفين "]
[]
[]
[null,null,null,null,null,null,null,null,null,null,null,null,null,null,"تقييم الأداء الوظيفي"]
[]
[]
[]
[]
[]
[]
[]
{"$rows_left_out":5}
{"sheet":"Data","index":5,"n_rows":10,"n_cols":9,"rows_kept":10,"cut":false,"hidden":true,"merged":[]}
[]
[]
[]
[null,null,"الرقم الوظيفي ",{"$f":"EvalReport!G24","v":1}]
[]
[null,null,"الشهر ",{"$f":"EvalReport!AD21","v":"sep"}]
[null,null,"السنة",{"$f":"EvalReport!AD23","v":2022}]
[]
[null,null,"المعرفة الفنية بمجال العمل ","جودة مخرجات العمل ","توثيق المستندات ","إعداد / تقديم التقارير ","علاقة الموظف مع إدارته وزملائه ","درجة تقييم الأداء ","تقييم الأداء النهائي "]
[null,null,{"$f":"VLOOKUP(D4&D6,EvaluationReport,7,0)","v":{"$error":"#REF!"}},{"$f":"VLOOKUP($D$4,EvaluationReport,8,0)","v":{"$error":"#REF!"}},{"$f":"VLOOKUP($D$4,EvaluationReport,9,0)","v":{"$error":"#REF!"}},{"$f":"VLOOKUP($D$4,EvaluationReport,10,0)","v":{"$error":"#REF!"}},{"$f":"VLOOKUP($D$4,EvaluationReport,11,0)","v":{"$error":"#REF!"}},{"$f":"VLOOKUP($D$4,EvaluationReport,12,0)","v":{"$error":"#REF!"}},{"$f":"VLOOKUP($D$4,EvaluationReport,13,0)","v":{"$error":"#REF!"}}]

{"sheet":"Report","index":6,"n_rows":24,"n_cols":23,"rows_kept":24,"cut":false,"hidden":true,"merged":[[9,5,11,8]]}
[]
[]
[null,null,null,null,null,null,null,null,null,null,null,null,null,null,null,null,null,null,null,null,null,null,2022]
[]
[]
[]
[]
[null,null,null,null,null,null,null,null,null,null,null,null,null,null,null,null,null,null,null,null,3]
[]
[null,null,null,null,null,"إدارة أداء الموظفين "]
[]
[]
[]
[]
[]
[]
[]
[]
[]
[]
{"$rows_left_out":5}
{"sheet":"Evaluation (2)","index":7,"n_rows":38,"n_cols":39,"rows_kept":38,"cut":false,"hidden":true,"merged":[[9,5,11,8],[12,14,15,34],[17,15,17,33],[19,16,19,18],[19,19,19,22],[19,25,19,27],[19,28,19,32],[21,16,21,18],[21,19,21,22],[21,25,21,27],[21,28,21,32],[23,16,23,18],[23,19,23,22],[23,25,23,27],[23,28,23,32],[29,17,29,18],[29,19,29,24],[29,25,29,26],[29,27,29,28],[29,29,29,30],[28,17,28,18],[28,19,28,24],[28,25,28,26],[28,27,28,28],[28,29,28,30],[31,17,31,18],[31,19,31,24],[31,25,31,26],[31,27,31,28],[31,29,31,30],[30,17,30,18],[30,19,30,24],[30,25,30,26],[30,27,30,28],[30,29,30,30],[34,29,34,30],[36,21,36,27],[37,21,37,27],[32,17,32,18],[32,19,32,24],[32,25,32,26],[32,27,32,28],[34,17,34,24],[34,25,34,26],[34,27,34,28],[32,29,32,30],[33,17,33,18],[33,19,33,24],[33,25,33,26],[33,27,33,28],[33,29,33,30]]}
[]
[]
[null,null,null,null,null,null,null,null,null,null,null,null,null,null,null,null,null,null,null,null,null,null,2022]
[]
[]
[]
[]
[]
[]
[null,null,null,null,null,"إدارة أداء الموظفين "]
[]
[]
[null,null,null,null,null,null,null,null,null,null,null,null,null,null,"نموذج تقييم أداء الموظف "]
[]
[]
[]
[]
[null,null,null,null,null,null,null,null,null,null,null,null,null,null,null,"بيانات الموظفين "]
[]
[null,null,null,null,null,null,null,null,null,null,null,null,null,null,null,null,"الرقم الوظيفي ",null,null,{"$f":"G24","v":0},null,null,null,null,null,"اسم الموظف",null,null,{"$f":"IFERROR(VLOOKUP(G24,#REF!,3,0),\"\")","v":""}]
{"$rows_left_out":19}
{"sheet":"Att2","index":8,"n_rows":28,"n_cols":52,"rows_kept":28,"cut":false,"hidden":true,"merged":[[10,30,10,32],[10,38,10,40],[16,44,16,51],[6,20,6,23],[6,27,6,30],[7,27,7,30],[7,20,7,23],[14,44,15,51],[10,34,10,36],[9,5,11,10],[10,14,10,16],[10,18,10,20],[10,22,10,24],[10,26,10,28]]}
[]
[]
[null,null,null,null,null,null,null,null,null,null,null,null,null,null,null,null,null,null,null,null,null,null,null,null,2022]
[]
[]
[]
[null,null,null,null,null,null,null,null,null,null,null,null,null,null,null,null,null,null,null,null,"الشهر",null,null,null,null,null,null,"السنة"]
[null,null,null,null,null,null,null,null,null,null,null,null,null,null,null,null,null,null,null,null,6,null,null,null,null,null,null,2023]
[]
[null,null,null,null,null,"تقييم أداء وحضور الموظفين"]
[null,null,null,null,null,null,null,null,null,null,null,null,"مفتاح نوع الغياب ",1,"إجازة إعتيادية ",null,null,2,"إجازة مرضية ",null,null,3,"استئذان ",null,null,4,"تأخير ",null,null,5,"غياب ",null,null,6,"مكلف خارج الإدارة",null,null,7,"دورة "]
[]
[]
[]
[null,null,null,null,null,null,null,null,null,null,null,null,null,null,null,null,null,null,null,null,null,null,null,null,null,null,null,null,null,null,null,null,null,null,null,null,null,null,null,null,null,null,null,null,{"$f":"DATE($AB8,$U8,COLUMN(A:A))","v":"2023-06-01"}]
[]
[null,null,null,null,null,null,null,null,null,null,null,null,null,{"$f":"TEXT(N18,\"DDD\")","v":"الخميس"},{"$f":"TEXT(O18,\"DDD\")","v":"الجمعة"},"السبت","الأحد","الإثنين","الثلاثاء","الأربعاء","الخميس","الجمعة","السبت","الأحد","الإثنين","الثلاثاء","الأربعاء","الخميس","الجمعة","السبت","الأحد","الإثنين","الثلاثاء","الأربعاء","الخميس","الجمعة","السبت","الأحد","الإثنين","الثلاثاء","الأربعاء","الخميس","الجمعة","السبت","إجمالي الحضور و الإنصراف "]
[null,null,null,null,null,null,null,null,null,null,null,null,"اسم الموظف",{"$f":"DATE($AB8,$U8,COLUMN(A:A))","v":"2023-06-01"},{"$f":"DATE($AB8,$U8,COLUMN(B:B))","v":"2023-06-02"},{"$f":"DATE($AB8,$U8,COLUMN(C:C))","v":"2023-06-03"},{"$f":"DATE($AB8,$U8,COLUMN(D:D))","v":"2023-06-04"},{"$f":"DATE($AB8,$U8,COLUMN(E:E))","v":"2023-06-05"},{"$f":"DATE($AB8,$U8,COLUMN(F:F))","v":"2023-06-06"},{"$f":"DATE($AB8,$U8,COLUMN(G:G))","v":"2023-06-07"},{"$f":"DATE($AB8,$U8,COLUMN(H:H))","v":"2023-06-08"},{"$f":"DATE($AB8,$U8,COLUMN(I:I))","v":"2023-06-09"},{"$f":"DATE($AB8,$U8,COLUMN(J:J))","v":"2023-06-10"},{"$f":"DATE($AB8,$U8,COLUMN(K:K))","v":"2023-06-11"},{"$f":"DATE($AB8,$U8,COLUMN(L:L))","v":"2023-06-12"},{"$f":"DATE($AB8,$U8,COLUMN(M:M))","v":"2023-06-13"},{"$f":"DATE($AB8,$U8,COLUMN(N:N))","v":"2023-06-14"},{"$f":"DATE($AB8,$U8,COLUMN(O:O))","v":"2023-06-15"},{"$f":"DATE($AB8,$U8,COLUMN(P:P))","v":"2023-06-16"},{"$f":"DATE($AB8,$U8,COLUMN(Q:Q))","v":"2023-06-17"},{"$f":"DATE($AB8,$U8,COLUMN(R:R))","v":"2023-06-18"},{"$f":"DATE($AB8,$U8,COLUMN(S:S))","v":"2023-06-19"},{"$f":"DATE($AB8,$U8,COLUMN(T:T))","v":"2023-06-20"},{"$f":"DATE($AB8,$U8,COLUMN(U:U))","v":"2023-06-21"},{"$f":"DATE($AB8,$U8,COLUMN(V:V))","v":"2023-06-22"},{"$f":"DATE($AB8,$U8,COLUMN(W:W))","v":"2023-06-23"},{"$f":"DATE($AB8,$U8,COLUMN(X:X))","v":"2023-06-24"},{"$f":"DATE($AB8,$U8,COLUMN(Y:Y))","v":"2023-06-25"},{"$f":"DATE($AB8,$U8,COLUMN(Z:Z))","v":"2023-06-26"},{"$f":"DATE($AB8,$U8,COLUMN(AA:AA))","v":"2023-06-27"},{"$f":"DATE($AB8,$U8,COLUMN(AB:AB))","v":"2023-06-28"},{"$f":"DATE($AB8,$U8,COLUMN(AC:AC))","v":"2023-06-29"},{"$f":"DATE($AB8,$U8,COLUMN(AD:AD))","v":"2023-06-30"},{"$f":"DATE($AB8,$U8,COLUMN(AE:AE))","v":"2023-07-01"},{"$f":"KeyVacationLable","v":"إجازة إعتيادية "},{"$f":"KeySickLable","v":"إجازة مرضية "},{"$f":"KeyPermissionLable","v":"استئذان "},{"$f":"KeyDelayLable","v":"تأخير "},{"$f":"KeyAbsenceLable","v":"غياب "},{"$f":"KeyWorkLable","v":"مكلف خارج الإدارة"},{"$f":"KeyCourseLable","v":"دورة "},"الإجمالي"]
[null,null,null,null,null,null,null,null,null,null,null,null,"سلطان بن برغش الحربي",null,null,null,null,null,null,null,null,null,null,null,null,null,null,null,null,null,null,null,null,null,null,null,null,null,null,null,null,null,null,null,{"$f":"COUNTIF($N19:$AR19,\"1\")","v":0},{"$f":"COUNTIF($N19:$AR19,\"2\")","v":0},{"$f":"COUNTIF($N19:$AR19,\"3\")","v":0},{"$f":"COUNTIF($N19:$AR19,\"4\")","v":0},{"$f":"COUNTIF($N19:$AR19,\"5\")","v":0},{"$f":"COUNTIF($N19:$AR19,\"6\")","v":0},{"$f":"COUNTIF($N19:$AR19,\"7\")","v":0},{"$f":"COUNTA($N19:$AR19)","v":0}]
[null,null,null,null,null,null,null,null,null,null,null,null,"عمر بن فوزان المحارب "]
{"$rows_left_out":9}
{"sheet":"Attendance (2)","index":9,"n_rows":28,"n_cols":52,"rows_kept":28,"cut":false,"hidden":true,"merged":[[9,5,11,10],[11,14,11,16],[11,18,11,20],[11,22,11,24],[11,26,11,28],[11,34,11,36],[11,38,11,40],[14,44,15,51],[16,44,16,51],[5,20,6,24],[7,20,8,24],[5,27,6,31],[7,27,8,31],[9,24,9,27],[11,30,11,32]]}
[]
[]
[null,null,null,null,null,null,null,null,null,null,null,null,null,null,null,null,null,null,null,null,null,null,null,null,2022]
[]
[]
[null,null,null,null,null,null,null,null,null,null,null,null,null,null,null,null,null,null,null,null,"الشهر",null,null,null,null,null,null,"السنة"]
[]
[null,null,null,null,null,null,null,null,null,null,null,null,null,null,null,null,null,null,null,null,10,null,null,null,null,null,null,2022]
[]
[null,null,null,null,null,"تقييم أداء وحضور الموظفين",null,null,null,null,null,null,null,null,null,null,null,null,null,null,null,null,null,null,{"$f":"(U8&\"-\"&AB8)","v":"10-2022"}]
[]
[null,null,null,null,null,null,null,null,null,null,null,null,"مفتاح نوع الغياب ",1,"إجازة إعتيادية ",null,null,2,"إجازة مرضية ",null,null,3,"استئذان ",null,null,4,"تأخير ",null,null,5,"غياب ",null,null,6,"مكلف خارج الإدارة",null,null,7,"دورة "]
[]
[]
[null,null,null,null,null,null,null,null,null,null,null,null,null,null,null,null,null,null,null,null,null,null,null,null,null,null,null,null,null,null,null,null,null,null,null,null,null,null,null,null,null,null,null,null,{"$f":"DATE($AB8,$U8,COLUMN(A:A))","v":"2022-10-01"}]
[]
[null,null,null,null,null,null,null,null,null,null,null,null,null,{"$f":"TEXT(N18,\"DDD\")","v":"السبت"},{"$f":"TEXT(O18,\"DDD\")","v":"الأحد"},"الإثنين","الثلاثاء","الأربعاء","الخميس","الجمعة","السبت","الأحد","الإثنين","الثلاثاء","الأربعاء","الخميس","الجمعة","السبت","الأحد","الإثنين","الثلاثاء","الأربعاء","الخميس","الجمعة","السبت","الأحد","الإثنين","الثلاثاء","الأربعاء","الخميس","الجمعة","السبت","الأحد","الإثنين","إجمالي الحضور و الإنصراف "]
[null,null,null,null,null,null,null,null,null,null,null,null,"اسم الموظف",{"$f":"DATE($AB8,$U8,COLUMN(A:A))","v":"2022-10-01"},{"$f":"DATE($AB8,$U8,COLUMN(B:B))","v":"2022-10-02"},{"$f":"DATE($AB8,$U8,COLUMN(C:C))","v":"2022-10-03"},{"$f":"DATE($AB8,$U8,COLUMN(D:D))","v":"2022-10-04"},{"$f":"DATE($AB8,$U8,COLUMN(E:E))","v":"2022-10-05"},{"$f":"DATE($AB8,$U8,COLUMN(F:F))","v":"2022-10-06"},{"$f":"DATE($AB8,$U8,COLUMN(G:G))","v":"2022-10-07"},{"$f":"DATE($AB8,$U8,COLUMN(H:H))","v":"2022-10-08"},{"$f":"DATE($AB8,$U8,COLUMN(I:I))","v":"2022-10-09"},{"$f":"DATE($AB8,$U8,COLUMN(J:J))","v":"2022-10-10"},{"$f":"DATE($AB8,$U8,COLUMN(K:K))","v":"2022-10-11"},{"$f":"DATE($AB8,$U8,COLUMN(L:L))","v":"2022-10-12"},{"$f":"DATE($AB8,$U8,COLUMN(M:M))","v":"2022-10-13"},{"$f":"DATE($AB8,$U8,COLUMN(N:N))","v":"2022-10-14"},{"$f":"DATE($AB8,$U8,COLUMN(O:O))","v":"2022-10-15"},{"$f":"DATE($AB8,$U8,COLUMN(P:P))","v":"2022-10-16"},{"$f":"DATE($AB8,$U8,COLUMN(Q:Q))","v":"2022-10-17"},{"$f":"DATE($AB8,$U8,COLUMN(R:R))","v":"2022-10-18"},{"$f":"DATE($AB8,$U8,COLUMN(S:S))","v":"2022-10-19"},{"$f":"DATE($AB8,$U8,COLUMN(T:T))","v":"2022-10-20"},{"$f":"DATE($AB8,$U8,COLUMN(U:U))","v":"2022-10-21"},{"$f":"DATE($AB8,$U8,COLUMN(V:V))","v":"2022-10-22"},{"$f":"DATE($AB8,$U8,COLUMN(W:W))","v":"2022-10-23"},{"$f":"DATE($AB8,$U8,COLUMN(X:X))","v":"2022-10-24"},{"$f":"DATE($AB8,$U8,COLUMN(Y:Y))","v":"2022-10-25"},{"$f":"DATE($AB8,$U8,COLUMN(Z:Z))","v":"2022-10-26"},{"$f":"DATE($AB8,$U8,COLUMN(AA:AA))","v":"2022-10-27"},{"$f":"DATE($AB8,$U8,COLUMN(AB:AB))","v":"2022-10-28"},{"$f":"DATE($AB8,$U8,COLUMN(AC:AC))","v":"2022-10-29"},{"$f":"DATE($AB8,$U8,COLUMN(AD:AD))","v":"2022-10-30"},{"$f":"DATE($AB8,$U8,COLUMN(AE:AE))","v":"2022-10-31"},{"$f":"KeyVacationLable","v":"إجازة إعتيادية "},{"$f":"KeySickLable","v":"إجازة مرضية "},{"$f":"KeyPermissionLable","v":"استئذان "},{"$f":"KeyDelayLable","v":"تأخير "},{"$f":"KeyAbsenceLable","v":"غياب "},{"$f":"KeyWorkLable","v":"مكلف خارج الإدارة"},{"$f":"KeyCourseLable","v":"دورة "},"الإجمالي"]
[null,null,null,null,null,null,null,null,null,null,null,null,"سلطان بن برغش الحربي",null,null,null,null,null,null,null,null,null,null,null,null,null,null,null,null,null,null,null,null,null,null,null,null,null,null,null,null,null,null,null,{"$f":"COUNTIF($N19:$AR19,\"1\")","v":0},{"$f":"COUNTIF($N19:$AR19,\"2\")","v":0},{"$f":"COUNTIF($N19:$AR19,\"3\")","v":0},{"$f":"COUNTIF($N19:$AR19,\"4\")","v":0},{"$f":"COUNTIF($N19:$AR19,\"5\")","v":0},{"$f":"COUNTIF($N19:$AR19,\"6\")","v":0},{"$f":"COUNTIF($N19:$AR19,\"7\")","v":0},{"$f":"COUNTA($N19:$AR19)","v":0}]
[null,null,null,null,null,null,null,null,null,null,null,null,"عمر بن فوزان المحارب "]
{"$rows_left_out":9}
{"sheet":"10-2022","index":10,"n_rows":28,"n_cols":52,"rows_kept":28,"cut":false,"hidden":false,"merged":[[6,26,6,30],[7,26,7,30],[6,20,6,24],[7,20,7,24],[11,14,11,16],[11,18,11,20],[11,22,11,24],[11,26,11,28],[11,30,11,32],[11,34,11,36],[11,38,11,40],[14,44,15,51],[16,44,16,51],[5,34,5,40],[6,34,6,40],[7,34,8,40]]}
[]
[]
[]
[]
[]
[null,null,null,null,null,null,null,null,null,null,null,null,null,null,null,null,null,null,null,null,null,null,null,null,null,null,null,null,null,null,null,null,null,null,"للعودة للبرنامج"]
[null,null,null,null,null,null,null,null,null,null,null,null,null,null,null,null,null,null,null,null,"الشهر ",null,null,null,null,null,"السنة",null,null,null,null,null,null,null,"أدخل رقم 1 في الخلية"]
[null,null,null,null,null,null,null,null,null,null,null,null,null,null,null,null,null,null,null,null,10,null,null,null,null,null,2022]
[]
[null,null,null,null,null,null,null,null,null,null,null,null,null,null,null,null,null,null,null,null,"2022-10-01"]
[]
[null,null,null,null,null,null,null,null,null,null,null,null,"مفتاح نوع الغياب ",1,"إجازة إعتيادية ",null,null,2,"إجازة مرضية ",null,null,3,"استئذان ",null,null,4,"تأخير ",null,null,5,"غياب ",null,null,6,"مكلف خارج الإدارة",null,null,7,"دورة "]
[]
[]
[null,null,null,null,null,null,null,null,null,null,null,null,null,null,null,null,null,null,null,null,null,null,null,null,null,null,null,null,null,null,null,null,null,null,null,null,null,null,null,null,null,null,null,null,"2022-10-01"]
[]
[null,null,null,null,null,null,null,null,null,null,null,null,null,"السبت","الأحد","الإثنين","الثلاثاء","الأربعاء","الخميس","الجمعة","السبت","الأحد","الإثنين","الثلاثاء","الأربعاء","الخميس","الجمعة","السبت","الأحد","الإثنين","الثلاثاء","الأربعاء","الخميس","الجمعة","السبت","الأحد","الإثنين","الثلاثاء","الأربعاء","الخميس","الجمعة","السبت","الأحد","الإثنين","إجمالي الحضور و الإنصراف "]
[null,null,null,null,null,null,null,null,null,null,null,null,"اسم الموظف","2022-10-01","2022-10-02","2022-10-03","2022-10-04","2022-10-05","2022-10-06","2022-10-07","2022-10-08","2022-10-09","2022-10-10","2022-10-11","2022-10-12","2022-10-13","2022-10-14","2022-10-15","2022-10-16","2022-10-17","2022-10-18","2022-10-19","2022-10-20","2022-10-21","2022-10-22","2022-10-23","2022-10-24","2022-10-25","2022-10-26","2022-10-27","2022-10-28","2022-10-29","2022-10-30","2022-10-31","إجازة إعتيادية ","إجازة مرضية ","استئذان ","تأخير ","غياب ","مكلف خارج الإدارة","دورة ","الإجمالي"]
[null,null,null,null,null,null,null,null,null,null,null,null,"أحمد حمدي ",null,null,null,null,null,null,null,null,null,null,null,null,null,null,null,null,null,null,null,null,null,null,null,null,null,null,null,null,null,null,null,0,0,0,0,0,0,0,0]
[null,null,null,null,null,null,null,null,null,null,null,null,"خالد الطويل "]
{"$rows_left_out":8}