{"text_format":"1","workbook":"xlsx","n_sheets":2,"sheets":["الكشوفات","جمع الكشوفات"],"not_rendered":{"charts":0,"images":0,"macros":1,"external_links":1,"defined_names":0,"comments":0,"pivot_tables":0},"unopened":[],"bounds":{"document_bytes":16777216,"sheet_cells":100000,"rows_first":2000,"rows_last":500,"rows_between":2000,"halvings":0,"cell_chars":16384,"cell_head_chars":4096},"cells_cut":0,"cells_raw":0,"read":"whole","date_system":"1900"}

{"sheet":"الكشوفات","index":0,"n_rows":84,"n_cols":15,"rows_kept":84,"cut":false,"hidden":false,"merged":[[0,1,0,14],[22,1,22,14],[44,1,44,14],[66,1,66,14]]}
[null,"كشف للفترة من  1 / 5 لغاية 15 /5 / 2023"]
[]
[]
["ت","المخزن","الكمية","رقم الدخول","تاريخ الدخول","تاريخ الخروج","تاريخ الصادر","رقم الخروج","اسم المخزن","الرصيد","المتبقي","النقص","سعر النقص","المبلغ الكلي","اسم المادة"]
[1,"مراكش",{"$f":"IFERROR(IF(B5=\"\",\"\",VLOOKUP(B5,[1]المسافة!$B$2:$C$468,2,FALSE)),\"\")","v":""},12365,{"$f":"D5","v":"1933-11-07"},{"$f":"E5","v":"1933-11-07"},{"$f":"F5","v":"1933-11-07"},null,null,null,null,{"$f":"K5","v":0},null,{"$f":"IFERROR(SUM(L5*M5*C5/1000),\"\")","v":""},"ط1"]
[2,"مراكش",{"$f":"IFERROR(IF(B6=\"\",\"\",VLOOKUP(B6,[1]المسافة!$B$2:$C$468,2,FALSE)),\"\")","v":""},12366,{"$f":"D6","v":"1933-11-08"},"1933-11-08","1933-11-08",null,null,null,null,{"$f":"K6","v":0},null,{"$f":"IFERROR(SUM(L6*M6*C6/1000),\"\")","v":""},"ط2"]
[3,"مراكش",{"$f":"IFERROR(IF(B7=\"\",\"\",VLOOKUP(B7,[1]المسافة!$B$2:$C$468,2,FALSE)),\"\")","v":""},12367,"1933-11-09","1933-11-09","1933-11-09",null,null,null,null,0,null,"","ط3"]
[4,"مراكش",{"$f":"IFERROR(IF(B8=\"\",\"\",VLOOKUP(B8,[1]المسافة!$B$2:$C$468,2,FALSE)),\"\")","v":""},12368,"1933-11-10","1933-11-10","1933-11-10",null,null,null,null,0,null,"","ط4"]
[5,"مراكش",{"$f":"IFERROR(IF(B9=\"\",\"\",VLOOKUP(B9,[1]المسافة!$B$2:$C$468,2,FALSE)),\"\")","v":""},12369,"1933-11-11","1933-11-11","1933-11-11",null,null,null,null,0,null,"","ط5"]
[6,"مراكش",{"$f":"IFERROR(IF(B10=\"\",\"\",VLOOKUP(B10,[1]المسافة!$B$2:$C$468,2,FALSE)),\"\")","v":""},12370,"1933-11-12","1933-11-12","1933-11-12",null,null,null,null,0,null,"","ط6"]
[7,"مراكش",{"$f":"IFERROR(IF(B11=\"\",\"\",VLOOKUP(B11,[1]المسافة!$B$2:$C$468,2,FALSE)),\"\")","v":""},12371,"1933-11-13","1933-11-13","1933-11-13",null,null,null,null,0,null,"","ط7"]
[8,"مراكش",{"$f":"IFERROR(IF(B12=\"\",\"\",VLOOKUP(B12,[1]المسافة!$B$2:$C$468,2,FALSE)),\"\")","v":""},12372,"1933-11-14","1933-11-14","1933-11-14",null,null,null,null,0,null,"","ط8"]
[9,"مراكش",{"$f":"IFERROR(IF(B13=\"\",\"\",VLOOKUP(B13,[1]المسافة!$B$2:$C$468,2,FALSE)),\"\")","v":""},12373,"1933-11-15","1933-11-15","1933-11-15",null,null,null,null,0,null,"","ط9"]
[10,"مراكش",{"$f":"IFERROR(IF(B14=\"\",\"\",VLOOKUP(B14,[1]المسافة!$B$2:$C$468,2,FALSE)),\"\")","v":""},12374,"1933-11-16","1933-11-16","1933-11-16",null,null,null,null,0,null,"","ط10"]
[null,"رقم القائمة",1,null,null,null,null,null,null,null,null,{"$f":"SUM(L5:L14)","v":0},null,{"$f":"SUM(N5:N14)","v":0}]
[]
[]
[null,null,"ممثل الشركة",null,null,null,null,"المحاسب",null,null,null,null,"المدير المفوض"]
[]
[]
[]
[]
[null,"كشف للفترة من  1 / 5 لغاية 15 /5 / 2023"]
[]
[]
["ت","المخزن","الكمية","رقم الدخول","تاريخ الدخول","تاريخ الخروج","تاريخ الصادر","رقم الخروج","اسم المخزن","الرصيد","المتبقي","النقص","سعر النقص","المبلغ الكلي","اسم المادة"]
[1,"مراكش",{"$f":"IFERROR(IF(B27=\"\",\"\",VLOOKUP(B27,[1]المسافة!$B$2:$C$468,2,FALSE)),\"\")","v":""},12365,{"$f":"D27","v":"1933-11-07"},{"$f":"E27","v":"1933-11-07"},{"$f":"F27","v":"1933-11-07"},null,null,null,null,{"$f":"K27","v":0},null,{"$f":"IFERROR(SUM(L27*M27*C27/1000),\"\")","v":""},"ط1"]
[2,"مراكش",{"$f":"IFERROR(IF(B28=\"\",\"\",VLOOKUP(B28,[1]المسافة!$B$2:$C$468,2,FALSE)),\"\")","v":""},12366,{"$f":"D28","v":"1933-11-08"},{"$f":"E28","v":"1933-11-08"},{"$f":"F28","v":"1933-11-08"},null,null,null,null,{"$f":"K28","v":0},null,{"$f":"IFERROR(SUM(L28*M28*C28/1000),\"\")","v":""},"ط2"]
[3,"مراكش",{"$f":"IFERROR(IF(B29=\"\",\"\",VLOOKUP(B29,[1]المسافة!$B$2:$C$468,2,FALSE)),\"\")","v":""},12367,"1933-11-09","1933-11-09","1933-11-09",null,null,null,null,0,null,"","ط3"]
[4,"مراكش",{"$f":"IFERROR(IF(B30=\"\",\"\",VLOOKUP(B30,[1]المسافة!$B$2:$C$468,2,FALSE)),\"\")","v":""},12368,"1933-11-10","1933-11-10","1933-11-10",null,null,null,null,0,null,"","ط4"]
[5,"مراكش",{"$f":"IFERROR(IF(B31=\"\",\"\",VLOOKUP(B31,[1]المسافة!$B$2:$C$468,2,FALSE)),\"\")","v":""},12369,"1933-11-11","1933-11-11","1933-11-11",null,null,null,null,0,null,"","ط5"]
[6,"مراكش",{"$f":"IFERROR(IF(B32=\"\",\"\",VLOOKUP(B32,[1]المسافة!$B$2:$C$468,2,FALSE)),\"\")","v":""},12370,"1933-11-12","1933-11-12","1933-11-12",null,null,null,null,0,null,"","ط6"]
[7,"مراكش",{"$f":"IFERROR(IF(B33=\"\",\"\",VLOOKUP(B33,[1]المسافة!$B$2:$C$468,2,FALSE)),\"\")","v":""},12371,"1933-11-13","1933-11-13","1933-11-13",null,null,null,null,0,null,"","ط7"]
[8,"مراكش",{"$f":"IFERROR(IF(B34=\"\",\"\",VLOOKUP(B34,[1]المسافة!$B$2:$C$468,2,FALSE)),\"\")","v":""},12372,"1933-11-14","1933-11-14","1933-11-14",null,null,null,null,0,null,"","ط8"]
[9,"مراكش",{"$f":"IFERROR(IF(B35=\"\",\"\",VLOOKUP(B35,[1]المسافة!$B$2:$C$468,2,FALSE)),\"\")","v":""},12373,"1933-11-15","1933-11-15","1933-11-15",null,null,null,null,0,null,"","ط9"]
[10,"مراكش",{"$f":"IFERROR(IF(B36=\"\",\"\",VLOOKUP(B36,[1]المسافة!$B$2:$C$468,2,FALSE)),\"\")","v":""},12374,"1933-11-16","1933-11-16","1933-11-16",null,null,null,null,0,null,"","ط10"]
[null,"رقم القائمة",2,null,null,null,null,null,null,null,null,{"$f":"SUM(L27:L36)","v":0},null,{"$f":"SUM(N27:N36)","v":0}]
[]
[]
[null,null,"ممثل الشركة",null,null,null,null,"المحاسب",null,null,null,null,"المدير المفوض"]
[]
[]
[]
[]
[null,"كشف للفترة من  1 / 5 لغاية 15 /5 / 2023"]
[]
[]
["ت","المخزن","الكمية","رقم الدخول","تاريخ الدخول","تاريخ الخروج","تاريخ الصادر","رقم الخروج","اسم المخزن","الرصيد","المتبقي","النقص","سعر النقص","المبلغ الكلي","اسم المادة"]
[1,"مراكش",{"$f":"IFERROR(IF(B49=\"\",\"\",VLOOKUP(B49,[1]المسافة!$B$2:$C$468,2,FALSE)),\"\")","v":""},12365,{"$f":"D49","v":"1933-11-07"},{"$f":"E49","v":"1933-11-07"},{"$f":"F49","v":"1933-11-07"},null,null,null,null,{"$f":"K49","v":0},null,{"$f":"IFERROR(SUM(L49*M49*C49/1000),\"\")","v":""},"ط1"]
[2,"مراكش",{"$f":"IFERROR(IF(B50=\"\",\"\",VLOOKUP(B50,[1]المسافة!$B$2:$C$468,2,FALSE)),\"\")","v":""},12366,{"$f":"D50","v":"1933-11-08"},{"$f":"E50","v":"1933-11-08"},{"$f":"F50","v":"1933-11-08"},null,null,null,null,{"$f":"K50","v":0},null,{"$f":"IFERROR(SUM(L50*M50*C50/1000),\"\")","v":""},"ط2"]
[3,"مراكش",{"$f":"IFERROR(IF(B51=\"\",\"\",VLOOKUP(B51,[1]المسافة!$B$2:$C$468,2,FALSE)),\"\")","v":""},12367,"1933-11-09","1933-11-09","1933-11-09",null,null,null,null,0,null,"","ط3"]
[4,"مراكش",{"$f":"IFERROR(IF(B52=\"\",\"\",VLOOKUP(B52,[1]المسافة!$B$2:$C$468,2,FALSE)),\"\")","v":""},12368,"1933-11-10","1933-11-10","1933-11-10",null,null,null,null,0,null,"","ط4"]
[5,"مراكش",{"$f":"IFERROR(IF(B53=\"\",\"\",VLOOKUP(B53,[1]المسافة!$B$2:$C$468,2,FALSE)),\"\")","v":""},12369,"1933-11-11","1933-11-11","1933-11-11",null,null,null,null,0,null,"","ط5"]
[6,"مراكش",{"$f":"IFERROR(IF(B54=\"\",\"\",VLOOKUP(B54,[1]المسافة!$B$2:$C$468,2,FALSE)),\"\")","v":""},12370,"1933-11-12","1933-11-12","1933-11-12",null,null,null,null,0,null,"","ط6"]
[7,"مراكش",{"$f":"IFERROR(IF(B55=\"\",\"\",VLOOKUP(B55,[1]المسافة!$B$2:$C$468,2,FALSE)),\"\")","v":""},12371,"1933-11-13","1933-11-13","1933-11-13",null,null,null,null,0,null,"","ط7"]
[8,"مراكش",{"$f":"IFERROR(IF(B56=\"\",\"\",VLOOKUP(B56,[1]المسافة!$B$2:$C$468,2,FALSE)),\"\")","v":""},12372,"1933-11-14","1933-11-14","1933-11-14",null,null,null,null,0,null,"","ط8"]
[9,"مراكش",{"$f":"IFERROR(IF(B57=\"\",\"\",VLOOKUP(B57,[1]المسافة!$B$2:$C$468,2,FALSE)),\"\")","v":""},12373,"1933-11-15","1933-11-15","1933-11-15",null,null,null,null,0,null,"","ط9"]
[10,"مراكش",{"$f":"IFERROR(IF(B58=\"\",\"\",VLOOKUP(B58,[1]المسافة!$B$2:$C$468,2,FALSE)),\"\")","v":""},12374,"1933-11-16","1933-11-16","1933-11-16",null,null,null,null,0,null,"","ط10"]
[null,"رقم القائمة",3,null,null,null,null,null,null,null,null,{"$f":"SUM(L49:L58)","v":0},null,{"$f":"SUM(N49:N58)","v":0}]
[]
[]
[null,null,"ممثل الشركة",null,null,null,null,"المحاسب",null,null,null,null,"المدير المفوض"]
[]
[]
[]
[]
[null,"كشف للفترة من  1 / 5 لغاية 15 /5 / 2023"]
[]
[]
["ت","المخزن","الكمية","رقم الدخول","تاريخ الدخول","تاريخ الخروج","تاريخ الصادر","رقم الخروج","اسم المخزن","الرصيد","المتبقي","النقص","سعر النقص","المبلغ الكلي","اسم المادة"]
[1,"مراكش",{"$f":"IFERROR(IF(B71=\"\",\"\",VLOOKUP(B71,[1]المسافة!$B$2:$C$468,2,FALSE)),\"\")","v":""},12365,{"$f":"D71","v":"1933-11-07"},{"$f":"E71","v":"1933-11-07"},{"$f":"F71","v":"1933-11-07"},null,null,null,null,{"$f":"K71","v":0},null,{"$f":"IFERROR(SUM(L71*M71*C71/1000),\"\")","v":""},"ط1"]
[2,"مراكش",{"$f":"IFERROR(IF(B72=\"\",\"\",VLOOKUP(B72,[1]المسافة!$B$2:$C$468,2,FALSE)),\"\")","v":""},12366,{"$f":"D72","v":"1933-11-08"},{"$f":"E72","v":"1933-11-08"},{"$f":"F72","v":"1933-11-08"},null,null,null,null,{"$f":"K72","v":0},null,{"$f":"IFERROR(SUM(L72*M72*C72/1000),\"\")","v":""},"ط2"]
[3,"مراكش",{"$f":"IFERROR(IF(B73=\"\",\"\",VLOOKUP(B73,[1]المسافة!$B$2:$C$468,2,FALSE)),\"\")","v":""},12367,"1933-11-09","1933-11-09","1933-11-09",null,null,null,null,0,null,"","ط3"]
[4,"مراكش",{"$f":"IFERROR(IF(B74=\"\",\"\",VLOOKUP(B74,[1]المسافة!$B$2:$C$468,2,FALSE)),\"\")","v":""},12368,"1933-11-10","1933-11-10","1933-11-10",null,null,null,null,0,null,"","ط4"]
[5,"مراكش",{"$f":"IFERROR(IF(B75=\"\",\"\",VLOOKUP(B75,[1]المسافة!$B$2:$C$468,2,FALSE)),\"\")","v":""},12369,"1933-11-11","1933-11-11","1933-11-11",null,null,null,null,0,null,"","ط5"]
[6,"مراكش",{"$f":"IFERROR(IF(B76=\"\",\"\",VLOOKUP(B76,[1]المسافة!$B$2:$C$468,2,FALSE)),\"\")","v":""},12370,"1933-11-12","1933-11-12","1933-11-12",null,null,null,null,0,null,"","ط6"]
[7,"مراكش",{"$f":"IFERROR(IF(B77=\"\",\"\",VLOOKUP(B77,[1]المسافة!$B$2:$C$468,2,FALSE)),\"\")","v":""},12371,"1933-11-13","1933-11-13","1933-11-13",null,null,null,null,0,null,"","ط7"]
[8,"مراكش",{"$f":"IFERROR(IF(B78=\"\",\"\",VLOOKUP(B78,[1]المسافة!$B$2:$C$468,2,FALSE)),\"\")","v":""},12372,"1933-11-14","1933-11-14","1933-11-14",null,null,null,null,0,null,"","ط8"]
[9,"مراكش",{"$f":"IFERROR(IF(B79=\"\",\"\",VLOOKUP(B79,[1]المسافة!$B$2:$C$468,2,FALSE)),\"\")","v":""},12373,"1933-11-15","1933-11-15","1933-11-15",null,null,null,null,0,null,"","ط9"]
[10,"مراكش",{"$f":"IFERROR(IF(B80=\"\",\"\",VLOOKUP(B80,[1]المسافة!$B$2:$C$468,2,FALSE)),\"\")","v":""},12374,"1933-11-16","1933-11-16","1933-11-16",null,null,null,null,0,null,"","ط10"]
[null,"رقم القائمة",4,null,null,null,null,null,null,null,null,{"$f":"SUM(L71:L80)","v":0},null,{"$f":"SUM(N71:N80)","v":0}]
[]
[]
[null,null,"ممثل الشركة",null,null,null,null,"المحاسب",null,null,null,null,"المدير المفوض"]

{"sheet":"جمع الكشوفات","index":1,"n_rows":41,"n_cols":15,"rows_kept":41,"cut":false,"hidden":false,"merged":[]}
["ت","المخزن","الكمية","رقم الدخول","تاريخ الدخول","تاريخ الخروج","تاريخ الصادر","رقم الخروج","اسم المخزن","الرصيد","المتبقي","النقص","سعر النقص","المبلغ الكلي","اسم المادة"]
[1,"مراكش",{"$f":"IFERROR(IF(B2=\"\",\"\",VLOOKUP(B2,[1]المسافة!$B$2:$C$468,2,FALSE)),\"\")","v":""},12365,{"$f":"D2","v":"1933-11-07"},{"$f":"E2","v":"1933-11-07"},{"$f":"F2","v":"1933-11-07"},null,null,null,null,{"$f":"K2","v":0},null,{"$f":"IFERROR(SUM(L2*M2*C2/1000),\"\")","v":""},"ط1"]
[2,"مراكش",{"$f":"IFERROR(IF(B3=\"\",\"\",VLOOKUP(B3,[1]المسافة!$B$2:$C$468,2,FALSE)),\"\")","v":""},12366,{"$f":"D3","v":"1933-11-08"},"1933-11-08","1933-11-08",null,null,null,null,{"$f":"K3","v":0},null,{"$f":"IFERROR(SUM(L3*M3*C3/1000),\"\")","v":""},"ط2"]
[3,"مراكش",{"$f":"IFERROR(IF(B4=\"\",\"\",VLOOKUP(B4,[1]المسافة!$B$2:$C$468,2,FALSE)),\"\")","v":""},12367,"1933-11-09","1933-11-09","1933-11-09",null,null,null,null,0,null,"","ط3"]
[4,"مراكش",{"$f":"IFERROR(IF(B5=\"\",\"\",VLOOKUP(B5,[1]المسافة!$B$2:$C$468,2,FALSE)),\"\")","v":""},12368,"1933-11-10","1933-11-10","1933-11-10",null,null,null,null,0,null,"","ط4"]
[5,"مراكش",{"$f":"IFERROR(IF(B6=\"\",\"\",VLOOKUP(B6,[1]المسافة!$B$2:$C$468,2,FALSE)),\"\")","v":""},12369,"1933-11-11","1933-11-11","1933-11-11",null,null,null,null,0,null,"","ط5"]
[6,"مراكش",{"$f":"IFERROR(IF(B7=\"\",\"\",VLOOKUP(B7,[1]المسافة!$B$2:$C$468,2,FALSE)),\"\")","v":""},12370,"1933-11-12","1933-11-12","1933-11-12",null,null,null,null,0,null,"","ط6"]
[7,"مراكش",{"$f":"IFERROR(IF(B8=\"\",\"\",VLOOKUP(B8,[1]المسافة!$B$2:$C$468,2,FALSE)),\"\")","v":""},12371,"1933-11-13","1933-11-13","1933-11-13",null,null,null,null,0,null,"","ط7"]
[8,"مراكش",{"$f":"IFERROR(IF(B9=\"\",\"\",VLOOKUP(B9,[1]المسافة!$B$2:$C$468,2,FALSE)),\"\")","v":""},12372,"1933-11-14","1933-11-14","1933-11-14",null,null,null,null,0,null,"","ط8"]
[9,"مراكش",{"$f":"IFERROR(IF(B10=\"\",\"\",VLOOKUP(B10,[1]المسافة!$B$2:$C$468,2,FALSE)),\"\")","v":""},12373,"1933-11-15","1933-11-15","1933-11-15",null,null,null,null,0,null,"","ط9"]
[10,"مراكش",{"$f":"IFERROR(IF(B11=\"\",\"\",VLOOKUP(B11,[1]المسافة!$B$2:$C$468,2,FALSE)),\"\")","v":""},12374,"1933-11-16","1933-11-16","1933-11-16",null,null,null,null,0,null,"","ط10"]
[1,"مراكش",{"$f":"IFERROR(IF(B12=\"\",\"\",VLOOKUP(B12,[1]المسافة!$B$2:$C$468,2,FALSE)),\"\")","v":""},12365,{"$f":"D12","v":"1933-11-07"},{"$f":"E12","v":"1933-11-07"},{"$f":"F12","v":"1933-11-07"},null,null,null,null,{"$f":"K12","v":0},null,{"$f":"IFERROR(SUM(L12*M12*C12/1000),\"\")","v":""},"ط1"]
[2,"مراكش",{"$f":"IFERROR(IF(B13=\"\",\"\",VLOOKUP(B13,[1]المسافة!$B$2:$C$468,2,FALSE)),\"\")","v":""},12366,{"$f":"D13","v":"1933-11-08"},"1933-11-08","1933-11-08",null,null,null,null,{"$f":"K13","v":0},null,{"$f":"IFERROR(SUM(L13*M13*C13/1000),\"\")","v":""},"ط2"]
[3,"مراكش",{"$f":"IFERROR(IF(B14=\"\",\"\",VLOOKUP(B14,[1]المسافة!$B$2:$C$468,2,FALSE)),\"\")","v":""},12367,"1933-11-09","1933-11-09","1933-11-09",null,null,null,null,0,null,"","ط3"]
[4,"مراكش",{"$f":"IFERROR(IF(B15=\"\",\"\",VLOOKUP(B15,[1]المسافة!$B$2:$C$468,2,FALSE)),\"\")","v":""},12368,"1933-11-10","1933-11-10","1933-11-10",null,null,null,null,0,null,"","ط4"]
[5,"مراكش",{"$f":"IFERROR(IF(B16=\"\",\"\",VLOOKUP(B16,[1]المسافة!$B$2:$C$468,2,FALSE)),\"\")","v":""},12369,"1933-11-11","1933-11-11","1933-11-11",null,null,null,null,0,null,"","ط5"]
[6,"مراكش",{"$f":"IFERROR(IF(B17=\"\",\"\",VLOOKUP(B17,[1]المسافة!$B$2:$C$468,2,FALSE)),\"\")","v":""},12370,"1933-11-12","1933-11-12","1933-11-12",null,null,null,null,0,null,"","ط6"]
[7,"مراكش",{"$f":"IFERROR(IF(B18=\"\",\"\",VLOOKUP(B18,[1]المسافة!$B$2:$C$468,2,FALSE)),\"\")","v":""},12371,"1933-11-13","1933-11-13","1933-11-13",null,null,null,null,0,null,"","ط7"]
[8,"مراكش",{"$f":"IFERROR(IF(B19=\"\",\"\",VLOOKUP(B19,[1]المسافة!$B$2:$C$468,2,FALSE)),\"\")","v":""},12372,"1933-11-14","1933-11-14","1933-11-14",null,null,null,null,0,null,"","ط8"]
[9,"مراكش",{"$f":"IFERROR(IF(B20=\"\",\"\",VLOOKUP(B20,[1]المسافة!$B$2:$C$468,2,FALSE)),\"\")","v":""},12373,"1933-11-15","1933-11-15","1933-11-15",null,null,null,null,0,null,"","ط9"]
[10,"مراكش",{"$f":"IFERROR(IF(B21=\"\",\"\",VLOOKUP(B21,[1]المسافة!$B$2:$C$468,2,FALSE)),\"\")","v":""},12374,"1933-11-16","1933-11-16","1933-11-16",null,null,null,null,0,null,"","ط10"]
[1,"مراكش",{"$f":"IFERROR(IF(B22=\"\",\"\",VLOOKUP(B22,[1]المسافة!$B$2:$C$468,2,FALSE)),\"\")","v":""},12365,{"$f":"D22","v":"1933-11-07"},{"$f":"E22","v":"1933-11-07"},{"$f":"F22","v":"1933-11-07"},null,null,null,null,{"$f":"K22","v":0},null,{"$f":"IFERROR(SUM(L22*M22*C22/1000),\"\")","v":""},"ط1"]
[2,"مراكش",{"$f":"IFERROR(IF(B23=\"\",\"\",VLOOKUP(B23,[1]المسافة!$B$2:$C$468,2,FALSE)),\"\")","v":""},12366,{"$f":"D23","v":"1933-11-08"},"1933-11-08","1933-11-08",null,null,null,null,{"$f":"K23","v":0},null,{"$f":"IFERROR(SUM(L23*M23*C23/1000),\"\")","v":""},"ط2"]
[3,"مراكش",{"$f":"IFERROR(IF(B24=\"\",\"\",VLOOKUP(B24,[1]المسافة!$B$2:$C$468,2,FALSE)),\"\")","v":""},12367,"1933-11-09","1933-11-09","1933-11-09",null,null,null,null,0,null,"","ط3"]
[4,"مراكش",{"$f":"IFERROR(IF(B25=\"\",\"\",VLOOKUP(B25,[1]المسافة!$B$2:$C$468,2,FALSE)),\"\")","v":""},12368,"1933-11-10","1933-11-10","1933-11-10",null,null,null,null,0,null,"","ط4"]
[5,"مراكش",{"$f":"IFERROR(IF(B26=\"\",\"\",VLOOKUP(B26,[1]المسافة!$B$2:$C$468,2,FALSE)),\"\")","v":""},12369,"1933-11-11","1933-11-11","1933-11-11",null,null,null,null,0,null,"","ط5"]
[6,"مراكش",{"$f":"IFERROR(IF(B27=\"\",\"\",VLOOKUP(B27,[1]المسافة!$B$2:$C$468,2,FALSE)),\"\")","v":""},12370,"1933-11-12","1933-11-12","1933-11-12",null,null,null,null,0,null,"","ط6"]
[7,"مراكش",{"$f":"IFERROR(IF(B28=\"\",\"\",VLOOKUP(B28,[1]المسافة!$B$2:$C$468,2,FALSE)),\"\")","v":""},12371,"1933-11-13","1933-11-13","1933-11-13",null,null,null,null,0,null,"","ط7"]
[8,"مراكش",{"$f":"IFERROR(IF(B29=\"\",\"\",VLOOKUP(B29,[1]المسافة!$B$2:$C$468,2,FALSE)),\"\")","v":""},12372,"1933-11-14","1933-11-14","1933-11-14",null,null,null,null,0,null,"","ط8"]
[9,"مراكش",{"$f":"IFERROR(IF(B30=\"\",\"\",VLOOKUP(B30,[1]المسافة!$B$2:$C$468,2,FALSE)),\"\")","v":""},12373,"1933-11-15","1933-11-15","1933-11-15",null,null,null,null,0,null,"","ط9"]
[10,"مراكش",{"$f":"IFERROR(IF(B31=\"\",\"\",VLOOKUP(B31,[1]المسافة!$B$2:$C$468,2,FALSE)),\"\")","v":""},12374,"1933-11-16","1933-11-16","1933-11-16",null,null,null,null,0,null,"","ط10"]
[1,"مراكش",{"$f":"IFERROR(IF(B32=\"\",\"\",VLOOKUP(B32,[1]المسافة!$B$2:$C$468,2,FALSE)),\"\")","v":""},12365,{"$f":"D32","v":"1933-11-07"},{"$f":"E32","v":"1933-11-07"},{"$f":"F32","v":"1933-11-07"},null,null,null,null,{"$f":"K32","v":0},null,{"$f":"IFERROR(SUM(L32*M32*C32/1000),\"\")","v":""},"ط1"]
[2,"مراكش",{"$f":"IFERROR(IF(B33=\"\",\"\",VLOOKUP(B33,[1]المسافة!$B$2:$C$468,2,FALSE)),\"\")","v":""},12366,{"$f":"D33","v":"1933-11-08"},"1933-11-08","1933-11-08",null,null,null,null,{"$f":"K33","v":0},null,{"$f":"IFERROR(SUM(L33*M33*C33/1000),\"\")","v":""},"ط2"]
[3,"مراكش",{"$f":"IFERROR(IF(B34=\"\",\"\",VLOOKUP(B34,[1]المسافة!$B$2:$C$468,2,FALSE)),\"\")","v":""},12367,"1933-11-09","1933-11-09","1933-11-09",null,null,null,null,0,null,"","ط3"]
[4,"مراكش",{"$f":"IFERROR(IF(B35=\"\",\"\",VLOOKUP(B35,[1]المسافة!$B$2:$C$468,2,FALSE)),\"\")","v":""},12368,"1933-11-10","1933-11-10","1933-11-10",null,null,null,null,0,null,"","ط4"]
[5,"مراكش",{"$f":"IFERROR(IF(B36=\"\",\"\",VLOOKUP(B36,[1]المسافة!$B$2:$C$468,2,FALSE)),\"\")","v":""},12369,"1933-11-11","1933-11-11","1933-11-11",null,null,null,null,0,null,"","ط5"]
[6,"مراكش",{"$f":"IFERROR(IF(B37=\"\",\"\",VLOOKUP(B37,[1]المسافة!$B$2:$C$468,2,FALSE)),\"\")","v":""},12370,"1933-11-12","1933-11-12","1933-11-12",null,null,null,null,0,null,"","ط6"]
[7,"مراكش",{"$f":"IFERROR(IF(B38=\"\",\"\",VLOOKUP(B38,[1]المسافة!$B$2:$C$468,2,FALSE)),\"\")","v":""},12371,"1933-11-13","1933-11-13","1933-11-13",null,null,null,null,0,null,"","ط7"]
[8,"مراكش",{"$f":"IFERROR(IF(B39=\"\",\"\",VLOOKUP(B39,[1]المسافة!$B$2:$C$468,2,FALSE)),\"\")","v":""},12372,"1933-11-14","1933-11-14","1933-11-14",null,null,null,null,0,null,"","ط8"]
[9,"مراكش",{"$f":"IFERROR(IF(B40=\"\",\"\",VLOOKUP(B40,[1]المسافة!$B$2:$C$468,2,FALSE)),\"\")","v":""},12373,"1933-11-15","1933-11-15","1933-11-15",null,null,null,null,0,null,"","ط9"]
[10,"مراكش",{"$f":"IFERROR(IF(B41=\"\",\"\",VLOOKUP(B41,[1]المسافة!$B$2:$C$468,2,FALSE)),\"\")","v":""},12374,"1933-11-16","1933-11-16","1933-11-16",null,null,null,null,0,null,"","ط10"]