{"text_format":"1","workbook":"xlsx","n_sheets":11,"sheets":["CONTROL","DATA","ADMIN","Change password","ALL PRODACTION","KNT","DYE","CON","EXIT CON","KNTWIP","STOCK"],"not_rendered":{"charts":0,"images":2,"macros":1,"external_links":0,"defined_names":1,"comments":0,"pivot_tables":0},"unopened":[],"bounds":{"document_bytes":16777216,"sheet_cells":100000,"rows_first":2000,"rows_last":500,"rows_between":2000,"halvings":0,"cell_chars":16384,"cell_head_chars":4096},"cells_cut":0,"cells_raw":0,"read":"whole","date_system":"1900"}

{"sheet":"CONTROL","index":0,"n_rows":7,"n_cols":15,"rows_kept":7,"cut":false,"hidden":true,"merged":[]}
["NAME","PASSWORD","PERMISION","active status","admin","DATA","PASSWORD","TEST1","TEST2","TEST4","TEST5","TEST6","TEST3","reset"]
["MOHAMED",1234567,"ADMINSTRATIVE","ACTIVE","Y","Y","Y","Y","Y","Y","Y","Y","Y",{"$f":"O2+173","v":{"$error":"#VALUE!"}},"conv"]
["KNT","knit","USER","ACTIVE","N","N","N","N","Y","N","Y","N","N"]
["DYE","dye","USER","ACTIVE","N","N","N","N","N","N","N","N","Y"]
["CONV","conv","USER","ACTIVE","N","N","N","N","N","Y","N","N","N","N"]
["STOCK","STOCK","USER","ACTIVE","N","N","N","N","N","N","N","Y","N"]
["Mr.Alaa","alaa","ADMINSTRATIVE","ACTIVE","N","N","N","Y","N","N","N","N","N"]

{"sheet":"DATA","index":1,"n_rows":10,"n_cols":3,"rows_kept":10,"cut":false,"hidden":true,"merged":[]}
["NAME","DATE","TIME"]
["AHMAD","2010-10-17T21:35:05",40468.899363425924]
["MOHAMED","2022-12-27T09:48:39",44922.408784722225]
["MOHAMED","2022-12-28T13:52:34",44923.5781712963]
["MOHAMED","2022-12-28T13:54:37",44923.579594907409]
["MOHAMED","2022-12-28T13:56:24",44923.580833333333]
["MOHAMED","2022-12-28T14:11:56",44923.591620370367]
["STOCK","2022-12-28T14:13:44",44923.592870370368]
["MOHAMED","2022-12-28T14:14:01",44923.59306712963]
["Mr.Alaa","2023-05-18T13:43:02",45064.571550925924]

{"sheet":"ADMIN","index":2,"n_rows":0,"n_cols":0,"rows_kept":0,"cut":false,"hidden":true,"merged":[]}

{"sheet":"Change password","index":3,"n_rows":0,"n_cols":0,"rows_kept":0,"cut":false,"hidden":false,"merged":[]}

{"sheet":"ALL PRODACTION","index":4,"n_rows":35,"n_cols":17,"rows_kept":35,"cut":false,"hidden":true,"merged":[[0,0,0,3],[0,5,0,8],[0,13,0,14],[34,1,34,3],[34,6,34,8],[0,10,0,11]]}
["إنتاج ",null,null,null,null,"إنتاج ",null,null,null,null,"إنتاج ",null,null,"إنتاج "]
["التاريخ","وردية اولى","وردية ثانية","وردية ثالثة",null,"التاريخ","وردية اولى","وردية ثانية","وردية ثالثة",null,"التاريخ","وردية اولى",null,"التاريخ","الانتاج",null,"مخزن "]
["2023-05-01",{"$f":"IFERROR(VLOOKUP(A3,KNT!$A$3:$D$33,2,0),\"\")","v":2023},{"$f":"IFERROR(VLOOKUP(A3,KNT!$A$3:$D$33,3,0),\"\")","v":1947},{"$f":"IFERROR(VLOOKUP(A3,KNT!$A$3:$D$33,4,0),\"\")","v":2028},null,"2023-05-01",{"$f":"IFERROR(VLOOKUP(F3,DYE!$A$3:$D$33,2,0),\"\")","v":4484},{"$f":"IFERROR(VLOOKUP(F3,DYE!$A$3:$D$33,3,0),\"\")","v":3814},{"$f":"IFERROR(VLOOKUP(F3,DYE!$A$3:$D$33,4,0),\"\")","v":2786},null,"2023-05-01",{"$f":"IFERROR(VLOOKUP(K3,CON!$A$3:$B$33,2,0),\"\")","v":7211},null,"2023-05-01",{"$f":"IFERROR(VLOOKUP(N3,'EXIT CON'!$A$3:$B$33,2,0),\"\")","v":6825},null,{"$f":"STOCK!A2","v":33151}]
["2023-05-02",{"$f":"IFERROR(VLOOKUP(A4,KNT!$A$3:$D$33,2,0),\"\")","v":1913},{"$f":"IFERROR(VLOOKUP(A4,KNT!$A$3:$D$33,3,0),\"\")","v":1892},{"$f":"IFERROR(VLOOKUP(A4,KNT!$A$3:$D$33,4,0),\"\")","v":2969},null,"2023-05-02",{"$f":"IFERROR(VLOOKUP(F4,DYE!$A$3:$D$33,2,0),\"\")","v":4338},{"$f":"IFERROR(VLOOKUP(F4,DYE!$A$3:$D$33,3,0),\"\")","v":2616},{"$f":"IFERROR(VLOOKUP(F4,DYE!$A$3:$D$33,4,0),\"\")","v":2410},null,"2023-05-02",{"$f":"IFERROR(VLOOKUP(K4,CON!$A$3:$B$33,2,0),\"\")","v":8580},null,"2023-05-02",{"$f":"IFERROR(VLOOKUP(N4,'EXIT CON'!$A$3:$B$33,2,0),\"\")","v":11653}]
["2023-05-03",{"$f":"IFERROR(VLOOKUP(A5,KNT!$A$3:$D$33,2,0),\"\")","v":0},{"$f":"IFERROR(VLOOKUP(A5,KNT!$A$3:$D$33,3,0),\"\")","v":0},{"$f":"IFERROR(VLOOKUP(A5,KNT!$A$3:$D$33,4,0),\"\")","v":0},null,"2023-05-03",{"$f":"IFERROR(VLOOKUP(F5,DYE!$A$3:$D$33,2,0),\"\")","v":0},{"$f":"IFERROR(VLOOKUP(F5,DYE!$A$3:$D$33,3,0),\"\")","v":0},{"$f":"IFERROR(VLOOKUP(F5,DYE!$A$3:$D$33,4,0),\"\")","v":0},null,"2023-05-03",{"$f":"IFERROR(VLOOKUP(K5,CON!$A$3:$B$33,2,0),\"\")","v":0},null,"2023-05-03",{"$f":"IFERROR(VLOOKUP(N5,'EXIT CON'!$A$3:$B$33,2,0),\"\")","v":0},null,"مخزن "]
["2023-05-04",{"$f":"IFERROR(VLOOKUP(A6,KNT!$A$3:$D$33,2,0),\"\")","v":0},{"$f":"IFERROR(VLOOKUP(A6,KNT!$A$3:$D$33,3,0),\"\")","v":0},{"$f":"IFERROR(VLOOKUP(A6,KNT!$A$3:$D$33,4,0),\"\")","v":0},null,"2023-05-04",{"$f":"IFERROR(VLOOKUP(F6,DYE!$A$3:$D$33,2,0),\"\")","v":0},{"$f":"IFERROR(VLOOKUP(F6,DYE!$A$3:$D$33,3,0),\"\")","v":0},{"$f":"IFERROR(VLOOKUP(F6,DYE!$A$3:$D$33,4,0),\"\")","v":0},null,"2023-05-04",{"$f":"IFERROR(VLOOKUP(K6,CON!$A$3:$B$33,2,0),\"\")","v":0},null,"2023-05-04",{"$f":"IFERROR(VLOOKUP(N6,'EXIT CON'!$A$3:$B$33,2,0),\"\")","v":0},null,{"$f":"STOCK!A8","v":294497.12}]
["2023-05-05",{"$f":"IFERROR(VLOOKUP(A7,KNT!$A$3:$D$33,2,0),\"\")","v":0},{"$f":"IFERROR(VLOOKUP(A7,KNT!$A$3:$D$33,3,0),\"\")","v":0},{"$f":"IFERROR(VLOOKUP(A7,KNT!$A$3:$D$33,4,0),\"\")","v":0},null,"2023-05-05",{"$f":"IFERROR(VLOOKUP(F7,DYE!$A$3:$D$33,2,0),\"\")","v":0},{"$f":"IFERROR(VLOOKUP(F7,DYE!$A$3:$D$33,3,0),\"\")","v":0},{"$f":"IFERROR(VLOOKUP(F7,DYE!$A$3:$D$33,4,0),\"\")","v":0},null,"2023-05-05",{"$f":"IFERROR(VLOOKUP(K7,CON!$A$3:$B$33,2,0),\"\")","v":0},null,"2023-05-05",{"$f":"IFERROR(VLOOKUP(N7,'EXIT CON'!$A$3:$B$33,2,0),\"\")","v":0}]
["2023-05-06",{"$f":"IFERROR(VLOOKUP(A8,KNT!$A$3:$D$33,2,0),\"\")","v":0},{"$f":"IFERROR(VLOOKUP(A8,KNT!$A$3:$D$33,3,0),\"\")","v":0},{"$f":"IFERROR(VLOOKUP(A8,KNT!$A$3:$D$33,4,0),\"\")","v":0},null,"2023-05-06",{"$f":"IFERROR(VLOOKUP(F8,DYE!$A$3:$D$33,2,0),\"\")","v":0},{"$f":"IFERROR(VLOOKUP(F8,DYE!$A$3:$D$33,3,0),\"\")","v":0},{"$f":"IFERROR(VLOOKUP(F8,DYE!$A$3:$D$33,4,0),\"\")","v":0},null,"2023-05-06",{"$f":"IFERROR(VLOOKUP(K8,CON!$A$3:$B$33,2,0),\"\")","v":0},null,"2023-05-06",{"$f":"IFERROR(VLOOKUP(N8,'EXIT CON'!$A$3:$B$33,2,0),\"\")","v":0},null,"مخزن "]
["2023-05-07",{"$f":"IFERROR(VLOOKUP(A9,KNT!$A$3:$D$33,2,0),\"\")","v":0},{"$f":"IFERROR(VLOOKUP(A9,KNT!$A$3:$D$33,3,0),\"\")","v":0},{"$f":"IFERROR(VLOOKUP(A9,KNT!$A$3:$D$33,4,0),\"\")","v":0},null,"2023-05-07",{"$f":"IFERROR(VLOOKUP(F9,DYE!$A$3:$D$33,2,0),\"\")","v":0},{"$f":"IFERROR(VLOOKUP(F9,DYE!$A$3:$D$33,3,0),\"\")","v":0},{"$f":"IFERROR(VLOOKUP(F9,DYE!$A$3:$D$33,4,0),\"\")","v":0},null,"2023-05-07",{"$f":"IFERROR(VLOOKUP(K9,CON!$A$3:$B$33,2,0),\"\")","v":0},null,"2023-05-07",{"$f":"IFERROR(VLOOKUP(N9,'EXIT CON'!$A$3:$B$33,2,0),\"\")","v":0},null,{"$f":"STOCK!A5","v":502709}]
["2023-05-08",{"$f":"IFERROR(VLOOKUP(A10,KNT!$A$3:$D$33,2,0),\"\")","v":0},{"$f":"IFERROR(VLOOKUP(A10,KNT!$A$3:$D$33,3,0),\"\")","v":0},{"$f":"IFERROR(VLOOKUP(A10,KNT!$A$3:$D$33,4,0),\"\")","v":0},null,"2023-05-08",{"$f":"IFERROR(VLOOKUP(F10,DYE!$A$3:$D$33,2,0),\"\")","v":0},{"$f":"IFERROR(VLOOKUP(F10,DYE!$A$3:$D$33,3,0),\"\")","v":0},{"$f":"IFERROR(VLOOKUP(F10,DYE!$A$3:$D$33,4,0),\"\")","v":0},null,"2023-05-08",{"$f":"IFERROR(VLOOKUP(K10,CON!$A$3:$B$33,2,0),\"\")","v":0},null,"2023-05-08",{"$f":"IFERROR(VLOOKUP(N10,'EXIT CON'!$A$3:$B$33,2,0),\"\")","v":0}]
["2023-05-09",{"$f":"IFERROR(VLOOKUP(A11,KNT!$A$3:$D$33,2,0),\"\")","v":0},{"$f":"IFERROR(VLOOKUP(A11,KNT!$A$3:$D$33,3,0),\"\")","v":0},{"$f":"IFERROR(VLOOKUP(A11,KNT!$A$3:$D$33,4,0),\"\")","v":0},null,"2023-05-09",{"$f":"IFERROR(VLOOKUP(F11,DYE!$A$3:$D$33,2,0),\"\")","v":0},{"$f":"IFERROR(VLOOKUP(F11,DYE!$A$3:$D$33,3,0),\"\")","v":0},{"$f":"IFERROR(VLOOKUP(F11,DYE!$A$3:$D$33,4,0),\"\")","v":0},null,"2023-05-09",{"$f":"IFERROR(VLOOKUP(K11,CON!$A$3:$B$33,2,0),\"\")","v":0},null,"2023-05-09",{"$f":"IFERROR(VLOOKUP(N11,'EXIT CON'!$A$3:$B$33,2,0),\"\")","v":0},null,"مخزن "]
["2023-05-10",{"$f":"IFERROR(VLOOKUP(A12,KNT!$A$3:$D$33,2,0),\"\")","v":0},{"$f":"IFERROR(VLOOKUP(A12,KNT!$A$3:$D$33,3,0),\"\")","v":0},{"$f":"IFERROR(VLOOKUP(A12,KNT!$A$3:$D$33,4,0),\"\")","v":0},null,"2023-05-10",{"$f":"IFERROR(VLOOKUP(F12,DYE!$A$3:$D$33,2,0),\"\")","v":0},{"$f":"IFERROR(VLOOKUP(F12,DYE!$A$3:$D$33,3,0),\"\")","v":0},{"$f":"IFERROR(VLOOKUP(F12,DYE!$A$3:$D$33,4,0),\"\")","v":0},null,"2023-05-10",{"$f":"IFERROR(VLOOKUP(K12,CON!$A$3:$B$33,2,0),\"\")","v":0},null,"2023-05-10",{"$f":"IFERROR(VLOOKUP(N12,'EXIT CON'!$A$3:$B$33,2,0),\"\")","v":0},null,1]
["2023-05-11",{"$f":"IFERROR(VLOOKUP(A13,KNT!$A$3:$D$33,2,0),\"\")","v":0},{"$f":"IFERROR(VLOOKUP(A13,KNT!$A$3:$D$33,3,0),\"\")","v":0},{"$f":"IFERROR(VLOOKUP(A13,KNT!$A$3:$D$33,4,0),\"\")","v":0},null,"2023-05-11",{"$f":"IFERROR(VLOOKUP(F13,DYE!$A$3:$D$33,2,0),\"\")","v":0},{"$f":"IFERROR(VLOOKUP(F13,DYE!$A$3:$D$33,3,0),\"\")","v":0},{"$f":"IFERROR(VLOOKUP(F13,DYE!$A$3:$D$33,4,0),\"\")","v":0},null,"2023-05-11",{"$f":"IFERROR(VLOOKUP(K13,CON!$A$3:$B$33,2,0),\"\")","v":0},null,"2023-05-11",{"$f":"IFERROR(VLOOKUP(N13,'EXIT CON'!$A$3:$B$33,2,0),\"\")","v":0},null,{"$f":"STOCK!A12","v":44447}]
["2023-05-12",{"$f":"IFERROR(VLOOKUP(A14,KNT!$A$3:$D$33,2,0),\"\")","v":0},{"$f":"IFERROR(VLOOKUP(A14,KNT!$A$3:$D$33,3,0),\"\")","v":0},{"$f":"IFERROR(VLOOKUP(A14,KNT!$A$3:$D$33,4,0),\"\")","v":0},null,"2023-05-12",{"$f":"IFERROR(VLOOKUP(F14,DYE!$A$3:$D$33,2,0),\"\")","v":0},{"$f":"IFERROR(VLOOKUP(F14,DYE!$A$3:$D$33,3,0),\"\")","v":0},{"$f":"IFERROR(VLOOKUP(F14,DYE!$A$3:$D$33,4,0),\"\")","v":0},null,"2023-05-12",{"$f":"IFERROR(VLOOKUP(K14,CON!$A$3:$B$33,2,0),\"\")","v":0},null,"2023-05-12",{"$f":"IFERROR(VLOOKUP(N14,'EXIT CON'!$A$3:$B$33,2,0),\"\")","v":0},null,2]
["2023-05-13",{"$f":"IFERROR(VLOOKUP(A15,KNT!$A$3:$D$33,2,0),\"\")","v":0},{"$f":"IFERROR(VLOOKUP(A15,KNT!$A$3:$D$33,3,0),\"\")","v":0},{"$f":"IFERROR(VLOOKUP(A15,KNT!$A$3:$D$33,4,0),\"\")","v":0},null,"2023-05-13",{"$f":"IFERROR(VLOOKUP(F15,DYE!$A$3:$D$33,2,0),\"\")","v":0},{"$f":"IFERROR(VLOOKUP(F15,DYE!$A$3:$D$33,3,0),\"\")","v":0},{"$f":"IFERROR(VLOOKUP(F15,DYE!$A$3:$D$33,4,0),\"\")","v":0},null,"2023-05-13",{"$f":"IFERROR(VLOOKUP(K15,CON!$A$3:$B$33,2,0),\"\")","v":0},null,"2023-05-13",{"$f":"IFERROR(VLOOKUP(N15,'EXIT CON'!$A$3:$B$33,2,0),\"\")","v":0},null,{"$f":"STOCK!A14","v":2779}]
["2023-05-14",{"$f":"IFERROR(VLOOKUP(A16,KNT!$A$3:$D$33,2,0),\"\")","v":0},{"$f":"IFERROR(VLOOKUP(A16,KNT!$A$3:$D$33,3,0),\"\")","v":0},{"$f":"IFERROR(VLOOKUP(A16,KNT!$A$3:$D$33,4,0),\"\")","v":0},null,"2023-05-14",{"$f":"IFERROR(VLOOKUP(F16,DYE!$A$3:$D$33,2,0),\"\")","v":0},{"$f":"IFERROR(VLOOKUP(F16,DYE!$A$3:$D$33,3,0),\"\")","v":0},{"$f":"IFERROR(VLOOKUP(F16,DYE!$A$3:$D$33,4,0),\"\")","v":0},null,"2023-05-14",{"$f":"IFERROR(VLOOKUP(K16,CON!$A$3:$B$33,2,0),\"\")","v":0},null,"2023-05-14",{"$f":"IFERROR(VLOOKUP(N16,'EXIT CON'!$A$3:$B$33,2,0),\"\")","v":0},null,3]
["2023-05-15",{"$f":"IFERROR(VLOOKUP(A17,KNT!$A$3:$D$33,2,0),\"\")","v":0},{"$f":"IFERROR(VLOOKUP(A17,KNT!$A$3:$D$33,3,0),\"\")","v":0},{"$f":"IFERROR(VLOOKUP(A17,KNT!$A$3:$D$33,4,0),\"\")","v":0},null,"2023-05-15",{"$f":"IFERROR(VLOOKUP(F17,DYE!$A$3:$D$33,2,0),\"\")","v":0},{"$f":"IFERROR(VLOOKUP(F17,DYE!$A$3:$D$33,3,0),\"\")","v":0},{"$f":"IFERROR(VLOOKUP(F17,DYE!$A$3:$D$33,4,0),\"\")","v":0},null,"2023-05-15",{"$f":"IFERROR(VLOOKUP(K17,CON!$A$3:$B$33,2,0),\"\")","v":0},null,"2023-05-15",{"$f":"IFERROR(VLOOKUP(N17,'EXIT CON'!$A$3:$B$33,2,0),\"\")","v":0},null,{"$f":"STOCK!A16","v":5032}]
["2023-05-16",{"$f":"IFERROR(VLOOKUP(A18,KNT!$A$3:$D$33,2,0),\"\")","v":0},{"$f":"IFERROR(VLOOKUP(A18,KNT!$A$3:$D$33,3,0),\"\")","v":0},{"$f":"IFERROR(VLOOKUP(A18,KNT!$A$3:$D$33,4,0),\"\")","v":0},null,"2023-05-16",{"$f":"IFERROR(VLOOKUP(F18,DYE!$A$3:$D$33,2,0),\"\")","v":0},{"$f":"IFERROR(VLOOKUP(F18,DYE!$A$3:$D$33,3,0),\"\")","v":0},{"$f":"IFERROR(VLOOKUP(F18,DYE!$A$3:$D$33,4,0),\"\")","v":0},null,"2023-05-16",{"$f":"IFERROR(VLOOKUP(K18,CON!$A$3:$B$33,2,0),\"\")","v":0},null,"2023-05-16",{"$f":"IFERROR(VLOOKUP(N18,'EXIT CON'!$A$3:$B$33,2,0),\"\")","v":0}]
["2023-05-17",{"$f":"IFERROR(VLOOKUP(A19,KNT!$A$3:$D$33,2,0),\"\")","v":0},{"$f":"IFERROR(VLOOKUP(A19,KNT!$A$3:$D$33,3,0),\"\")","v":0},{"$f":"IFERROR(VLOOKUP(A19,KNT!$A$3:$D$33,4,0),\"\")","v":0},null,"2023-05-17",{"$f":"IFERROR(VLOOKUP(F19,DYE!$A$3:$D$33,2,0),\"\")","v":0},{"$f":"IFERROR(VLOOKUP(F19,DYE!$A$3:$D$33,3,0),\"\")","v":0},{"$f":"IFERROR(VLOOKUP(F19,DYE!$A$3:$D$33,4,0),\"\")","v":0},null,"2023-05-17",{"$f":"IFERROR(VLOOKUP(K19,CON!$A$3:$B$33,2,0),\"\")","v":0},null,"2023-05-17",{"$f":"IFERROR(VLOOKUP(N19,'EXIT CON'!$A$3:$B$33,2,0),\"\")","v":0}]
["2023-05-18",{"$f":"IFERROR(VLOOKUP(A20,KNT!$A$3:$D$33,2,0),\"\")","v":0},{"$f":"IFERROR(VLOOKUP(A20,KNT!$A$3:$D$33,3,0),\"\")","v":0},{"$f":"IFERROR(VLOOKUP(A20,KNT!$A$3:$D$33,4,0),\"\")","v":0},null,"2023-05-18",{"$f":"IFERROR(VLOOKUP(F20,DYE!$A$3:$D$33,2,0),\"\")","v":0},{"$f":"IFERROR(VLOOKUP(F20,DYE!$A$3:$D$33,3,0),\"\")","v":0},{"$f":"IFERROR(VLOOKUP(F20,DYE!$A$3:$D$33,4,0),\"\")","v":0},null,"2023-05-18",{"$f":"IFERROR(VLOOKUP(K20,CON!$A$3:$B$33,2,0),\"\")","v":0},null,"2023-05-18",{"$f":"IFERROR(VLOOKUP(N20,'EXIT CON'!$A$3:$B$33,2,0),\"\")","v":0}]
["2023-05-19",{"$f":"IFERROR(VLOOKUP(A21,KNT!$A$3:$D$33,2,0),\"\")","v":0},{"$f":"IFERROR(VLOOKUP(A21,KNT!$A$3:$D$33,3,0),\"\")","v":0},{"$f":"IFERROR(VLOOKUP(A21,KNT!$A$3:$D$33,4,0),\"\")","v":0},null,"2023-05-19",{"$f":"IFERROR(VLOOKUP(F21,DYE!$A$3:$D$33,2,0),\"\")","v":0},{"$f":"IFERROR(VLOOKUP(F21,DYE!$A$3:$D$33,3,0),\"\")","v":0},{"$f":"IFERROR(VLOOKUP(F21,DYE!$A$3:$D$33,4,0),\"\")","v":0},null,"2023-05-19",{"$f":"IFERROR(VLOOKUP(K21,CON!$A$3:$B$33,2,0),\"\")","v":0},null,"2023-05-19",{"$f":"IFERROR(VLOOKUP(N21,'EXIT CON'!$A$3:$B$33,2,0),\"\")","v":0}]
["2023-05-20",{"$f":"IFERROR(VLOOKUP(A22,KNT!$A$3:$D$33,2,0),\"\")","v":0},{"$f":"IFERROR(VLOOKUP(A22,KNT!$A$3:$D$33,3,0),\"\")","v":0},{"$f":"IFERROR(VLOOKUP(A22,KNT!$A$3:$D$33,4,0),\"\")","v":0},null,"2023-05-20",{"$f":"IFERROR(VLOOKUP(F22,DYE!$A$3:$D$33,2,0),\"\")","v":0},{"$f":"IFERROR(VLOOKUP(F22,DYE!$A$3:$D$33,3,0),\"\")","v":0},{"$f":"IFERROR(VLOOKUP(F22,DYE!$A$3:$D$33,4,0),\"\")","v":0},null,"2023-05-20",{"$f":"IFERROR(VLOOKUP(K22,CON!$A$3:$B$33,2,0),\"\")","v":0},null,"2023-05-20",{"$f":"IFERROR(VLOOKUP(N22,'EXIT CON'!$A$3:$B$33,2,0),\"\")","v":0}]
["2023-05-21",{"$f":"IFERROR(VLOOKUP(A23,KNT!$A$3:$D$33,2,0),\"\")","v":0},{"$f":"IFERROR(VLOOKUP(A23,KNT!$A$3:$D$33,3,0),\"\")","v":0},{"$f":"IFERROR(VLOOKUP(A23,KNT!$A$3:$D$33,4,0),\"\")","v":0},null,"2023-05-21",{"$f":"IFERROR(VLOOKUP(F23,DYE!$A$3:$D$33,2,0),\"\")","v":0},{"$f":"IFERROR(VLOOKUP(F23,DYE!$A$3:$D$33,3,0),\"\")","v":0},{"$f":"IFERROR(VLOOKUP(F23,DYE!$A$3:$D$33,4,0),\"\")","v":0},null,"2023-05-21",{"$f":"IFERROR(VLOOKUP(K23,CON!$A$3:$B$33,2,0),\"\")","v":0},null,"2023-05-21",{"$f":"IFERROR(VLOOKUP(N23,'EXIT CON'!$A$3:$B$33,2,0),\"\")","v":0}]
["2023-05-22",{"$f":"IFERROR(VLOOKUP(A24,KNT!$A$3:$D$33,2,0),\"\")","v":0},{"$f":"IFERROR(VLOOKUP(A24,KNT!$A$3:$D$33,3,0),\"\")","v":0},{"$f":"IFERROR(VLOOKUP(A24,KNT!$A$3:$D$33,4,0),\"\")","v":0},null,"2023-05-22",{"$f":"IFERROR(VLOOKUP(F24,DYE!$A$3:$D$33,2,0),\"\")","v":0},{"$f":"IFERROR(VLOOKUP(F24,DYE!$A$3:$D$33,3,0),\"\")","v":0},{"$f":"IFERROR(VLOOKUP(F24,DYE!$A$3:$D$33,4,0),\"\")","v":0},null,"2023-05-22",{"$f":"IFERROR(VLOOKUP(K24,CON!$A$3:$B$33,2,0),\"\")","v":0},null,"2023-05-22",{"$f":"IFERROR(VLOOKUP(N24,'EXIT CON'!$A$3:$B$33,2,0),\"\")","v":0}]
["2023-05-23",{"$f":"IFERROR(VLOOKUP(A25,KNT!$A$3:$D$33,2,0),\"\")","v":0},{"$f":"IFERROR(VLOOKUP(A25,KNT!$A$3:$D$33,3,0),\"\")","v":0},{"$f":"IFERROR(VLOOKUP(A25,KNT!$A$3:$D$33,4,0),\"\")","v":0},null,"2023-05-23",{"$f":"IFERROR(VLOOKUP(F25,DYE!$A$3:$D$33,2,0),\"\")","v":0},{"$f":"IFERROR(VLOOKUP(F25,DYE!$A$3:$D$33,3,0),\"\")","v":0},{"$f":"IFERROR(VLOOKUP(F25,DYE!$A$3:$D$33,4,0),\"\")","v":0},null,"2023-05-23",{"$f":"IFERROR(VLOOKUP(K25,CON!$A$3:$B$33,2,0),\"\")","v":0},null,"2023-05-23",{"$f":"IFERROR(VLOOKUP(N25,'EXIT CON'!$A$3:$B$33,2,0),\"\")","v":0}]
["2023-05-24",{"$f":"IFERROR(VLOOKUP(A26,KNT!$A$3:$D$33,2,0),\"\")","v":0},{"$f":"IFERROR(VLOOKUP(A26,KNT!$A$3:$D$33,3,0),\"\")","v":0},{"$f":"IFERROR(VLOOKUP(A26,KNT!$A$3:$D$33,4,0),\"\")","v":0},null,"2023-05-24",{"$f":"IFERROR(VLOOKUP(F26,DYE!$A$3:$D$33,2,0),\"\")","v":0},{"$f":"IFERROR(VLOOKUP(F26,DYE!$A$3:$D$33,3,0),\"\")","v":0},{"$f":"IFERROR(VLOOKUP(F26,DYE!$A$3:$D$33,4,0),\"\")","v":0},null,"2023-05-24",{"$f":"IFERROR(VLOOKUP(K26,CON!$A$3:$B$33,2,0),\"\")","v":0},null,"2023-05-24",{"$f":"IFERROR(VLOOKUP(N26,'EXIT CON'!$A$3:$B$33,2,0),\"\")","v":0}]
["2023-05-25",{"$f":"IFERROR(VLOOKUP(A27,KNT!$A$3:$D$33,2,0),\"\")","v":0},{"$f":"IFERROR(VLOOKUP(A27,KNT!$A$3:$D$33,3,0),\"\")","v":0},{"$f":"IFERROR(VLOOKUP(A27,KNT!$A$3:$D$33,4,0),\"\")","v":0},null,"2023-05-25",{"$f":"IFERROR(VLOOKUP(F27,DYE!$A$3:$D$33,2,0),\"\")","v":0},{"$f":"IFERROR(VLOOKUP(F27,DYE!$A$3:$D$33,3,0),\"\")","v":0},{"$f":"IFERROR(VLOOKUP(F27,DYE!$A$3:$D$33,4,0),\"\")","v":0},null,"2023-05-25",{"$f":"IFERROR(VLOOKUP(K27,CON!$A$3:$B$33,2,0),\"\")","v":0},null,"2023-05-25",{"$f":"IFERROR(VLOOKUP(N27,'EXIT CON'!$A$3:$B$33,2,0),\"\")","v":0}]
["2023-05-26",{"$f":"IFERROR(VLOOKUP(A28,KNT!$A$3:$D$33,2,0),\"\")","v":0},{"$f":"IFERROR(VLOOKUP(A28,KNT!$A$3:$D$33,3,0),\"\")","v":0},{"$f":"IFERROR(VLOOKUP(A28,KNT!$A$3:$D$33,4,0),\"\")","v":0},null,"2023-05-26",{"$f":"IFERROR(VLOOKUP(F28,DYE!$A$3:$D$33,2,0),\"\")","v":0},{"$f":"IFERROR(VLOOKUP(F28,DYE!$A$3:$D$33,3,0),\"\")","v":0},{"$f":"IFERROR(VLOOKUP(F28,DYE!$A$3:$D$33,4,0),\"\")","v":0},null,"2023-05-26",{"$f":"IFERROR(VLOOKUP(K28,CON!$A$3:$B$33,2,0),\"\")","v":0},null,"2023-05-26",{"$f":"IFERROR(VLOOKUP(N28,'EXIT CON'!$A$3:$B$33,2,0),\"\")","v":0}]
["2023-05-27",{"$f":"IFERROR(VLOOKUP(A29,KNT!$A$3:$D$33,2,0),\"\")","v":0},{"$f":"IFERROR(VLOOKUP(A29,KNT!$A$3:$D$33,3,0),\"\")","v":0},{"$f":"IFERROR(VLOOKUP(A29,KNT!$A$3:$D$33,4,0),\"\")","v":0},null,"2023-05-27",{"$f":"IFERROR(VLOOKUP(F29,DYE!$A$3:$D$33,2,0),\"\")","v":0},{"$f":"IFERROR(VLOOKUP(F29,DYE!$A$3:$D$33,3,0),\"\")","v":0},{"$f":"IFERROR(VLOOKUP(F29,DYE!$A$3:$D$33,4,0),\"\")","v":0},null,"2023-05-27",{"$f":"IFERROR(VLOOKUP(K29,CON!$A$3:$B$33,2,0),\"\")","v":0},null,"2023-05-27",{"$f":"IFERROR(VLOOKUP(N29,'EXIT CON'!$A$3:$B$33,2,0),\"\")","v":0}]
["2023-05-28",{"$f":"IFERROR(VLOOKUP(A30,KNT!$A$3:$D$33,2,0),\"\")","v":0},{"$f":"IFERROR(VLOOKUP(A30,KNT!$A$3:$D$33,3,0),\"\")","v":0},{"$f":"IFERROR(VLOOKUP(A30,KNT!$A$3:$D$33,4,0),\"\")","v":0},null,"2023-05-28",{"$f":"IFERROR(VLOOKUP(F30,DYE!$A$3:$D$33,2,0),\"\")","v":0},{"$f":"IFERROR(VLOOKUP(F30,DYE!$A$3:$D$33,3,0),\"\")","v":0},{"$f":"IFERROR(VLOOKUP(F30,DYE!$A$3:$D$33,4,0),\"\")","v":0},null,"2023-05-28",{"$f":"IFERROR(VLOOKUP(K30,CON!$A$3:$B$33,2,0),\"\")","v":0},null,"2023-05-28",{"$f":"IFERROR(VLOOKUP(N30,'EXIT CON'!$A$3:$B$33,2,0),\"\")","v":0}]
["2023-05-29",{"$f":"IFERROR(VLOOKUP(A31,KNT!$A$3:$D$33,2,0),\"\")","v":0},{"$f":"IFERROR(VLOOKUP(A31,KNT!$A$3:$D$33,3,0),\"\")","v":0},{"$f":"IFERROR(VLOOKUP(A31,KNT!$A$3:$D$33,4,0),\"\")","v":0},null,"2023-05-29",{"$f":"IFERROR(VLOOKUP(F31,DYE!$A$3:$D$33,2,0),\"\")","v":0},{"$f":"IFERROR(VLOOKUP(F31,DYE!$A$3:$D$33,3,0),\"\")","v":0},{"$f":"IFERROR(VLOOKUP(F31,DYE!$A$3:$D$33,4,0),\"\")","v":0},null,"2023-05-29",{"$f":"IFERROR(VLOOKUP(K31,CON!$A$3:$B$33,2,0),\"\")","v":0},null,"2023-05-29",{"$f":"IFERROR(VLOOKUP(N31,'EXIT CON'!$A$3:$B$33,2,0),\"\")","v":0}]
["2023-05-30",{"$f":"IFERROR(VLOOKUP(A32,KNT!$A$3:$D$33,2,0),\"\")","v":0},{"$f":"IFERROR(VLOOKUP(A32,KNT!$A$3:$D$33,3,0),\"\")","v":0},{"$f":"IFERROR(VLOOKUP(A32,KNT!$A$3:$D$33,4,0),\"\")","v":0},null,"2023-05-30",{"$f":"IFERROR(VLOOKUP(F32,DYE!$A$3:$D$33,2,0),\"\")","v":0},{"$f":"IFERROR(VLOOKUP(F32,DYE!$A$3:$D$33,3,0),\"\")","v":0},{"$f":"IFERROR(VLOOKUP(F32,DYE!$A$3:$D$33,4,0),\"\")","v":0},null,"2023-05-30",{"$f":"IFERROR(VLOOKUP(K32,CON!$A$3:$B$33,2,0),\"\")","v":0},null,"2023-05-30",{"$f":"IFERROR(VLOOKUP(N32,'EXIT CON'!$A$3:$B$33,2,0),\"\")","v":0}]
["2023-05-31",{"$f":"IFERROR(VLOOKUP(A33,KNT!$A$3:$D$33,2,0),\"\")","v":0},{"$f":"IFERROR(VLOOKUP(A33,KNT!$A$3:$D$33,3,0),\"\")","v":0},{"$f":"IFERROR(VLOOKUP(A33,KNT!$A$3:$D$33,4,0),\"\")","v":0},null,"2023-05-31",{"$f":"IFERROR(VLOOKUP(F33,DYE!$A$3:$D$33,2,0),\"\")","v":0},{"$f":"IFERROR(VLOOKUP(F33,DYE!$A$3:$D$33,3,0),\"\")","v":0},{"$f":"IFERROR(VLOOKUP(F33,DYE!$A$3:$D$33,4,0),\"\")","v":0},null,"2023-05-31",{"$f":"IFERROR(VLOOKUP(K33,CON!$A$3:$B$33,2,0),\"\")","v":0},null,"2023-05-31",{"$f":"IFERROR(VLOOKUP(N33,'EXIT CON'!$A$3:$B$33,2,0),\"\")","v":0}]
["الاجمالي",{"$f":"SUM(B3:B33)","v":3936},{"$f":"SUM(C3:C33)","v":3839},{"$f":"SUM(D3:D33)","v":4997},null,"الاجمالي",{"$f":"SUM(G3:G33)","v":8822},{"$f":"SUM(H3:H33)","v":6430},{"$f":"SUM(I3:I33)","v":5196},null,"الاجمالي",{"$f":"SUM(L3:L33)","v":15791},null,"الاجمالي",{"$f":"SUM(O3:O33)","v":18478}]
["اجمالي الورادي",{"$f":"SUM(B34:D34)","v":12772},null,null,null,"اجمالي الورادي",{"$f":"SUM(G34:I34)","v":20448}]

{"sheet":"KNT","index":5,"n_rows":35,"n_cols":4,"rows_kept":35,"cut":false,"hidden":true,"merged":[[0,0,0,3],[34,1,34,3]]}
["إنتاج "]
["التاريخ","وردية اولى","وردية ثانية","وردية ثالثة"]
["2023-05-01",2023,1947,2028]
["2023-05-02",1913,1892,2969]
["2023-05-03"]
["2023-05-04"]
["2023-05-05"]
["2023-05-06"]
["2023-05-07"]
["2023-05-08"]
["2023-05-09"]
["2023-05-10"]
["2023-05-11"]
["2023-05-12"]
["2023-05-13"]
["2023-05-14"]
["2023-05-15"]
["2023-05-16"]
["2023-05-17"]
["2023-05-18"]
["2023-05-19"]
["2023-05-20"]
["2023-05-21"]
["2023-05-22"]
["2023-05-23"]
["2023-05-24"]
["2023-05-25"]
["2023-05-26"]
["2023-05-27"]
["2023-05-28"]
["2023-05-29"]
["2023-05-30"]
["2023-05-31"]
["الاجمالي",{"$f":"SUM(B3:B33)","v":3936},{"$f":"SUM(C3:C33)","v":3839},{"$f":"SUM(D3:D33)","v":4997}]
["اجمالي الورادي",{"$f":"SUM(B34,C34,D34)","v":12772}]

{"sheet":"DYE","index":6,"n_rows":35,"n_cols":4,"rows_kept":35,"cut":false,"hidden":true,"merged":[[0,0,0,3],[34,1,34,3]]}
["إنتاج "]
["التاريخ","وردية اولى","وردية ثانية","وردية ثالثة"]
["2023-05-01",4484,3814,2786]
["2023-05-02",4338,2616,2410]
["2023-05-03"]
["2023-05-04"]
["2023-05-05"]
["2023-05-06"]
["2023-05-07"]
["2023-05-08"]
["2023-05-09"]
["2023-05-10"]
["2023-05-11"]
["2023-05-12"]
["2023-05-13"]
["2023-05-14"]
["2023-05-15"]
["2023-05-16"]
["2023-05-17"]
["2023-05-18"]
["2023-05-19"]
["2023-05-20"]
["2023-05-21"]
["2023-05-22"]
["2023-05-23"]
["2023-05-24"]
["2023-05-25"]
["2023-05-26"]
["2023-05-27"]
["2023-05-28"]
["2023-05-29"]
["2023-05-30"]
["2023-05-31"]
["الاجمالي",{"$f":"SUM(B3:B33)","v":8822},{"$f":"SUM(C3:C33)","v":6430},{"$f":"SUM(D3:D33)","v":5196}]
["اجمالي الورادي",{"$f":"SUM(B34,C34,D34)","v":20448}]

{"sheet":"CON","index":7,"n_rows":34,"n_cols":2,"rows_kept":34,"cut":false,"hidden":true,"merged":[[0,0,0,1]]}
["إنتاج "]
["التاريخ","الانتاج"]
["2023-05-01",7211]
["2023-05-02",8580]
["2023-05-03"]
["2023-05-04"]
["2023-05-05"]
["2023-05-06"]
["2023-05-07"]
["2023-05-08"]
["2023-05-09"]
["2023-05-10"]
["2023-05-11"]
["2023-05-12"]
["2023-05-13"]
["2023-05-14"]
["2023-05-15"]
["2023-05-16"]
["2023-05-17"]
["2023-05-18"]
["2023-05-19"]
["2023-05-20"]
["2023-05-21"]
["2023-05-22"]
["2023-05-23"]
["2023-05-24"]
["2023-05-25"]
["2023-05-26"]
["2023-05-27"]
["2023-05-28"]
["2023-05-29"]
["2023-05-30"]
["2023-05-31"]
["الاجمالي",{"$f":"SUM(B3:B33)","v":15791}]

{"sheet":"EXIT CON","index":8,"n_rows":34,"n_cols":2,"rows_kept":34,"cut":false,"hidden":true,"merged":[[0,0,0,1]]}
["إنتاج "]
["التاريخ","الانتاج"]
["2023-05-01",6825]
["2023-05-02",11653]
["2023-05-03"]
["2023-05-04"]
["2023-05-05"]
["2023-05-06"]
["2023-05-07"]
["2023-05-08"]
["2023-05-09"]
["2023-05-10"]
["2023-05-11"]
["2023-05-12"]
["2023-05-13"]
["2023-05-14"]
["2023-05-15"]
["2023-05-16"]
["2023-05-17"]
["2023-05-18"]
["2023-05-19"]
["2023-05-20"]
["2023-05-21"]
["2023-05-22"]
["2023-05-23"]
["2023-05-24"]
["2023-05-25"]
["2023-05-26"]
["2023-05-27"]
["2023-05-28"]
["2023-05-29"]
["2023-05-30"]
["2023-05-31"]
["الاجمالي",{"$f":"SUM(B3:B33)","v":18478}]

{"sheet":"KNTWIP","index":9,"n_rows":7,"n_cols":5,"rows_kept":7,"cut":false,"hidden":true,"merged":[[0,0,0,2],[4,0,4,4]]}
[" تحت التشغيل"]
["المسحوب ","المنسوج","الباقي من الكمية"]
[77589,51674,{"$f":"A3-B3","v":25915}]
[]
["جاهز لايعمل"]
["المطلوب سحبه من الغزل","المسحوب الفعلي من الغزل","الباقي من الطلب","المنسوج","الباقي من النسيج"]
[2071,2030,{"$f":"A7-B7","v":41},0,{"$f":"B7-D7","v":2030}]

{"sheet":"STOCK","index":10,"n_rows":16,"n_cols":1,"rows_kept":16,"cut":false,"hidden":true,"merged":[]}
["مخزن "]
[33151]
[]
["مخزن"]
[502709]
[]
["مخزن "]
[294497.12]
[]
["مخزن"]
[1]
[44447]
[2]
[2779]
[3]
[5032]