{"text_format":"1","workbook":"xlsx","n_sheets":6,"sheets":["التقــويـم","المواعيد والإجازات","بحث","حول","بيانات","النجوم"],"not_rendered":{"charts":0,"images":6,"macros":1,"external_links":0,"defined_names":6,"comments":2,"pivot_tables":0},"unopened":[],"bounds":{"document_bytes":16777216,"sheet_cells":100000,"rows_first":2000,"rows_last":500,"rows_between":2000,"halvings":0,"cell_chars":16384,"cell_head_chars":4096},"cells_cut":0,"cells_raw":0,"read":"whole","date_system":"1900"}

{"sheet":"التقــويـم","index":0,"n_rows":59,"n_cols":45,"rows_kept":59,"cut":false,"hidden":false,"merged":[[6,35,6,42],[5,4,5,5],[1,2,58,2],[1,3,1,43],[5,8,5,9],[5,10,5,11],[5,12,5,13],[5,14,5,15],[3,16,3,20],[6,6,6,34],[3,21,3,33],[3,34,3,42],[4,16,5,42],[3,13,3,15],[3,7,3,12],[4,7,4,15],[59,2,60,2],[6,4,6,5],[7,4,7,5]]}
[]
[]
[]
[null,null,null,null,"الإصدار"," VBA     V1.0",null,{"$f":"TODAY()","v":"2023-06-07"},null,null,null,null,null,{"$f":"TODAY()","v":"2023-06-07"},null,null,{"$f":"\"(\" & IF(DATE(1900,MONTH(TODAY()),DAY(TODAY()))<68,DATE(1900,MONTH(TODAY()),DAY(TODAY()))+25,(DATE(1900,MONTH(TODAY()),DAY(TODAY()))-INDEX(fsool[البداية],MATCH(DATE(1900,MONTH(TODAY()),DAY(TODAY())),fsool[البداية],1),1))+1) & \") \" & INDEX(fsool[الفصل],MATCH(DATE(1900,MONTH(TODAY()),DAY(TODAY())),fsool[البداية],1),1)","v":"(1) الصيف"},null,null,null,null,{"$f":" \" (\" & (DATE(2019,MONTH(TODAY()),DAY(TODAY()))-VLOOKUP(DATE(2019,MONTH(TODAY()),DAY(TODAY())),mnazl[dat1],1,TRUE))+1 & \")\"\n& \" \" &  INDEX(mnazl[],MATCH(DATE(2019,MONTH(VLOOKUP(DATE(2019,MONTH(TODAY()),DAY(TODAY())),mnazl[dat1],1,TRUE)),DAY(VLOOKUP(DATE(2019,MONTH(TODAY()),DAY(TODAY())),mnazl[dat1],1,TRUE))),mnazl[dat1],0),2)","v":" (27) الثريا 39 يوما"},null,null,null,null,null,null,null,null,null,null,null,null,{"$f":"  \" (\" & (DATE(2019,MONTH(TODAY()),DAY(TODAY()))-VLOOKUP(DATE(2019,MONTH(TODAY()),DAY(TODAY())),ngom[dat1],1,TRUE))+1 & \")\"\n& \" \" &  INDEX(ngom[],MATCH(DATE(2019,MONTH(VLOOKUP(DATE(2019,MONTH(TODAY()),DAY(TODAY())),ngom[dat1],1,TRUE)),DAY(VLOOKUP(DATE(2019,MONTH(TODAY()),DAY(TODAY())),ngom[dat1],1,TRUE))),ngom[dat1],0),4)","v":" (1) الثريا 13 يوما"}]
[null,null,null,null,"البدء بتاريخ محدد",null,null,"درجات الحرارة المتوقعة لمدينة الزلفي",null,null,null,null,null,null,null,null,{"$f":"INDEX(ngom[],MATCH(DATE(2019,MONTH(VLOOKUP(DATE(2019,MONTH(TODAY()),DAY(TODAY())),ngom[dat1],1,TRUE)),DAY(VLOOKUP(DATE(2019,MONTH(TODAY()),DAY(TODAY())),ngom[dat1],1,TRUE))),ngom[dat1],0),5)","v":"يشتد الحر وتكثر العواصف ويجف العشب وتغور المياه ونادر المطر وتختفي كثير من الحشرات الربيعية كما يبدأ فيه تلون طلع النخيل ويجب فيه العناية بري الأشجار حتى لا تتساقط بتأثير كثرة الري أو قلته مع التوقف عن ري العنب عند تلونه ."}]
[null,null,null,null,{"$f":"E7","v":"2023-06-07"},null,null,null,"العظمى",null,{"$f":"بيانات!H7","v":43.666666666666664},null,"الصغرى",null,{"$f":"بيانات!N7","v":27.333333333333332}]
[null,null,null,null,{"$f":"IF(F5=\"\",TODAY(),IF(F5=\"\",\"\",F5))","v":"2023-06-07"},null,"التقويم الدراسي والمواعيد",null,null,null,null,null,null,null,null,null,null,null,null,null,null,null,null,null,null,null,null,null,null,null,null,null,null,null,null,{"$f":"IFERROR(\nIF(SMALL(تنبيه_المواعيد,1)=0,\"يوجد موعد هذا اليوم\",\nIF(SMALL(تنبيه_المواعيد,1)=1,\"يوجد موعد غدا\",\nIF(SMALL(تنبيه_المواعيد,1)>1,\"أقرب موعد بعد \"&SMALL(تنبيه_المواعيد,1)&\" يوم\",\"يوجد مواعيد فائته قم بحذفها \"))),\"لا يوجد مواعيد\")","v":"يوجد مواعيد فائته قم بحذفها "},null,null,null,null,null,null,null,{"$f":"INDEX(fsool[الفصل],MATCH(DATE(1900,MONTH(TODAY()),DAY(TODAY())),fsool[البداية],1),1)","v":"الصيف"},1]
[null,null,null,null,{"$f":"E7","v":"2023-06-07"},null,"الأحد","الإثنين","الثلاثاء","الأربعاء","الخميس","الجمعة","السبت","الأحد","الإثنين","الثلاثاء","الأربعاء","الخميس","الجمعة","السبت","الأحد","الإثنين","الثلاثاء","الأربعاء","الخميس","الجمعة","السبت","الأحد","الإثنين","الثلاثاء","الأربعاء","الخميس","الجمعة","السبت","الأحد","الإثنين","الثلاثاء","الأربعاء","الخميس","الجمعة","السبت","الأحد","الإثنين"]
[{"$f":"E7","v":"2023-06-07"},null,null,null,{"$f":"YEAR(A9)","v":2023},{"$f":"TEXT(DATE(E9,MONTH(A9),1),\"MMMM\") & \" \" &  TEXT(DATE(E9,MONTH(A9),1),\"M\")","v":"يونيو 6"},{"$f":"DATEVALUE( TEXT(DATE(2000,MONTH(A9),1),\"MMMM\") &\"/\" & $E9 )-IF(WEEKDAY(DATEVALUE( TEXT(DATE(2000,MONTH(A9),1),\"MMMM\") &\"/\" & $E9 )-1)=7,0,WEEKDAY(DATEVALUE( TEXT(DATE(2000,MONTH(A9),1),\"MMMM\") &\"/\" & $E9 )-1))","v":"2023-05-28"},{"$f":"G9+1","v":"2023-05-29"},"2023-05-30","2023-05-31","2023-06-01","2023-06-02","2023-06-03","2023-06-04","2023-06-05","2023-06-06","2023-06-07","2023-06-08","2023-06-09","2023-06-10","2023-06-11","2023-06-12","2023-06-13","2023-06-14","2023-06-15","2023-06-16","2023-06-17","2023-06-18","2023-06-19","2023-06-20","2023-06-21","2023-06-22","2023-06-23","2023-06-24","2023-06-25","2023-06-26","2023-06-27","2023-06-28","2023-06-29","2023-06-30","2023-07-01","2023-07-02","2023-07-03"]
[{"$f":"A9","v":"2023-06-07"},null,null,null,{"$f":"A10","v":"2023-06-07"},{"$f":"A10","v":"2023-06-07"},{"$f":"G9","v":"2023-05-28"},"2023-05-29","2023-05-30","2023-05-31","2023-06-01","2023-06-02","2023-06-03","2023-06-04","2023-06-05","2023-06-06","2023-06-07","2023-06-08","2023-06-09","2023-06-10","2023-06-11","2023-06-12","2023-06-13","2023-06-14","2023-06-15","2023-06-16","2023-06-17","2023-06-18","2023-06-19","2023-06-20","2023-06-21","2023-06-22","2023-06-23","2023-06-24","2023-06-25","2023-06-26","2023-06-27","2023-06-28","2023-06-29","2023-06-30","2023-07-01","2023-07-02","2023-07-03"]
{"$rows_left_out":50}
{"sheet":"المواعيد والإجازات","index":1,"n_rows":25,"n_cols":13,"rows_kept":25,"cut":false,"hidden":false,"merged":[[26,1,26,13],[3,3,3,5],[3,6,3,8],[3,9,3,11],[1,1,25,1],[1,2,1,13],[2,13,25,13]]}
[]
[]
[]
[null,null,null,"بدايات الفصول والاجازات",null,null,"الاجازات الوطنية والمطولة",null,null,"المواعيد الخاصة"]
[null,null,null,null,"العنوان","التاريخ",null,"العنوان","التاريخ",null,"العنوان","التاريخ"]
[null,null,null,null,"بداية الفصل الأول","2023-08-20",null,"بداية إجازة اليوم الوطني","2023-09-24",null,"تجربة موعد","2023-06-02",{"$f":"IF(L6>1,L6-TODAY(),\"\")","v":-5}]
[null,null,null,null,"بداية الفصل الثاني","2023-11-26",null,"بداية إجازة اليوم الوطني","2023-09-24",null,"حفل التخرج","2023-08-09",{"$f":"IF(L7>1,L7-TODAY(),\"\")","v":63}]
[null,null,null,null,"بداية الفصل الثالث","2024-03-03",null,null,null,null,null,"2023-11-16",{"$f":"IF(L8>1,L8-TODAY(),\"\")","v":162}]
[null,null,null,null,null,null,null,"بداية إجازة يوم التأسيس","2024-02-22",null,null,null,{"$f":"IF(L9>1,L9-TODAY(),\"\")","v":""}]
[null,null,null,null,"بداية إجازة الفصل1","2023-11-16",null,"نهاية إجازة يوم التأسيس","2024-02-22",null,null,null,""]
{"$rows_left_out":16}
{"sheet":"بحث","index":2,"n_rows":20,"n_cols":15,"rows_kept":20,"cut":false,"hidden":false,"merged":[[8,7,8,8],[11,3,11,14],[3,5,3,7],[3,9,3,11],[4,5,4,7],[4,9,4,11],[6,5,6,7],[6,9,6,11],[9,7,9,10],[10,7,10,10],[12,3,12,4],[12,5,12,6],[12,7,12,8],[12,13,12,14],[19,3,20,14],[17,6,17,10],[17,3,17,5],[17,11,17,14],[12,9,12,10],[12,11,12,12]]}
[]
[]
[null,null,"؟"]
[null,null,null,null,null,"اكتب التاريخ الميلادي",null,null,"أو","اكتب التاريخ الهجري"]
[null,null,null,{"$f":"IF(LEN(TEXT(F5,\"yyyy\"))>4,\"خطأ\",\"\")","v":""},null,null,null,null,{"$f":"IF(AND(F5=\"\",J5=\"\"),TODAY(),IF(F5=\"\",J5,F5))","v":"2023-06-07"}]
[]
[null,null,null,null,"هجري",{"$f":"IF( OR(AND(F5=\"\",J5=\"\"),ISTEXT(F5)),TODAY(),IF(F5=\"\",\"\",F5))","v":"2023-06-07"},null,null,"ميلادي",{"$f":"IF(OR(AND(F5=\"\",J5=\"\"),ISTEXT(J5)),TODAY(),IF(J5=\"\",\"\",J5))","v":"2023-06-07"}]
[]
[null,null,null,null,null,null,null,{"$f":"TEXT(I5,\"dddd\")","v":"الأربعاء"},null,{"$f":"ROUND( بيانات!H15,0) & \"°\"","v":"44°"},{"$f":" ROUND( بيانات!N15,0)&\"°\"","v":"27°"}]
[null,null,null,null,null,null,null,{"$f":"INDEX(#REF!,MATCH(TEXT($I$5,\"mm/dd\"),INDEX(TEXT(#REF!,\"mm/dd\"),,),1),7)","v":{"$error":"#REF!"}}]
{"$rows_left_out":11}
{"sheet":"حول","index":3,"n_rows":66,"n_cols":8,"rows_kept":66,"cut":false,"hidden":false,"merged":[[67,2,67,7],[49,2,66,2],[55,7,57,7],[58,7,60,7],[61,7,63,7],[49,4,51,4],[52,4,54,4],[55,4,57,4],[58,4,60,4],[61,4,63,4],[64,4,66,4],[2,2,2,8],[3,2,3,8],[26,2,26,5],[27,2,27,5],[28,2,28,5],[17,2,17,8],[5,2,5,8],[34,2,42,4],[43,2,47,4],[52,7,54,7],[49,7,51,7],[64,7,66,7],[48,2,48,8],[49,8,67,8]]}
[]
[null,false,null,null,null,false]
[null,null,"لمحة عامة"]
[null,null,"هذا هي النسخة الاحترافية من التقويم الدراسي والمواعيد بالإضافة إلى معلومات عن الطقس ، التقويم يحدث نفسه كل شهر ميلادي،\nويمكنك التحكم في بدايته من خلال كتابة تاريخ في خانة البدء بتاريخ محدد.\nفي صفحة (المواعيد والإجازات) اكتب تواريخ مواعيدك الإجازات كما هو موضح في الصفحة وستظهر في الجدول بألوانها المحددة في تواريخها المكتوبة بالميلادي،\nويمكن إدراج موعد بالضغط على أي يوم من صفحة (التقويم)\nفي صفحة (بحث) يمكنك تحويل التاريخ من ميلادي إلى هجري أو العكس\nكما يمكنك معرفة الطقس خلال تاريخ تختاره.\nفي كل مرة تفتح البرنامج سيحفظ صورة من التقويم على سطح المكتب بإسم ( تقويم اكسل.jpg ) ؛ للاستفادة منها كخلفية لسطح المكتب أو طباعتها أو ارسالها لصديق،\nويمكنك إيقاف هذه الرسالة أو إيقاف حفظ الصورة من صفحة (حول)"]
[]
[null,null,"شرح علامات التبويب"]
[]
[]
[]
[]
{"$rows_left_out":57}
{"sheet":"بيانات","index":4,"n_rows":1832,"n_cols":18,"rows_kept":1832,"cut":false,"hidden":true,"merged":[[14,7,14,11],[14,13,14,17],[3,4,3,5],[0,7,0,11],[0,13,0,17],[6,7,6,11],[6,13,6,17],[8,7,8,11],[8,13,8,17]]}
["التاريخ","العظمى","الصغرى",null,null,null,null,"الكبرى",null,null,null,null,{"$f":"MONTH(M7)","v":6},"الصغرى"]
["2017-12-31",27,9,null,null,null,null,2018,2019,2020,2021,2022,"الشهر ^ اليومV",2018,2019,2020,2021,2022]
["2018-01-01",27,9,null,null,null,null,{"$f":"INDEX(العظمى,MATCH(DATE(H2,$M$1,$M$3),التاريخ,0),1)","v":45},{"$f":"INDEX(العظمى,MATCH(DATE(I2,$M$1,$M$3),التاريخ,0),1)","v":45},{"$f":"INDEX(العظمى,MATCH(DATE(J2,$M$1,$M$3),التاريخ,0),1)","v":41},{"$f":"INDEX(العظمى,MATCH(DATE(K2,$M$1,$M$3),التاريخ,0),1)","v":46},{"$f":"INDEX(العظمى,MATCH(DATE(L2,$M$1,$M$3),التاريخ,0),1)","v":42},{"$f":"DAY(M7)","v":7},{"$f":"INDEX(الصغرى,MATCH(DATE(N2,$M$1,$M$3),التاريخ,0),1)","v":28},{"$f":"INDEX(الصغرى,MATCH(DATE(O2,$M$1,$M$3),التاريخ,0),1)","v":26},{"$f":"INDEX(الصغرى,MATCH(DATE(P2,$M$1,$M$3),التاريخ,0),1)","v":27},{"$f":"INDEX(الصغرى,MATCH(DATE(Q2,$M$1,$M$3),التاريخ,0),1)","v":29},{"$f":"INDEX(الصغرى,MATCH(DATE(R2,$M$1,$M$3),التاريخ,0),1)","v":25}]
["2018-01-02",19,8,null,"فصول السنة",null,null,{"$f":"INDEX(العظمى,MATCH(DATE(H$2,$M$1,$M$3)-1,التاريخ,0),1)","v":44},{"$f":"INDEX(العظمى,MATCH(DATE(I$2,$M$1,$M$3)-1,التاريخ,0),1)","v":44},{"$f":"INDEX(العظمى,MATCH(DATE(J$2,$M$1,$M$3)-1,التاريخ,0),1)","v":41},{"$f":"INDEX(العظمى,MATCH(DATE(K$2,$M$1,$M$3)-1,التاريخ,0),1)","v":45},{"$f":"INDEX(العظمى,MATCH(DATE(L$2,$M$1,$M$3)-1,التاريخ,0),1)","v":41},null,{"$f":"INDEX(الصغرى,MATCH(DATE(N$2,$M$1,$M$3)-1,التاريخ,0),1)","v":27},{"$f":"INDEX(الصغرى,MATCH(DATE(O$2,$M$1,$M$3)-1,التاريخ,0),1)","v":26},{"$f":"INDEX(الصغرى,MATCH(DATE(P$2,$M$1,$M$3)-1,التاريخ,0),1)","v":28},{"$f":"INDEX(الصغرى,MATCH(DATE(Q$2,$M$1,$M$3)-1,التاريخ,0),1)","v":29},{"$f":"INDEX(الصغرى,MATCH(DATE(R$2,$M$1,$M$3)-1,التاريخ,0),1)","v":25}]
["2018-01-03",20,6,null,"البداية","النهاية","الفصل",{"$f":"INDEX(العظمى,MATCH(DATE(H$2,$M$1,$M$3)+1,التاريخ,0),1)","v":45},{"$f":"INDEX(العظمى,MATCH(DATE(I$2,$M$1,$M$3)+1,التاريخ,0),1)","v":44},{"$f":"INDEX(العظمى,MATCH(DATE(J$2,$M$1,$M$3)+1,التاريخ,0),1)","v":42},{"$f":"INDEX(العظمى,MATCH(DATE(K$2,$M$1,$M$3)+1,التاريخ,0),1)","v":44},{"$f":"INDEX(العظمى,MATCH(DATE(L$2,$M$1,$M$3)+1,التاريخ,0),1)","v":43},null,{"$f":"INDEX(الصغرى,MATCH(DATE(N$2,$M$1,$M$3)+1,التاريخ,0),1)","v":33},{"$f":"INDEX(الصغرى,MATCH(DATE(O$2,$M$1,$M$3)+1,التاريخ,0),1)","v":26},{"$f":"INDEX(الصغرى,MATCH(DATE(P$2,$M$1,$M$3)+1,التاريخ,0),1)","v":29},{"$f":"INDEX(الصغرى,MATCH(DATE(Q$2,$M$1,$M$3)+1,التاريخ,0),1)","v":28},{"$f":"INDEX(الصغرى,MATCH(DATE(R$2,$M$1,$M$3)+1,التاريخ,0),1)","v":25}]
["2018-01-04",23,5,null,"1900-01-01","1900-03-07","الشتاء",{"$f":"SMALL($H$3:$H$5,2)","v":45},{"$f":"SMALL($I$3:$I$5,2)","v":44},{"$f":"SMALL($J$3:$J$5,2)","v":41},{"$f":"SMALL($K$3:$K$5,2)","v":45},{"$f":"SMALL($L$3:$L$5,2)","v":42},null,{"$f":"SMALL(N$3:N$5,2)","v":28},{"$f":"SMALL(O$3:O$5,2)","v":26},{"$f":"SMALL(P$3:P$5,2)","v":28},{"$f":"SMALL(Q$3:Q$5,2)","v":29},{"$f":"SMALL(R$3:R$5,2)","v":25}]
["2018-01-05",22,8,null,"1900-03-08","1900-06-06","الربيع",{"$f":"AVERAGE(SMALL($H$6:$L$6,2),SMALL($H$6:$L$6,3),SMALL($H$6:$L$6,4))","v":43.666666666666664},null,null,null,null,{"$f":"TODAY()","v":"2023-06-07"},{"$f":"AVERAGE(SMALL($N$6:$R$6,2),SMALL($N$6:$R$6,3),SMALL($N$6:$R$6,4))","v":27.333333333333332}]
["2018-01-06",20,8,null,"1900-06-07","1900-09-05","الصيف"]
["2018-01-07",18,8,null,"1900-09-06","1900-12-06","الخريف","الكبرى",null,null,null,null,{"$f":"MONTH(M15)","v":6},"الصغرى"]
["2018-01-08",18,6,null,"1900-12-07","1900-12-31","الشتاء",2018,2019,2020,2021,2022,"الشهر ^ اليومV",2018,2019,2020,2021,2022]
{"$rows_left_out":1823}
{"sheet":"النجوم","index":5,"n_rows":90,"n_cols":7,"rows_kept":90,"cut":false,"hidden":true,"merged":[]}
["dat1","tm","nm","tn","t_edah2"]
["2019-01-01","المربعانية 39 يوم",14,"القلب 13 يوما","يشتد البرد والرياح ويظهر الضباب وتكثر الغيوم في ثلثه الأول أطول ليلة في السنة وأقصر نهار فيها ويزرع فيه القمح والشعير في شمال المملكة وتعتبر زراعة متأخرة ولا تروى الأشجار إلا إذا كانت في حاجة إلى الماء وليكن ذلك خفيفاً والبدء في تقليم أشجار العنب وعمل العقل وكذلك تقليم الأشجار متساقطة الأوراق كما يجب الإنهاء من نثر السماد العضوي  (الدمال) . وفيه تظهر طيور الوز الشتوي ."]
["2019-01-02","المربعانية 39 يوم",27,"الشولة 13 يوما","استمرار شدة البرد والصقيع والضباب ولذا يستمر في تغطية الشجيرات والخضروات وتسقط بقية أوراق الشجر كما يجب أن يتم الانتهاء من نثر السماد البلدي وتقليم الأشجار وإعداد الأرض لزراعة أشجار الفاكهة وزراعة المبكر منها مثل : الخوخ والمشمش والانتهاء من زراعة القمح والشعير ."]
["2019-01-15","الشبط  الأزيرق 26 يوم ",1,"النعايم 13 يوما","بردها قارس وشديد ويتميز بالصقيع وهو الطالع الرابع من فصل الشتاء وقد تبدأ النخيل البواكر في الطلع ويتم زراعة البطاطس وشتلات الطماطم والفلفل والباذنجان والفاصوليا واللوبيا مع حمايتها من البرد ."]
["2019-01-28","الشبط  الأزيرق 26 يوم ",14,"البلدة 13 يوما","نوؤها محمود قل ما يخلف مطرها بإذن اهلل وفيها يشتد البرد ويجمد الماء وأولها محرق وآخرها مورق وهي الطالع الخامس في فصل الشتاء ويزرع فيها البطيخ وتتزاوج العصافير وتزرع فيه شتلات الموالح والعنب والأشجار متساقطة الأوراق والخضار مثل الطماطم والفلفل والباذنجان والخس والبامية والملوخية والفرعيات والكراث خصوصاً في آخرها ."]
["2019-02-10"," العقارب 39 يوم",1,"سعد الذابح 13 يوما","يبدأ فيه جريان الماء في فروع الشجر ويورق ويكثر العشب والكمأة (الفقع) والثالثة أيام الأولى من سعد الذابح والثالثة الأخيرة من البلدة يطلق عليها (بذرة الست)  وهي صالحة لزراعة جميع الأشجار والخضروات وبالأخص البطيخ والفرعيات والباذنجان وما شابهها وتغرس فيه فسائل النخيل ."]
["2019-02-23"," العقارب 39 يوم",14,"سعد بلع 13 يوما","يكثر فيه المطر بإذن اهلل وبه نفس صفات ما قبله وفي آخره يكون البرد قارس وقد يحصل منه أضرار ."]
["2019-03-08"," العقارب 39 يوم",27,"سعد السعود (برد العجوز) 13 يوما","فيه يعتدل الطقس وتخضر الأرض وتورق الأشجار وتزهر ويكثر العشب والكمأة ) الفقع ( وتصوت الطيور وتغرس فيه فصائل النخيل وتكثر العواصف وتحتر الشمس ، واعتدال الربيع بآخره ويستوي الليل والنهار وفيه تزرع شتلات الموالح والعنب والأشجار وتضاف الدفعة الأولى من السماد الكيماوي وتروى الأشجار رياً خفيفاً عند الحاجة إذ أن تعطيشها ثم ريها يتسبب في تساقط الأزهار وفيه تزرع الخضار مثل : الفاصوليا واللوبيا والفرعيات وزراعة البرسيم الربيعية ."]
["2019-03-21","الحميمين 26 يوما",1,"سعد الأخيبيه  13 يوما","يزداد الدفء واخضرار الأشجار ونموها وانعقاد ثمارها ويتم ريها على فترات حسب الحاجة ويكثر تلقيح النخل وغرس فصائلها وتكثر الرياح وتخرج الهوام والحشرات من مخابئها وتزرع فيه الخضروات مثل الطماطم والباذنجان والفلفل والخس والفرعيات والباميا والملوخية والبقدونس وفيه أوائل مجيء الخواضير ) طيور الصيف ( ."]
["2019-04-03","الحميمين 26 يوما",14,"المقدم(بياع الخبل عباته) 13 يوما","برده يهلك الثمار ويعتبر دخوله آخر طلع النخل وغرسها وتروى فيه الأشجار حسب الحاجة وتسمد وتزال السرطانات منها وتقلم فروع العنب ) تطوش ( التي يصل طولها إلى 60 سم بقص الطرف بحوالي 2 سم من القمة ويسمد وتزرع فيه الخضار كسابقه والبرسيم والذرة الرفيعة . وفيه عودة الدخل والقماري وهجرة الكرك الصغير ."]
{"$rows_left_out":80}