{"text_format":"1","workbook":"xlsx","n_sheets":4,"sheets":["النسب ","القائمة","الشغل","تفرير"],"not_rendered":{"charts":0,"images":0,"macros":1,"external_links":0,"defined_names":8,"comments":1,"pivot_tables":0},"unopened":[],"bounds":{"document_bytes":16777216,"sheet_cells":100000,"rows_first":2000,"rows_last":500,"rows_between":2000,"halvings":0,"cell_chars":16384,"cell_head_chars":4096},"cells_cut":0,"cells_raw":0,"read":"whole","date_system":"1900"}

{"sheet":"النسب ","index":0,"n_rows":163,"n_cols":9,"rows_kept":163,"cut":false,"hidden":false,"merged":[]}
[]
["النسبة المؤية","النسبة العامة","المبلغ","اسم البند","القيمة المستحقة ","النسبة المؤية",null,null,{"$f":"VLOOKUP($H5,'النسب '!$A$2:$E$23,6,0)","v":{"$error":"#REF!"}}]
[0,0,0,0,0,0]
[0.05,5,32000,"مجارى مطر وكمر وتدعيمات",{"$f":"+C4*A4","v":1600},0.05]
[0.1,10,{"$f":"+C4","v":32000},{"$f":"+D4","v":"مجارى مطر وكمر وتدعيمات"},3200,0.1]
[0.15,15,{"$f":"+C5","v":32000},"مجارى مطر وكمر وتدعيمات",4800,0.15]
[0.2,20,32000,"مجارى مطر وكمر وتدعيمات",6400,0.2]
[0.25,25,32000,"مجارى مطر وكمر وتدعيمات",8000,0.25]
[0.3,30,32000,"مجارى مطر وكمر وتدعيمات",9600,0.3]
[0.35,35,32000,"مجارى مطر وكمر وتدعيمات",11200,0.35]
[0.4,40,32000,"مجارى مطر وكمر وتدعيمات",12800,0.4]
[0.45,45,32000,"مجارى مطر وكمر وتدعيمات",14400,0.45]
[0.5,50,32000,"مجارى مطر وكمر وتدعيمات",16000,0.5]
[0.55000000000000004,55,32000,"مجارى مطر وكمر وتدعيمات",17600,0.55000000000000004]
[0.6,60,32000,"مجارى مطر وكمر وتدعيمات",19200,0.6]
[0.65,65,32000,"مجارى مطر وكمر وتدعيمات",20800,0.65]
[0.7,70,32000,"مجارى مطر وكمر وتدعيمات",22400,0.7]
[0.75,75,32000,"مجارى مطر وكمر وتدعيمات",24000,0.75]
[0.8,80,32000,"مجارى مطر وكمر وتدعيمات",25600,0.8]
[0.85,85,32000,"مجارى مطر وكمر وتدعيمات",27200,0.85]
[0.9,90,32000,"مجارى مطر وكمر وتدعيمات",28800,0.9]
[0.95,95,{"$f":"+C21","v":32000},"مجارى مطر وكمر وتدعيمات",30400,0.95]
[1,100,32000,"مجارى مطر وكمر وتدعيمات",32000,1]
[0.05,5,42000,"الاقواس والمدادات",2100,0.05]
[0.1,10,{"$f":"+C24","v":42000},"الاقواس والمدادات",{"$f":"+C25*A25","v":4200},0.1]
[0.15,15,{"$f":"+C25","v":42000},"الاقواس والمدادات",6300,0.15]
[0.2,20,42000,"الاقواس والمدادات",8400,0.2]
[0.25,25,42000,"الاقواس والمدادات",10500,0.25]
[0.3,30,42000,"الاقواس والمدادات",12600,0.3]
[0.35,35,42000,"الاقواس والمدادات",14699.999999999998,0.35]
[0.4,40,42000,"الاقواس والمدادات",16800,0.4]
[0.45,45,42000,"الاقواس والمدادات",18900,0.45]
[0.5,50,42000,"الاقواس والمدادات",21000,0.5]
[0.55000000000000004,55,42000,"الاقواس والمدادات",23100.000000000004,0.55000000000000004]
[0.6,60,42000,"الاقواس والمدادات",25200,0.6]
[0.65,65,42000,"الاقواس والمدادات",27300,0.65]
[0.7,70,42000,"الاقواس والمدادات",29399.999999999996,0.7]
[0.75,75,42000,"الاقواس والمدادات",31500,0.75]
[0.8,80,42000,"الاقواس والمدادات",33600,0.8]
[0.85,85,42000,"الاقواس والمدادات",35700,0.85]
[0.9,90,42000,"الاقواس والمدادات",37800,0.9]
[0.95,95,42000,"الاقواس والمدادات",39900,0.95]
[1,100,42000,"الاقواس والمدادات",42000,1]
[0.05,5,42000,"البروفيل",{"$f":"+C44*A44","v":2100},0.05]
[0.1,10,{"$f":"+C44","v":42000},{"$f":"+D44","v":"البروفيل"},{"$f":"+C45*A45","v":4200},0.1]
[0.15,15,{"$f":"+C45","v":42000},"البروفيل",6300,0.15]
[0.2,20,{"$f":"+C46","v":42000},"البروفيل",8400,0.2]
[0.25,25,{"$f":"+C47","v":42000},"البروفيل",10500,0.25]
[0.3,30,{"$f":"+C48","v":42000},"البروفيل",12600,0.3]
[0.35,35,{"$f":"+C49","v":42000},"البروفيل",14699.999999999998,0.35]
[0.4,40,{"$f":"+C50","v":42000},"البروفيل",16800,0.4]
[0.45,45,{"$f":"+C51","v":42000},"البروفيل",18900,0.45]
[0.5,50,{"$f":"+C52","v":42000},"البروفيل",21000,0.5]
[0.55000000000000004,55,{"$f":"+C53","v":42000},"البروفيل",23100.000000000004,0.55000000000000004]
[0.6,60,{"$f":"+C54","v":42000},"البروفيل",25200,0.6]
[0.65,65,{"$f":"+C55","v":42000},"البروفيل",27300,0.65]
[0.7,70,{"$f":"+C56","v":42000},"البروفيل",29399.999999999996,0.7]
[0.75,75,{"$f":"+C57","v":42000},"البروفيل",31500,0.75]
[0.8,80,{"$f":"+C58","v":42000},"البروفيل",33600,0.8]
[0.85,85,{"$f":"+C59","v":42000},"البروفيل",35700,0.85]
[0.9,90,{"$f":"+C60","v":42000},"البروفيل",37800,0.9]
[0.95,95,{"$f":"+C61","v":42000},"البروفيل",39900,0.95]
[1,100,{"$f":"+C62","v":42000},"البروفيل",42000,1]
[0.05,5,6000,"البوبات",{"$f":"+C64*A64","v":300},0.05]
[0.1,10,{"$f":"+C64","v":6000},{"$f":"+D64","v":"البوبات"},{"$f":"+C65*A65","v":600},0.1]
[0.15,15,{"$f":"+C65","v":6000},"البوبات",900,0.15]
[0.2,20,{"$f":"+C66","v":6000},"البوبات",1200,0.2]
[0.25,25,{"$f":"+C67","v":6000},"البوبات",1500,0.25]
[0.3,30,{"$f":"+C68","v":6000},"البوبات",1800,0.3]
[0.35,35,{"$f":"+C69","v":6000},"البوبات",2100,0.35]
[0.4,40,{"$f":"+C70","v":6000},"البوبات",2400,0.4]
[0.45,45,{"$f":"+C71","v":6000},"البوبات",2700,0.45]
[0.5,50,{"$f":"+C72","v":6000},"البوبات",3000,0.5]
[0.55000000000000004,55,{"$f":"+C73","v":6000},"البوبات",3300.0000000000005,0.55000000000000004]
[0.6,60,{"$f":"+C74","v":6000},"البوبات",3600,0.6]
[0.65,65,{"$f":"+C75","v":6000},"البوبات",3900,0.65]
[0.7,70,{"$f":"+C76","v":6000},"البوبات",4200,0.7]
[0.75,75,{"$f":"+C77","v":6000},"البوبات",4500,0.75]
[0.8,80,{"$f":"+C78","v":6000},"البوبات",4800,0.8]
[0.85,85,{"$f":"+C79","v":6000},"البوبات",5100,0.85]
{"$rows_left_out":84}
{"sheet":"القائمة","index":1,"n_rows":47,"n_cols":7,"rows_kept":47,"cut":false,"hidden":false,"merged":[]}
["أسماء المقاولين","الكلاستر","الصوبة","العملية",{"$f":"+E2-تفرير!I4","v":{"$error":"#REF!"}},"المقاول","المبلغ"]
["محمد سليمان ","E1",1,"أعمدة وجرابات",{"$f":"SUM(G2:G22)","v":{"$error":"#REF!"}},{"$f":"+A2","v":"محمد سليمان "},{"$f":"SUMIF(الشغل!#REF!,$F2,الشغل!#REF!)+500","v":{"$error":"#REF!"}}]
["احمد حلمى ","E2",2,"مجارى كمر وتدعيم",null,{"$f":"+A3","v":"احمد حلمى "},{"$f":"SUMIF(الشغل!#REF!,$F3,الشغل!#REF!)","v":{"$error":"#REF!"}}]
["سامى الغندور","E3",3,"الاقواس",null,"سامى الغندور",{"$f":"SUMIF(الشغل!#REF!,$F4,الشغل!#REF!)","v":{"$error":"#REF!"}}]
["حسين عبد العال","E4",4,"المدادات",null,"حسين عبد العال",{"$f":"SUMIF(الشغل!#REF!,$F5,الشغل!#REF!)-500","v":{"$error":"#REF!"}}]
["عرفه محمود","E5",5,"البروفيل",null,"عرفه محمود",{"$f":"SUMIF(الشغل!#REF!,$F6,الشغل!#REF!)","v":{"$error":"#REF!"}}]
["هيثم العايدى","E6",6,"البوابات",null,"هيثم العايدى",{"$f":"SUMIF(الشغل!#REF!,$F7,الشغل!#REF!)","v":{"$error":"#REF!"}}]
["طاهر طارق","E7",7,"النهايز",null,"طاهر طارق",{"$f":"SUMIF(الشغل!#REF!,$F8,الشغل!#REF!)","v":{"$error":"#REF!"}}]
["محمد على البرى","E8",8,"حامل ثمار",null,"محمد على البرى",{"$f":"SUMIF(الشغل!#REF!,$F9,الشغل!#REF!)","v":{"$error":"#REF!"}}]
["شعبان الامام","E9",null,null,null,"شعبان الامام",{"$f":"SUMIF(الشغل!#REF!,$F10,الشغل!#REF!)","v":{"$error":"#REF!"}}]
["ياسر حماد","E10",null,null,null,"ياسر حماد",{"$f":"SUMIF(الشغل!#REF!,$F11,الشغل!#REF!)","v":{"$error":"#REF!"}}]
["ياسر هجرس","E11",null,null,null,"ياسر هجرس",{"$f":"SUMIF(الشغل!#REF!,$F12,الشغل!#REF!)","v":{"$error":"#REF!"}}]
["محمد عياد","E12",null,null,null,"محمد عياد",{"$f":"SUMIF(الشغل!#REF!,$F13,الشغل!#REF!)","v":{"$error":"#REF!"}}]
["ضياء على محمد","E13",null,null,null,"ضياء على محمد",{"$f":"SUMIF(الشغل!#REF!,$F14,الشغل!#REF!)","v":{"$error":"#REF!"}}]
["محمود فاروق","E14",null,null,null,"محمود فاروق",{"$f":"SUMIF(الشغل!#REF!,$F15,الشغل!#REF!)","v":{"$error":"#REF!"}}]
["محمد جمعه","E15",null,null,null,"محمد جمعه",{"$f":"SUMIF(الشغل!#REF!,$F16,الشغل!#REF!)","v":{"$error":"#REF!"}}]
["احمد فارس","E16",null,null,null,"احمد فارس",{"$f":"SUMIF(الشغل!#REF!,$F17,الشغل!#REF!)","v":{"$error":"#REF!"}}]
["السيد محمد على","E17",null,null,null,"السيد محمد على",{"$f":"SUMIF(الشغل!#REF!,$F18,الشغل!#REF!)","v":{"$error":"#REF!"}}]
["احمد كمال","E18",null,null,null,{"$f":"+A19","v":"احمد كمال"},{"$f":"SUMIF(الشغل!#REF!,$F19,الشغل!#REF!)","v":{"$error":"#REF!"}}]
["احمد مرعى","E19",null,null,null,"احمد مرعى",{"$f":"SUMIF(الشغل!#REF!,$F20,الشغل!#REF!)","v":{"$error":"#REF!"}}]
["فتحى زيدان سعيد","E20",null,null,null,"فتحى زيدان سعيد",{"$f":"SUMIF(الشغل!#REF!,$F21,الشغل!#REF!)","v":{"$error":"#REF!"}}]
["احمد عبد المنعم","E21",null,null,null,"احمد عبد المنعم",{"$f":"SUMIF(الشغل!#REF!,$F22,الشغل!#REF!)","v":{"$error":"#REF!"}}]
["ياسر ابو طالب","E22",null,null,null,"ياسر ابو طالب"]
["ناصر","E23",null,null,null,"ناصر"]
[null,"E24"]
[null,"E25"]
[null,"E26"]
[null,"E27"]
[null,"E28"]
[null,"E29"]
[null,"E30"]
[null,"E31"]
[null,"E32"]
[null,"E33"]
[null,"E34"]
[null,"E35"]
[null,"E36"]
[null,"E37"]
[null,"E38"]
[null,"E39"]
[null,"E40"]
[null,"E41"]
[null,"E42"]
[null,"E43"]
[null,"E44"]
[null,"E45"]
[null,"E46"]

{"sheet":"الشغل","index":2,"n_rows":489,"n_cols":14,"rows_kept":489,"cut":false,"hidden":false,"merged":[]}
[]
[null,null,null,null,null,null,null,null,{"$f":"SUBTOTAL(9,I5:I24)","v":20800}]
[]
[null,"التاريخ","المقاول","الكلاستر","الصوبة","عدد العمال","العملية","النسبة ","القيمة المستحقة"]
[null,"2019-06-26","احمد حلمى ","E1",2,0,"أعمدة وجرابات",0.1,{"$f":"IF(G5<>\"\",VLOOKUP($H5,'النسب '!$A$2:$E$143,5,0),\"\")","v":3200}]
[null,"2023-05-26","سامى الغندور","E2",3,0,"مجارى كمر وتدعيم",0.05,{"$f":"IF(G6<>\"\",VLOOKUP($H6,'النسب '!$A$2:$E$143,5,0),\"\")","v":1600}]
[null,"2023-05-27","حسين عبد العال","E3",8,0,"البوابات",0.15,{"$f":"IF(G7<>\"\",VLOOKUP($H7,'النسب '!$A$2:$E$143,5,0),\"\")","v":4800}]
[null,"2023-05-28","احمد فارس","E5",6,0,"النهايز",0.2,{"$f":"IF(G8<>\"\",VLOOKUP($H8,'النسب '!$A$2:$E$143,5,0),\"\")","v":6400}]
[null,"2023-05-29","احمد حلمى ","E1",2,0,"أعمدة وجرابات",0.1,{"$f":"IF(G9=القائمة!D$2,VLOOKUP($H9,'النسب '!$A$2:$E$143,5,0),\"\")","v":3200}]
[null,"2023-05-30","سامى الغندور","E2",3,0,"مجارى كمر وتدعيم",0.05,{"$f":"IF(G10=القائمة!D$2,VLOOKUP($H10,'النسب '!$A$2:$E$143,5,0),\"\")","v":""}]
[null,"2023-05-31","حسين عبد العال","E3",8,0,"البوابات",0.15,{"$f":"IF(G11=القائمة!D$2,VLOOKUP($H11,'النسب '!$A$2:$E$143,5,0),\"\")","v":""}]
[null,"2023-06-01","احمد فارس","E5",6,0,"النهايز",0.2,{"$f":"IF(G12=القائمة!D$2,VLOOKUP($H12,'النسب '!$A$2:$E$143,5,0),\"\")","v":""}]
[null,"2023-06-02","سامى الغندور","E2",3,0,"أعمدة وجرابات",0.05,{"$f":"IF(G13=القائمة!D$2,VLOOKUP($H13,'النسب '!$A$2:$E$143,5,0),\"\")","v":1600}]
[null,"2023-06-03","حسين عبد العال","E3",8,0,"مجارى كمر وتدعيم",0.15,{"$f":"IF(G14=القائمة!D$2,VLOOKUP($H14,'النسب '!$A$2:$E$143,5,0),\"\")","v":""}]
[null,"2023-06-04","احمد فارس","E5",6,0,"النهايز",0.2,{"$f":"IF(G15=القائمة!D$2,VLOOKUP($H15,'النسب '!$A$2:$E$143,5,0),\"\")","v":""}]
[null,null,null,null,null,null,null,null,{"$f":"IF(G16=القائمة!D$2,VLOOKUP($H16,'النسب '!$A$2:$E$143,5,0),\"\")","v":""}]
[null,null,null,null,null,null,null,null,{"$f":"IF(G17=القائمة!D$2,VLOOKUP($H17,'النسب '!$A$2:$E$143,5,0),\"\")","v":""}]
[null,null,null,null,null,null,null,null,{"$f":"IF(G18=القائمة!D$2,VLOOKUP($H18,'النسب '!$A$2:$E$143,5,0),\"\")","v":""}]
[null,null,null,null,null,null,null,null,{"$f":"IF(G19=القائمة!D$2,VLOOKUP($H19,'النسب '!$A$2:$E$143,5,0),\"\")","v":""}]
[null,null,null,null,null,null,null,null,{"$f":"IF(G20=القائمة!D$2,VLOOKUP($H20,'النسب '!$A$2:$E$143,5,0),\"\")","v":""}]
[null,null,null,null,null,null,null,null,{"$f":"IF(G21=القائمة!D$2,VLOOKUP($H21,'النسب '!$A$2:$E$143,5,0),\"\")","v":""}]
[null,null,null,null,null,null,null,null,{"$f":"IF(G22=القائمة!D$2,VLOOKUP($H22,'النسب '!$A$2:$E$143,5,0),\"\")","v":""}]
[null,null,null,null,null,null,null,null,{"$f":"IF(G23=القائمة!D$2,VLOOKUP($H23,'النسب '!$A$2:$E$143,5,0),\"\")","v":""}]
[null,null,null,null,null,null,null,null,{"$f":"IF(G24=القائمة!D$2,VLOOKUP($H24,'النسب '!$A$2:$E$143,5,0),\"\")","v":""}]
[null,null,null,null,null,null,null,null,{"$f":"IF(G25=القائمة!D$2,VLOOKUP($H25,'النسب '!$A$2:$E$143,5,0),\"\")","v":""}]
[null,null,null,null,null,null,null,null,{"$f":"IF(G26=القائمة!D$2,VLOOKUP($H26,'النسب '!$A$2:$E$143,5,0),\"\")","v":""}]
[null,null,null,null,null,null,null,null,{"$f":"IF(G27=القائمة!D$2,VLOOKUP($H27,'النسب '!$A$2:$E$143,5,0),\"\")","v":""}]
[null,null,null,null,null,null,null,null,{"$f":"IF(G28=القائمة!D$2,VLOOKUP($H28,'النسب '!$A$2:$E$143,5,0),\"\")","v":""}]
[null,null,null,null,null,null,null,null,{"$f":"IF(G29=القائمة!D$2,VLOOKUP($H29,'النسب '!$A$2:$E$143,5,0),\"\")","v":""}]
[null,null,null,null,null,null,null,null,{"$f":"IF(G30=القائمة!D$2,VLOOKUP($H30,'النسب '!$A$2:$E$143,5,0),\"\")","v":""}]
[null,null,null,null,null,null,null,null,{"$f":"IF(G31=القائمة!D$2,VLOOKUP($H31,'النسب '!$A$2:$E$143,5,0),\"\")","v":""}]
[null,null,null,null,null,null,null,null,{"$f":"IF(G32=القائمة!D$2,VLOOKUP($H32,'النسب '!$A$2:$E$143,5,0),\"\")","v":""}]
[null,null,null,null,null,null,null,null,{"$f":"IF(G33=القائمة!D$2,VLOOKUP($H33,'النسب '!$A$2:$E$143,5,0),\"\")","v":""}]
[null,null,null,null,null,null,null,null,{"$f":"IF(G34=القائمة!D$2,VLOOKUP($H34,'النسب '!$A$2:$E$143,5,0),\"\")","v":""}]
[null,null,null,null,null,null,null,null,{"$f":"IF(G35=القائمة!D$2,VLOOKUP($H35,'النسب '!$A$2:$E$143,5,0),\"\")","v":""}]
[null,null,null,null,null,null,null,null,{"$f":"IF(G36=القائمة!D$2,VLOOKUP($H36,'النسب '!$A$2:$E$143,5,0),\"\")","v":""}]
[null,null,null,null,null,null,null,null,{"$f":"IF(G37=القائمة!D$2,VLOOKUP($H37,'النسب '!$A$2:$E$143,5,0),\"\")","v":""}]
[null,null,null,null,null,null,null,null,{"$f":"IF(G38=القائمة!D$2,VLOOKUP($H38,'النسب '!$A$2:$E$143,5,0),\"\")","v":""}]
[null,null,null,null,null,null,null,null,{"$f":"IF(G39=القائمة!D$2,VLOOKUP($H39,'النسب '!$A$2:$E$143,5,0),\"\")","v":""}]
[null,null,null,null,null,null,null,null,{"$f":"IF(G40=القائمة!D$2,VLOOKUP($H40,'النسب '!$A$2:$E$143,5,0),\"\")","v":""}]
[null,null,null,null,null,null,null,null,{"$f":"IF(G41=القائمة!D$2,VLOOKUP($H41,'النسب '!$A$2:$E$143,5,0),\"\")","v":""}]
[null,null,null,null,null,null,null,null,{"$f":"IF(G42=القائمة!D$2,VLOOKUP($H42,'النسب '!$A$2:$E$143,5,0),\"\")","v":""}]
[null,null,null,null,null,null,null,null,{"$f":"IF(G43=القائمة!D$2,VLOOKUP($H43,'النسب '!$A$2:$E$143,5,0),\"\")","v":""}]
[null,null,null,null,null,null,null,null,{"$f":"IF(G44=القائمة!D$2,VLOOKUP($H44,'النسب '!$A$2:$E$143,5,0),\"\")","v":""}]
[null,null,null,null,null,null,null,null,{"$f":"IF(G45=القائمة!D$2,VLOOKUP($H45,'النسب '!$A$2:$E$143,5,0),\"\")","v":""}]
[null,null,null,null,null,null,null,null,{"$f":"IF(G46=القائمة!D$2,VLOOKUP($H46,'النسب '!$A$2:$E$143,5,0),\"\")","v":""}]
[null,null,null,null,null,null,null,null,{"$f":"IF(G47=القائمة!D$2,VLOOKUP($H47,'النسب '!$A$2:$E$143,5,0),\"\")","v":""}]
[null,null,null,null,null,null,null,null,{"$f":"IF(G48=القائمة!D$2,VLOOKUP($H48,'النسب '!$A$2:$E$143,5,0),\"\")","v":""}]
[null,null,null,null,null,null,null,null,{"$f":"IF(G49=القائمة!D$2,VLOOKUP($H49,'النسب '!$A$2:$E$143,5,0),\"\")","v":""}]
[null,null,null,null,null,null,null,null,{"$f":"IF(G50=القائمة!D$2,VLOOKUP($H50,'النسب '!$A$2:$E$143,5,0),\"\")","v":""}]
[null,null,null,null,null,null,null,null,{"$f":"IF(G51=القائمة!D$2,VLOOKUP($H51,'النسب '!$A$2:$E$143,5,0),\"\")","v":""}]
[null,null,null,null,null,null,null,null,{"$f":"IF(G52=القائمة!D$2,VLOOKUP($H52,'النسب '!$A$2:$E$143,5,0),\"\")","v":""}]
[null,null,null,null,null,null,null,null,{"$f":"IF(G53=القائمة!D$2,VLOOKUP($H53,'النسب '!$A$2:$E$143,5,0),\"\")","v":""}]
[null,null,null,null,null,null,null,null,{"$f":"IF(G54=القائمة!D$2,VLOOKUP($H54,'النسب '!$A$2:$E$143,5,0),\"\")","v":""}]
[null,null,null,null,null,null,null,null,{"$f":"IF(G55=القائمة!D$2,VLOOKUP($H55,'النسب '!$A$2:$E$143,5,0),\"\")","v":""}]
[null,null,null,null,null,null,null,null,{"$f":"IF(G56=القائمة!D$2,VLOOKUP($H56,'النسب '!$A$2:$E$143,5,0),\"\")","v":""}]
[null,null,null,null,null,null,null,null,{"$f":"IF(G57=القائمة!D$2,VLOOKUP($H57,'النسب '!$A$2:$E$143,5,0),\"\")","v":""}]
[null,null,null,null,null,null,null,null,{"$f":"IF(G58=القائمة!D$2,VLOOKUP($H58,'النسب '!$A$2:$E$143,5,0),\"\")","v":""}]
[null,null,null,null,null,null,null,null,{"$f":"IF(G59=القائمة!D$2,VLOOKUP($H59,'النسب '!$A$2:$E$143,5,0),\"\")","v":""}]
[null,null,null,null,null,null,null,null,{"$f":"IF(G60=القائمة!D$2,VLOOKUP($H60,'النسب '!$A$2:$E$143,5,0),\"\")","v":""}]
[null,null,null,null,null,null,null,null,{"$f":"IF(G61=القائمة!D$2,VLOOKUP($H61,'النسب '!$A$2:$E$143,5,0),\"\")","v":""}]
[null,null,null,null,null,null,null,null,{"$f":"IF(G62=القائمة!D$2,VLOOKUP($H62,'النسب '!$A$2:$E$143,5,0),\"\")","v":""}]
[null,null,null,null,null,null,null,null,{"$f":"IF(G63=القائمة!D$2,VLOOKUP($H63,'النسب '!$A$2:$E$143,5,0),\"\")","v":""}]
[null,null,null,null,null,null,null,null,{"$f":"IF(G64=القائمة!D$2,VLOOKUP($H64,'النسب '!$A$2:$E$143,5,0),\"\")","v":""},null,null,null,{"$f":"15000*60/100","v":9000}]
[null,null,null,null,null,null,null,null,{"$f":"IF(G65=القائمة!D$2,VLOOKUP($H65,'النسب '!$A$2:$E$143,5,0),\"\")","v":""}]
[null,null,null,null,null,null,null,null,{"$f":"IF(G66=القائمة!D$2,VLOOKUP($H66,'النسب '!$A$2:$E$143,5,0),\"\")","v":""}]
[null,null,null,null,null,null,null,null,{"$f":"IF(G67=القائمة!D$2,VLOOKUP($H67,'النسب '!$A$2:$E$143,5,0),\"\")","v":""}]
[null,null,null,null,null,null,null,null,{"$f":"IF(G68=القائمة!D$2,VLOOKUP($H68,'النسب '!$A$2:$E$143,5,0),\"\")","v":""}]
[null,null,null,null,null,null,null,null,{"$f":"IF(G69=القائمة!D$2,VLOOKUP($H69,'النسب '!$A$2:$E$143,5,0),\"\")","v":""}]
[null,null,null,null,null,null,null,null,{"$f":"IF(G70=القائمة!D$2,VLOOKUP($H70,'النسب '!$A$2:$E$143,5,0),\"\")","v":""}]
[null,null,null,null,null,null,null,null,{"$f":"IF(G71=القائمة!D$2,VLOOKUP($H71,'النسب '!$A$2:$E$143,5,0),\"\")","v":""}]
[null,null,null,null,null,null,null,null,{"$f":"IF(G72=القائمة!D$2,VLOOKUP($H72,'النسب '!$A$2:$E$143,5,0),\"\")","v":""}]
[null,null,null,null,null,null,null,null,{"$f":"IF(G73=القائمة!D$2,VLOOKUP($H73,'النسب '!$A$2:$E$143,5,0),\"\")","v":""}]
[null,null,null,null,null,null,null,null,{"$f":"IF(G74=القائمة!D$2,VLOOKUP($H74,'النسب '!$A$2:$E$143,5,0),\"\")","v":""}]
[null,null,null,null,null,null,null,null,{"$f":"IF(G75=القائمة!D$2,VLOOKUP($H75,'النسب '!$A$2:$E$143,5,0),\"\")","v":""}]
[null,null,null,null,null,null,null,null,{"$f":"IF(G76=القائمة!D$2,VLOOKUP($H76,'النسب '!$A$2:$E$143,5,0),\"\")","v":""}]
[null,null,null,null,null,null,null,null,{"$f":"IF(G77=القائمة!D$2,VLOOKUP($H77,'النسب '!$A$2:$E$143,5,0),\"\")","v":""}]
[null,null,null,null,null,null,null,null,{"$f":"IF(G78=القائمة!D$2,VLOOKUP($H78,'النسب '!$A$2:$E$143,5,0),\"\")","v":""},null,null,null,{"$f":"590+1110","v":1700}]
[null,null,null,null,null,null,null,null,{"$f":"IF(G79=القائمة!D$2,VLOOKUP($H79,'النسب '!$A$2:$E$143,5,0),\"\")","v":""}]
[null,null,null,null,null,null,null,null,{"$f":"IF(G80=القائمة!D$2,VLOOKUP($H80,'النسب '!$A$2:$E$143,5,0),\"\")","v":""}]
{"$rows_left_out":410}
{"sheet":"تفرير","index":3,"n_rows":494,"n_cols":10,"rows_kept":494,"cut":false,"hidden":false,"merged":[[1,1,1,4],[5,5,5,9]]}
[null,null,null,null,null,null,null,null,188100,{"$f":"+I4-I1","v":320700}]
[null,"تقرير النسب والمبلغ خلال العمليات للمقولين"]
[null,null,null,null,null,null,null,"البيان","التقرير","القائمة"]
[null,"المقاول","العملية","الكلاستر","الصوبة",null,null,"الاجمالى القيمة",{"$f":"SUM(J10:J102)","v":508800},{"$f":"VLOOKUP(B5,القائمة!$F$2:$G$21,2,0)","v":{"$error":"#N/A"}}]
[null,null,"أعمدة وجرابات",null,null,null,null,"الاجمالى العمالة",{"$f":"SUM($F$10:F102)","v":102},{"$f":"IF(B5<>\"\",I4-J4,\"\")","v":""}]
[null,null,null,null,"المبلغ",{"$f":"NoToTxt(I4,\"جنيها\",\"قرش\")","v":"فقط خمسمائة وثمانية ألف وثمانمائة جنيها"}]
[]
[]
[null,"التاريخ","المقاول","الكلاستر","الصوبة","عدد العمال","العملية","النسبة ","العمل","القيمة المستحقة"]
[null,"2019-06-26","احمد حلمى ",32,"F",0,"ميكانيكا وتظليل51%",0.4,20.400000000000002,9200]
[null,"2019-07-03","احمد حلمى ",2,"A",0,"ميكانيكا وتظليل51%",0.55000000000000004,28.05,12650.000000000002]
[null,"2019-07-03","احمد حلمى ",2,"B",0,"بلاستيك كامل 49%",0.55000000000000004,26.95,12100.000000000002]
[null,"2019-07-03","احمد حلمى ",2,"B",0,"ميكانيكا وتظليل51%",0.55000000000000004,28.05,12650.000000000002]
[null,"2019-07-03","احمد حلمى ",2,"C",0,"بلاستيك كامل 49%",0.55000000000000004,26.95,12100.000000000002]
[null,"2019-07-03","احمد حلمى ",2,"C",0,"ميكانيكا وتظليل51%",0.55000000000000004,28.05,12650.000000000002]
[null,"2019-07-03","احمد حلمى ",2,"D",0,"ميكانيكا وتظليل51%",0.55000000000000004,28.05,12650.000000000002]
[null,"2019-07-03","احمد حلمى ",2,"E",0,"بلاستيك كامل 49%",0.55000000000000004,26.95,12100.000000000002]
[null,"2019-07-03","احمد حلمى ",2,"A",0,"بلاستيك كامل 49%",0.55000000000000004,26.95,12100.000000000002]
[null,"2019-07-03","احمد حلمى ",2,"E",0,"ميكانيكا وتظليل51%",0.55000000000000004,28.05,12650.000000000002]
[null,"2019-07-03","احمد حلمى ",2,"F",0,"بلاستيك كامل 49%",0.55000000000000004,26.95,12100.000000000002]
[null,"2019-07-03","احمد حلمى ",2,"D",0,"بلاستيك كامل 49%",0.55000000000000004,26.95,12100.000000000002]
[null,"2019-07-03","احمد حلمى ",22,"D",0,"بلاستيك كامل 49%",0.75,36.75,16500]
[null,"2019-07-03","احمد حلمى ",2,"F",0,"ميكانيكا وتظليل51%",0.55000000000000004,28.05,12650.000000000002]
[null,"2019-07-03","شعبان الامام",13,"A",11,"ميكانيكا وتظليل51%",0.2,10.200000000000001,4600]
[null,"2019-07-03","ياسر هجرس",13,"A",0,"بلاستيك كامل 49%",0.5,24.5,11000]
[null,"2019-07-03","ياسر هجرس",13,"B",14,"بلاستيك كامل 49%",0.25,12.25,5500]
[null,"2019-07-10","ياسر هجرس",13,"b",0,"بلاستيك كامل 49%",0.1,4.8999999999999995,2200]
[null,"2019-07-10","احمد فارس",13,"b",0,"ميكانيكا وتظليل51%",null,0,0]
[null,"2019-07-31","احمد فارس",13,"b",0,"ميكانيكا وتظليل51%",null,0,0]
[null,"2019-08-21","احمد فارس",13,"b",0,"ميكانيكا وتظليل51%",null,0,0]
[null,"2019-08-28","احمد فارس",13,"b",0,"ميكانيكا وتظليل51%",null,0,0]
[null,"2019-09-11","سامى الغندور",13,"b",0,"بلاستيك كامل 49%",null,0,0]
[null,"2019-07-10","محمد جمعه",13,"c",0,"ميكانيكا وتظليل51%",null,0,0]
[null,"2019-07-17","محمد جمعه",13,"c",0,"ميكانيكا وتظليل51%",null,0,0]
[null,"2019-07-24","محمد جمعه",13,"c",0,"ميكانيكا وتظليل51%",null,0,0]
[null,"2019-07-31","محمد جمعه",13,"c",0,"ميكانيكا وتظليل51%",null,0,0]
[null,"2019-08-21","محمد جمعه",13,"c",0,"ميكانيكا وتظليل51%",null,0,0]
[null,"2019-08-28","محمد جمعه",13,"c",0,"ميكانيكا وتظليل51%",null,0,0]
[null,"2019-07-10","هيثم العايدى",13,"d",0,"ميكانيكا وتظليل51%",0,0,0]
[null,"2019-08-28","هيثم العايدى",13,"d",0,"ميكانيكا وتظليل51%",null,0,0]
[null,"2019-07-17","محمد على البرى",13,"e",0,"ميكانيكا وتظليل51%",0.5,25.5,11500]
[null,"2019-07-31","محمد على البرى",13,"e",0,"ميكانيكا وتظليل51%",0.2,10.200000000000001,4600]
[null,"2019-07-03","سامى الغندور",13,"F",0,"بلاستيك كامل 49%",0,0,0]
[null,"2019-09-11","هيثم العايدى",13,"F",0,"ميكانيكا وتظليل51%",0,0,0]
[null,"2019-07-10","هيثم العايدى",13,"f",0,"ميكانيكا وتظليل51%",null,0,0]
[null,"2019-09-11","سامى الغندور",13,"F",0,"بلاستيك كامل 49%",null,0,0]
[null,"2019-08-07","محمد سليمان ",22,"c",0,"بلاستيك كامل 49%",0.25,12.25,5500]
[null,"2019-07-03","طاهر طارق",22,"D",0,"ميكانيكا وتظليل51%",0.4,20.400000000000002,9200]
[null,"2019-09-01","فتحى زيدان سعيد",22,"d",0,"بلاستيك كامل 49%",0.1,4.8999999999999995,2200]
[null,"2019-09-11","احمد كمال",23,"a",0,"ميكانيكا وتظليل51%",0.1,5.1000000000000005,2300]
[null,"2019-08-28","حسين عبد العال",23,"A",0,"بلاستيك كامل 49%",0.65,31.849999999999998,14300]
[null,"2019-08-21","احمد كمال",23,"a",0,"ميكانيكا وتظليل51%",0.1,5.1000000000000005,2300]
[null,"2019-09-04","حسين عبد العال",23,"a",0,"بلاستيك كامل 49%",0.1,4.8999999999999995,2200]
[null,"2019-07-17","محمد عياد",23,"b",0,"بلاستيك كامل 49%",0.35,17.149999999999999,7699.9999999999991]
[null,"2019-07-17","محمود فاروق",23,"b",0,"ميكانيكا وتظليل51%",0,0,0]
[null,"2019-07-24","محمود فاروق",23,"b",0,"ميكانيكا وتظليل51%",0,0,0]
[null,"2019-07-31","محمود فاروق",23,"b",0,"ميكانيكا وتظليل51%",0,0,0]
[null,"2019-08-07","حسين عبد العال",23,"b",0,"بلاستيك كامل 49%",0,0,0]
[null,"2019-08-07","محمود فاروق",23,"b",0,"ميكانيكا وتظليل51%",0,0,0]
[null,"2019-07-03","حسين عبد العال",23,"C",25,"بلاستيك كامل 49%",0.7,34.299999999999997,15399.999999999998]
[null,"2019-09-11","احمد فارس",23,"c",0,"ميكانيكا وتظليل51%",0,0,0]
[null,"2019-08-28","احمد فارس",23,"C",0,"ميكانيكا وتظليل51%",0,0,0]
[null,"2019-07-03","حسين عبد العال",23,"D",25,"بلاستيك كامل 49%",0,0,0]
[null,"2019-07-17","السيد محمد على",23,"d",0,"ميكانيكا وتظليل51%",0,0,0]
[null,"2019-07-24","السيد محمد على",23,"d",0,"ميكانيكا وتظليل51%",0,0,0]
[null,"2019-07-31","السيد محمد على",23,"d",0,"ميكانيكا وتظليل51%",0,0,0]
[null,"2019-07-03","عرفه محمود",23,"F",15,"بلاستيك كامل 49%",0,0,0]
[null,"2019-07-10","شعبان الامام",23,"F",0,"ميكانيكا وتظليل51%",0.1,5.1000000000000005,2300]
[null,"2019-09-11","احمد مرعى",23,"f",0,"ميكانيكا وتظليل51%",0.1,5.1000000000000005,2300]
[null,"2019-07-31","حسين عبد العال",24,"a",0,"بلاستيك كامل 49%",0.55000000000000004,26.95,12100.000000000002]
[null,"2019-08-07","حسين عبد العال",24,"a",0,"بلاستيك كامل 49%",0.1,4.8999999999999995,2200]
[null,"2019-07-24","حسين عبد العال",24,"b",0,"بلاستيك كامل 49%",0.6,29.4,13200]
[null,"2019-07-17","حسين عبد العال",24,"c",0,"بلاستيك كامل 49%",0.5,24.5,11000]
[null,"2019-07-24","حسين عبد العال",24,"c",0,"بلاستيك كامل 49%",0.2,9.7999999999999989,4400]
[null,"2019-07-10","حسين عبد العال",24,"D",0,"بلاستيك كامل 49%",0.7,34.299999999999997,15399.999999999998]
[null,"2019-07-24","عرفه محمود",24,"e",0,"بلاستيك كامل 49%",0.65,31.849999999999998,14300]
[null,"2019-08-21","عرفه محمود",24,"E",0,"بلاستيك كامل 49%",0.1,4.8999999999999995,2200]
[null,"2019-07-10","عرفه محمود",24,"f",0,"بلاستيك كامل 49%",0.7,34.299999999999997,15399.999999999998]
[null,"2019-08-21","عرفه محمود",24,"f",0,"بلاستيك كامل 49%",0.05,2.4499999999999997,1100]
[null,"2019-06-26","احمد حلمى ",32,"C",0,"بلاستيك كامل 49%",0.3,14.7,6600]
{"$rows_left_out":414}