{"text_format":"1","workbook":"xlsx","n_sheets":4,"sheets":["all","teacher","class","visor"],"not_rendered":{"charts":0,"images":0,"macros":1,"external_links":0,"defined_names":3,"comments":0,"pivot_tables":0},"unopened":[],"bounds":{"document_bytes":16777216,"sheet_cells":100000,"rows_first":2000,"rows_last":500,"rows_between":2000,"halvings":0,"cell_chars":16384,"cell_head_chars":4096},"cells_cut":0,"cells_raw":0,"read":"whole","date_system":"1900"}

{"sheet":"all","index":0,"n_rows":123,"n_cols":41,"rows_kept":123,"cut":false,"hidden":false,"merged":[[1,25,1,31],[1,32,1,38],[1,4,1,10],[100,0,122,3],[0,1,0,2],[1,11,1,17],[1,18,1,24],[1,3,2,3],[1,0,2,0],[1,1,2,1]]}
[]
["م","المادة","اليوم","عدد الحصص","الأحد",null,null,null,null,null,null,"الاثنين",null,null,null,null,null,null,"الثلاثاء",null,null,null,null,null,null,"الأربعاء",null,null,null,null,null,null,"الخميس"]
[null,null,"المدرس - الحصة",null,1,2,3,4,5,6,7,1,2,3,4,5,6,7,1,2,3,4,5,6,7,1,2,3,4,5,6,7,1,2,3,4,5,6,7,null,"قائمة الفصول"]
[1,"حاسب آلي","محمد1",{"$f":"35-COUNTIF($E4:$AM4,\"\")","v":2},"10\\4",null,null,null,null,null,null,null,null,null,null,null,null,null,null,null,null,null,null,null,null,null,null,"10\\3",null,null,null,null,null,null,null,null,null,null,null,null,"10\\1"]
[2,"حاسب آلي","محمد2",{"$f":"35-COUNTIF($E5:$AM5,\"\")","v":4},null,"10\\4",null,null,"10\\3",null,null,null,null,"10\\3",null,null,null,null,"10\\3",null,null,null,null,null,null,null,null,null,null,null,null,null,null,null,null,null,null,null,null,null,"10\\2"]
[3,"حاسب آلي","محمد3",2,null,"10\\3",null,null,null,null,null,null,null,null,null,null,null,null,null,null,null,"10\\3",null,null,null,null,null,null,null,null,null,null,null,null,null,null,null,null,null,null,"10\\3"]
[4,"اجتماعيات","محمد4",1,null,null,null,null,null,"10\\3",null,null,null,null,null,null,null,null,null,null,null,null,null,null,null,null,null,null,null,null,null,null,null,null,null,null,null,null,null,null,"10\\4"]
[5,"اجتماعيات","محمد5",0,null,null,null,null,null,null,null,null,null,null,null,null,null,null,null,null,null,null,null,null,null,null,null,null,null,null,null,null,null,null,null,null,null,null,null,null,"10\\5"]
[6,"اجتماعيات","محمد6",0,null,null,null,null,null,null,null,null,null,null,null,null,null,null,null,null,null,null,null,null,null,null,null,null,null,null,null,null,null,null,null,null,null,null,null,null,"10\\6"]
[7,"اجتماعيات","محمد7",0,null,null,null,null,null,null,null,null,null,null,null,null,null,null,null,null,null,null,null,null,null,null,null,null,null,null,null,null,null,null,null,null,null,null,null,null,"10\\7"]
{"$rows_left_out":114}
{"sheet":"teacher","index":1,"n_rows":11,"n_cols":13,"rows_kept":11,"cut":false,"hidden":false,"merged":[[1,1,1,2]]}
[]
[null,"العام الدراسي",null,null,"جداول المعلمين",null,null,null,null,null,null,null,1]
[null,"2021-2022"]
[]
[null,null,null,{"$f":"INDEX(all!$C$4:$C$100,MATCH($M$2,all!$A$4:$A$100,0))","v":"محمد1"},null,null,null,{"$f":"VLOOKUP($M$2,all!$A$4:$C$100,2,0)","v":"حاسب آلي"}]
[null,null,"الأولى","الثانية","الثالثة","الرابعة","الخامسة","السادسة","السابعة"]
[null,"الأحد",{"$f":"IF(INDEX(all!$E$4:$E$100,MATCH($M$2,all!$A$4:$A$100,0))=\"\",\"\",INDEX(all!$E$4:$E$100,MATCH($M$2,all!$A$4:$A$100,0)))","v":"10\\4"},{"$f":"IF(INDEX(all!$F$4:$F$100,MATCH($M$2,all!$A$4:$A$100,0))=\"\",\"\",INDEX(all!$F$4:$F$100,MATCH($M$2,all!$A$4:$A$100,0)))","v":""},{"$f":"IF(INDEX(all!$G$4:$G$100,MATCH($M$2,all!$A$4:$A$100,0))=\"\",\"\",INDEX(all!$G$4:$G$100,MATCH($M$2,all!$A$4:$A$100,0)))","v":""},{"$f":"IF(INDEX(all!$H$4:$H$100,MATCH($M$2,all!$A$4:$A$100,0))=\"\",\"\",INDEX(all!$H$4:$H$100,MATCH($M$2,all!$A$4:$A$100,0)))","v":""},{"$f":"IF(INDEX(all!$I$4:$I$100,MATCH($M$2,all!$A$4:$A$100,0))=\"\",\"\",INDEX(all!$I$4:$I$100,MATCH($M$2,all!$A$4:$A$100,0)))","v":""},{"$f":"IF(INDEX(all!$J$4:$J$100,MATCH($M$2,all!$A$4:$A$100,0))=\"\",\"\",INDEX(all!$J$4:$J$100,MATCH($M$2,all!$A$4:$A$100,0)))","v":""},{"$f":"IF(INDEX(all!$K$4:$K$100,MATCH($M$2,all!$A$4:$A$100,0))=\"\",\"\",INDEX(all!$K$4:$K$100,MATCH($M$2,all!$A$4:$A$100,0)))","v":""}]
[null,"الإثنين",{"$f":"IF(INDEX(all!$L$4:$L$100,MATCH($M$2,all!$A$4:$A$100,0))=\"\",\"\",INDEX(all!$L$4:$L$100,MATCH($M$2,all!$A$4:$A$100,0)))","v":""},{"$f":"IF(INDEX(all!$M$4:$M$100,MATCH($M$2,all!$A$4:$A$100,0))=\"\",\"\",INDEX(all!$M$4:$M$100,MATCH($M$2,all!$A$4:$A$100,0)))","v":""},{"$f":"IF(INDEX(all!$N$4:$N$100,MATCH($M$2,all!$A$4:$A$100,0))=\"\",\"\",INDEX(all!$N$4:$N$100,MATCH($M$2,all!$A$4:$A$100,0)))","v":""},{"$f":"IF(INDEX(all!$O$4:$O$100,MATCH($M$2,all!$A$4:$A$100,0))=\"\",\"\",INDEX(all!$O$4:$O$100,MATCH($M$2,all!$A$4:$A$100,0)))","v":""},{"$f":"IF(INDEX(all!$P$4:$P$100,MATCH($M$2,all!$A$4:$A$100,0))=\"\",\"\",INDEX(all!$P$4:$P$100,MATCH($M$2,all!$A$4:$A$100,0)))","v":""},{"$f":"IF(INDEX(all!$Q$4:$Q$100,MATCH($M$2,all!$A$4:$A$100,0))=\"\",\"\",INDEX(all!$Q$4:$Q$100,MATCH($M$2,all!$A$4:$A$100,0)))","v":""},{"$f":"IF(INDEX(all!$R$4:$R$100,MATCH($M$2,all!$A$4:$A$100,0))=\"\",\"\",INDEX(all!$R$4:$R$100,MATCH($M$2,all!$A$4:$A$100,0)))","v":""}]
[null,"الثلاثاء",{"$f":"IF(INDEX(all!$S$4:$S$100,MATCH($M$2,all!$A$4:$A$100,0))=\"\",\"\",INDEX(all!$S$4:$S$100,MATCH($M$2,all!$A$4:$A$100,0)))","v":""},{"$f":"IF(INDEX(all!$T$4:$T$100,MATCH($M$2,all!$A$4:$A$100,0))=\"\",\"\",INDEX(all!$T$4:$T$100,MATCH($M$2,all!$A$4:$A$100,0)))","v":""},{"$f":"IF(INDEX(all!$U$4:$U$100,MATCH($M$2,all!$A$4:$A$100,0))=\"\",\"\",INDEX(all!$U$4:$U$100,MATCH($M$2,all!$A$4:$A$100,0)))","v":""},{"$f":"IF(INDEX(all!$V$4:$V$100,MATCH($M$2,all!$A$4:$A$100,0))=\"\",\"\",INDEX(all!$V$4:$V$100,MATCH($M$2,all!$A$4:$A$100,0)))","v":""},{"$f":"IF(INDEX(all!$W$4:$W$100,MATCH($M$2,all!$A$4:$A$100,0))=\"\",\"\",INDEX(all!$W$4:$W$100,MATCH($M$2,all!$A$4:$A$100,0)))","v":""},{"$f":"IF(INDEX(all!$X$4:$X$100,MATCH($M$2,all!$A$4:$A$100,0))=\"\",\"\",INDEX(all!$X$4:$X$100,MATCH($M$2,all!$A$4:$A$100,0)))","v":""},{"$f":"IF(INDEX(all!$Y$4:$Y$100,MATCH($M$2,all!$A$4:$A$100,0))=\"\",\"\",INDEX(all!$Y$4:$Y$100,MATCH($M$2,all!$A$4:$A$100,0)))","v":""}]
[null,"الأربعاء",{"$f":"IF(INDEX(all!$Z$4:$Z$100,MATCH($M$2,all!$A$4:$A$100,0))=\"\",\"\",INDEX(all!$Z$4:$Z$100,MATCH($M$2,all!$A$4:$A$100,0)))","v":""},{"$f":"IF(INDEX(all!$AA$4:$AA$100,MATCH($M$2,all!$A$4:$A$100,0))=\"\",\"\",INDEX(all!$AA$4:$AA$100,MATCH($M$2,all!$A$4:$A$100,0)))","v":""},{"$f":"IF(INDEX(all!$AB$4:$AB$100,MATCH($M$2,all!$A$4:$A$100,0))=\"\",\"\",INDEX(all!$AB$4:$AB$100,MATCH($M$2,all!$A$4:$A$100,0)))","v":"10\\3"},{"$f":"IF(INDEX(all!$AC$4:$AC$100,MATCH($M$2,all!$A$4:$A$100,0))=\"\",\"\",INDEX(all!$AC$4:$AC$100,MATCH($M$2,all!$A$4:$A$100,0)))","v":""},{"$f":"IF(INDEX(all!$AD$4:$AD$100,MATCH($M$2,all!$A$4:$A$100,0))=\"\",\"\",INDEX(all!$AD$4:$AD$100,MATCH($M$2,all!$A$4:$A$100,0)))","v":""},{"$f":"IF(INDEX(all!$AE$4:$AE$100,MATCH($M$2,all!$A$4:$A$100,0))=\"\",\"\",INDEX(all!$AE$4:$AE$100,MATCH($M$2,all!$A$4:$A$100,0)))","v":""},{"$f":"IF(INDEX(all!$AF$4:$AF$100,MATCH($M$2,all!$A$4:$A$100,0))=\"\",\"\",INDEX(all!$AF$4:$AF$100,MATCH($M$2,all!$A$4:$A$100,0)))","v":""}]
{"$rows_left_out":2}
{"sheet":"class","index":2,"n_rows":46,"n_cols":12,"rows_kept":46,"cut":false,"hidden":false,"merged":[[33,4,33,5],[36,1,37,1],[3,4,3,5],[2,3,2,4],[0,2,0,7],[14,1,15,1],[18,4,18,5],[38,1,39,1],[40,1,41,1],[42,1,43,1],[44,1,45,1],[6,1,7,1],[8,1,9,1],[10,1,11,1],[12,1,13,1],[21,1,22,1],[23,1,24,1],[25,1,26,1],[27,1,28,1],[29,1,30,1]]}
[null,null,"جدول حصص فصل"]
[null,null,null,null,null,null,null,null,null,null,null,"10\\1"]
[null,null,null,null,null,null,null,null,null,null,null,"10\\2"]
[null,null,null,null,{"$f":"L2","v":"10\\1"},null,null,null,null,null,null,"10\\3"]
[null,null,null,null,null,null,null,null,null,null,null,"10\\4"]
[null,null,"الأولـــى","الثانيـــة","الثالثـــة","الرابعـــة","الخامســـة","السادســـة","السابعـــة",null,null,"10\\5"]
[null,"الأحد",{"$f":"IF(ISNA(INDEX(all!$B$4:$B$100,MATCH($L$2,all!E$4:E$100,0))),\"\",INDEX(all!$B$4:$B$100,MATCH($L$2,all!E$4:E$100,0)))","v":""},{"$f":"IF(ISNA(INDEX(all!$B$4:$B$100,MATCH($L$2,all!F$4:F$100,0))),\"\",INDEX(all!$B$4:$B$100,MATCH($L$2,all!F$4:F$100,0)))","v":""},{"$f":"IF(ISNA(INDEX(all!$B$4:$B$100,MATCH($L$2,all!G$4:G$100,0))),\"\",INDEX(all!$B$4:$B$100,MATCH($L$2,all!G$4:G$100,0)))","v":""},{"$f":"IF(ISNA(INDEX(all!$B$4:$B$100,MATCH($L$2,all!H$4:H$100,0))),\"\",INDEX(all!$B$4:$B$100,MATCH($L$2,all!H$4:H$100,0)))","v":""},{"$f":"IF(ISNA(INDEX(all!$B$4:$B$100,MATCH($L$2,all!I$4:I$100,0))),\"\",INDEX(all!$B$4:$B$100,MATCH($L$2,all!I$4:I$100,0)))","v":""},{"$f":"IF(ISNA(INDEX(all!$B$4:$B$100,MATCH($L$2,all!J$4:J$100,0))),\"\",INDEX(all!$B$4:$B$100,MATCH($L$2,all!J$4:J$100,0)))","v":""},{"$f":"IF(ISNA(INDEX(all!$B$4:$B$100,MATCH($L$2,all!K$4:K$100,0))),\"\",INDEX(all!$B$4:$B$100,MATCH($L$2,all!K$4:K$100,0)))","v":""},null,null,"10\\6"]
[null,null,{"$f":"IF(ISNA(INDEX(all!$C$4:$C$100,MATCH($L$2,all!E$4:E$100,0))),\"\",INDEX(all!$C$4:$C$100,MATCH($L$2,all!E$4:E$100,0)))","v":""},{"$f":"IF(ISNA(INDEX(all!$C$4:$C$100,MATCH($L$2,all!F$4:F$100,0))),\"\",INDEX(all!$C$4:$C$100,MATCH($L$2,all!F$4:F$100,0)))","v":""},{"$f":"IF(ISNA(INDEX(all!$C$4:$C$100,MATCH($L$2,all!G$4:G$100,0))),\"\",INDEX(all!$C$4:$C$100,MATCH($L$2,all!G$4:G$100,0)))","v":""},{"$f":"IF(ISNA(INDEX(all!$C$4:$C$100,MATCH($L$2,all!H$4:H$100,0))),\"\",INDEX(all!$C$4:$C$100,MATCH($L$2,all!H$4:H$100,0)))","v":""},{"$f":"IF(ISNA(INDEX(all!$C$4:$C$100,MATCH($L$2,all!I$4:I$100,0))),\"\",INDEX(all!$C$4:$C$100,MATCH($L$2,all!I$4:I$100,0)))","v":""},{"$f":"IF(ISNA(INDEX(all!$C$4:$C$100,MATCH($L$2,all!J$4:J$100,0))),\"\",INDEX(all!$C$4:$C$100,MATCH($L$2,all!J$4:J$100,0)))","v":""},{"$f":"IF(ISNA(INDEX(all!$C$4:$C$100,MATCH($L$2,all!K$4:K$100,0))),\"\",INDEX(all!$C$4:$C$100,MATCH($L$2,all!K$4:K$100,0)))","v":""},null,null,"10\\7"]
[null,"الإثنين",{"$f":"IF(ISNA(INDEX(all!$B$4:$B$100,MATCH($L$2,all!L$4:L$100,0))),\"\",INDEX(all!$B$4:$B$100,MATCH($L$2,all!L$4:L$100,0)))","v":""},{"$f":"IF(ISNA(INDEX(all!$B$4:$B$100,MATCH($L$2,all!M$4:M$100,0))),\"\",INDEX(all!$B$4:$B$100,MATCH($L$2,all!M$4:M$100,0)))","v":""},{"$f":"IF(ISNA(INDEX(all!$B$4:$B$100,MATCH($L$2,all!N$4:N$100,0))),\"\",INDEX(all!$B$4:$B$100,MATCH($L$2,all!N$4:N$100,0)))","v":""},{"$f":"IF(ISNA(INDEX(all!$B$4:$B$100,MATCH($L$2,all!O$4:O$100,0))),\"\",INDEX(all!$B$4:$B$100,MATCH($L$2,all!O$4:O$100,0)))","v":""},{"$f":"IF(ISNA(INDEX(all!$B$4:$B$100,MATCH($L$2,all!P$4:P$100,0))),\"\",INDEX(all!$B$4:$B$100,MATCH($L$2,all!P$4:P$100,0)))","v":""},{"$f":"IF(ISNA(INDEX(all!$B$4:$B$100,MATCH($L$2,all!Q$4:Q$100,0))),\"\",INDEX(all!$B$4:$B$100,MATCH($L$2,all!Q$4:Q$100,0)))","v":""},{"$f":"IF(ISNA(INDEX(all!$B$4:$B$100,MATCH($L$2,all!R$4:R$100,0))),\"\",INDEX(all!$B$4:$B$100,MATCH($L$2,all!R$4:R$100,0)))","v":""},null,null,"11\\1"]
[null,null,{"$f":"IF(ISNA(INDEX(all!$C$4:$C$100,MATCH($L$2,all!L$4:L$100,0))),\"\",INDEX(all!$C$4:$C$100,MATCH($L$2,all!L$4:L$100,0)))","v":""},{"$f":"IF(ISNA(INDEX(all!$C$4:$C$100,MATCH($L$2,all!M$4:M$100,0))),\"\",INDEX(all!$C$4:$C$100,MATCH($L$2,all!M$4:M$100,0)))","v":""},{"$f":"IF(ISNA(INDEX(all!$C$4:$C$100,MATCH($L$2,all!N$4:N$100,0))),\"\",INDEX(all!$C$4:$C$100,MATCH($L$2,all!N$4:N$100,0)))","v":""},{"$f":"IF(ISNA(INDEX(all!$C$4:$C$100,MATCH($L$2,all!O$4:O$100,0))),\"\",INDEX(all!$C$4:$C$100,MATCH($L$2,all!O$4:O$100,0)))","v":""},{"$f":"IF(ISNA(INDEX(all!$C$4:$C$100,MATCH($L$2,all!P$4:P$100,0))),\"\",INDEX(all!$C$4:$C$100,MATCH($L$2,all!P$4:P$100,0)))","v":""},{"$f":"IF(ISNA(INDEX(all!$C$4:$C$100,MATCH($L$2,all!Q$4:Q$100,0))),\"\",INDEX(all!$C$4:$C$100,MATCH($L$2,all!Q$4:Q$100,0)))","v":""},{"$f":"IF(ISNA(INDEX(all!$C$4:$C$100,MATCH($L$2,all!R$4:R$100,0))),\"\",INDEX(all!$C$4:$C$100,MATCH($L$2,all!R$4:R$100,0)))","v":""},null,null,"11\\2"]
{"$rows_left_out":37}
{"sheet":"visor","index":3,"n_rows":26,"n_cols":18,"rows_kept":26,"cut":false,"hidden":false,"merged":[[0,2,0,8]]}
[null,null,null,null,null,null,null,null,null,null,null,null,null,null,1,2,null,2]
[null,null,"اليوم","الأحد",null,null,null,"الأحد",null,null,null,null,null,null,null,null,null,"الأحد"]
[null,"الفصل","الأولى","الثانية","الثالثة","الرابعة","الخامسة","السادسة","السابعة",null,null,null,null,null,null,null,null,"الاثنين"]
[null,{"$f":"IF(all!AO4=\"\",\"\",all!AO4)","v":"10\\1"},{"$f":"IF(ISNA(INDEX(all!$C$4:$C$103,MATCH($B4,all!E$4:E$103,0))),\"\",INDEX(all!$C$4:$C$103,MATCH($B4,all!E$4:E$103,0)))","v":0},{"$f":"IF(ISNA(INDEX(all!$C$4:$C$103,MATCH($B4,all!F$4:F$103,0))),\"\",INDEX(all!$C$4:$C$103,MATCH($B4,all!F$4:F$103,0)))","v":0},{"$f":"IF(ISNA(INDEX(all!$C$4:$C$103,MATCH($B4,all!G$4:G$103,0))),\"\",INDEX(all!$C$4:$C$103,MATCH($B4,all!G$4:G$103,0)))","v":0},{"$f":"IF(ISNA(INDEX(all!$C$4:$C$103,MATCH($B4,all!H$4:H$103,0))),\"\",INDEX(all!$C$4:$C$103,MATCH($B4,all!H$4:H$103,0)))","v":0},{"$f":"IF(ISNA(INDEX(all!$C$4:$C$103,MATCH($B4,all!I$4:I$103,0))),\"\",INDEX(all!$C$4:$C$103,MATCH($B4,all!I$4:I$103,0)))","v":0},null,{"$f":"IF(ISNA(INDEX(all!$C$4:$C$103,MATCH($B4,all!K$4:K$103,0))),\"\",INDEX(all!$C$4:$C$103,MATCH($B4,all!K$4:K$103,0)))","v":0}]
[null,{"$f":"IF(all!AO5=\"\",\"\",all!AO5)","v":"10\\2"},{"$f":"IF(ISNA(INDEX(all!$C$4:$C$103,MATCH($B5,all!E$4:E$103,0))),\"\",INDEX(all!$C$4:$C$103,MATCH($B5,all!E$4:E$103,0)))","v":0},{"$f":"IF(ISNA(INDEX(all!$C$4:$C$103,MATCH($B5,all!F$4:F$103,0))),\"\",INDEX(all!$C$4:$C$103,MATCH($B5,all!F$4:F$103,0)))","v":0},{"$f":"IF(ISNA(INDEX(all!$C$4:$C$103,MATCH($B5,all!G$4:G$103,0))),\"\",INDEX(all!$C$4:$C$103,MATCH($B5,all!G$4:G$103,0)))","v":0},{"$f":"IF(ISNA(INDEX(all!$C$4:$C$103,MATCH($B5,all!H$4:H$103,0))),\"\",INDEX(all!$C$4:$C$103,MATCH($B5,all!H$4:H$103,0)))","v":0},{"$f":"IF(ISNA(INDEX(all!$C$4:$C$103,MATCH($B5,all!I$4:I$103,0))),\"\",INDEX(all!$C$4:$C$103,MATCH($B5,all!I$4:I$103,0)))","v":0},{"$f":"IF(ISNA(INDEX(all!$C$4:$C$103,MATCH($B5,all!J$4:J$103,0))),\"\",INDEX(all!$C$4:$C$103,MATCH($B5,all!J$4:J$103,0)))","v":0},{"$f":"IF(ISNA(INDEX(all!$C$4:$C$103,MATCH($B5,all!K$4:K$103,0))),\"\",INDEX(all!$C$4:$C$103,MATCH($B5,all!K$4:K$103,0)))","v":0}]
[null,{"$f":"IF(all!AO6=\"\",\"\",all!AO6)","v":"10\\3"},{"$f":"IF(ISNA(INDEX(all!$C$4:$C$103,MATCH($B6,all!E$4:E$103,0))),\"\",INDEX(all!$C$4:$C$103,MATCH($B6,all!E$4:E$103,0)))","v":0},{"$f":"IF(ISNA(INDEX(all!$C$4:$C$103,MATCH($B6,all!F$4:F$103,0))),\"\",INDEX(all!$C$4:$C$103,MATCH($B6,all!F$4:F$103,0)))","v":"محمد3"},{"$f":"IF(ISNA(INDEX(all!$C$4:$C$103,MATCH($B6,all!G$4:G$103,0))),\"\",INDEX(all!$C$4:$C$103,MATCH($B6,all!G$4:G$103,0)))","v":0},{"$f":"IF(ISNA(INDEX(all!$C$4:$C$103,MATCH($B6,all!H$4:H$103,0))),\"\",INDEX(all!$C$4:$C$103,MATCH($B6,all!H$4:H$103,0)))","v":0},{"$f":"IF(ISNA(INDEX(all!$C$4:$C$103,MATCH($B6,all!I$4:I$103,0))),\"\",INDEX(all!$C$4:$C$103,MATCH($B6,all!I$4:I$103,0)))","v":"محمد2"},{"$f":"IF(ISNA(INDEX(all!$C$4:$C$103,MATCH($B6,all!J$4:J$103,0))),\"\",INDEX(all!$C$4:$C$103,MATCH($B6,all!J$4:J$103,0)))","v":"محمد4"},{"$f":"IF(ISNA(INDEX(all!$C$4:$C$103,MATCH($B6,all!K$4:K$103,0))),\"\",INDEX(all!$C$4:$C$103,MATCH($B6,all!K$4:K$103,0)))","v":0}]
[null,{"$f":"IF(all!AO7=\"\",\"\",all!AO7)","v":"10\\4"},{"$f":"IF(ISNA(INDEX(all!$C$4:$C$103,MATCH($B7,all!E$4:E$103,0))),\"\",INDEX(all!$C$4:$C$103,MATCH($B7,all!E$4:E$103,0)))","v":"محمد1"},{"$f":"IF(ISNA(INDEX(all!$C$4:$C$103,MATCH($B7,all!F$4:F$103,0))),\"\",INDEX(all!$C$4:$C$103,MATCH($B7,all!F$4:F$103,0)))","v":"محمد2"},{"$f":"IF(ISNA(INDEX(all!$C$4:$C$103,MATCH($B7,all!G$4:G$103,0))),\"\",INDEX(all!$C$4:$C$103,MATCH($B7,all!G$4:G$103,0)))","v":""},{"$f":"IF(ISNA(INDEX(all!$C$4:$C$103,MATCH($B7,all!H$4:H$103,0))),\"\",INDEX(all!$C$4:$C$103,MATCH($B7,all!H$4:H$103,0)))","v":""},{"$f":"IF(ISNA(INDEX(all!$C$4:$C$103,MATCH($B7,all!I$4:I$103,0))),\"\",INDEX(all!$C$4:$C$103,MATCH($B7,all!I$4:I$103,0)))","v":""},{"$f":"IF(ISNA(INDEX(all!$C$4:$C$103,MATCH($B7,all!J$4:J$103,0))),\"\",INDEX(all!$C$4:$C$103,MATCH($B7,all!J$4:J$103,0)))","v":""},{"$f":"IF(ISNA(INDEX(all!$C$4:$C$103,MATCH($B7,all!K$4:K$103,0))),\"\",INDEX(all!$C$4:$C$103,MATCH($B7,all!K$4:K$103,0)))","v":""},null,null,"طباعة "]
[null,{"$f":"IF(all!AO8=\"\",\"\",all!AO8)","v":"10\\5"},{"$f":"IF(ISNA(INDEX(all!$C$4:$C$103,MATCH($B8,all!E$4:E$103,0))),\"\",INDEX(all!$C$4:$C$103,MATCH($B8,all!E$4:E$103,0)))","v":""},{"$f":"IF(ISNA(INDEX(all!$C$4:$C$103,MATCH($B8,all!F$4:F$103,0))),\"\",INDEX(all!$C$4:$C$103,MATCH($B8,all!F$4:F$103,0)))","v":""},{"$f":"IF(ISNA(INDEX(all!$C$4:$C$103,MATCH($B8,all!G$4:G$103,0))),\"\",INDEX(all!$C$4:$C$103,MATCH($B8,all!G$4:G$103,0)))","v":""},{"$f":"IF(ISNA(INDEX(all!$C$4:$C$103,MATCH($B8,all!H$4:H$103,0))),\"\",INDEX(all!$C$4:$C$103,MATCH($B8,all!H$4:H$103,0)))","v":""},{"$f":"IF(ISNA(INDEX(all!$C$4:$C$103,MATCH($B8,all!I$4:I$103,0))),\"\",INDEX(all!$C$4:$C$103,MATCH($B8,all!I$4:I$103,0)))","v":""},{"$f":"IF(ISNA(INDEX(all!$C$4:$C$103,MATCH($B8,all!J$4:J$103,0))),\"\",INDEX(all!$C$4:$C$103,MATCH($B8,all!J$4:J$103,0)))","v":""},{"$f":"IF(ISNA(INDEX(all!$C$4:$C$103,MATCH($B8,all!K$4:K$103,0))),\"\",INDEX(all!$C$4:$C$103,MATCH($B8,all!K$4:K$103,0)))","v":""}]
[null,{"$f":"IF(all!AO9=\"\",\"\",all!AO9)","v":"10\\6"},{"$f":"IF(ISNA(INDEX(all!$C$4:$C$103,MATCH($B9,all!E$4:E$103,0))),\"\",INDEX(all!$C$4:$C$103,MATCH($B9,all!E$4:E$103,0)))","v":""},{"$f":"IF(ISNA(INDEX(all!$C$4:$C$103,MATCH($B9,all!F$4:F$103,0))),\"\",INDEX(all!$C$4:$C$103,MATCH($B9,all!F$4:F$103,0)))","v":""},{"$f":"IF(ISNA(INDEX(all!$C$4:$C$103,MATCH($B9,all!G$4:G$103,0))),\"\",INDEX(all!$C$4:$C$103,MATCH($B9,all!G$4:G$103,0)))","v":""},{"$f":"IF(ISNA(INDEX(all!$C$4:$C$103,MATCH($B9,all!H$4:H$103,0))),\"\",INDEX(all!$C$4:$C$103,MATCH($B9,all!H$4:H$103,0)))","v":""},{"$f":"IF(ISNA(INDEX(all!$C$4:$C$103,MATCH($B9,all!I$4:I$103,0))),\"\",INDEX(all!$C$4:$C$103,MATCH($B9,all!I$4:I$103,0)))","v":""},{"$f":"IF(ISNA(INDEX(all!$C$4:$C$103,MATCH($B9,all!J$4:J$103,0))),\"\",INDEX(all!$C$4:$C$103,MATCH($B9,all!J$4:J$103,0)))","v":""},{"$f":"IF(ISNA(INDEX(all!$C$4:$C$103,MATCH($B9,all!K$4:K$103,0))),\"\",INDEX(all!$C$4:$C$103,MATCH($B9,all!K$4:K$103,0)))","v":""}]
[null,{"$f":"IF(all!AO10=\"\",\"\",all!AO10)","v":"10\\7"},{"$f":"IF(ISNA(INDEX(all!$C$4:$C$103,MATCH($B10,all!E$4:E$103,0))),\"\",INDEX(all!$C$4:$C$103,MATCH($B10,all!E$4:E$103,0)))","v":""},{"$f":"IF(ISNA(INDEX(all!$C$4:$C$103,MATCH($B10,all!F$4:F$103,0))),\"\",INDEX(all!$C$4:$C$103,MATCH($B10,all!F$4:F$103,0)))","v":""},{"$f":"IF(ISNA(INDEX(all!$C$4:$C$103,MATCH($B10,all!G$4:G$103,0))),\"\",INDEX(all!$C$4:$C$103,MATCH($B10,all!G$4:G$103,0)))","v":""},{"$f":"IF(ISNA(INDEX(all!$C$4:$C$103,MATCH($B10,all!H$4:H$103,0))),\"\",INDEX(all!$C$4:$C$103,MATCH($B10,all!H$4:H$103,0)))","v":""},{"$f":"IF(ISNA(INDEX(all!$C$4:$C$103,MATCH($B10,all!I$4:I$103,0))),\"\",INDEX(all!$C$4:$C$103,MATCH($B10,all!I$4:I$103,0)))","v":""},{"$f":"IF(ISNA(INDEX(all!$C$4:$C$103,MATCH($B10,all!J$4:J$103,0))),\"\",INDEX(all!$C$4:$C$103,MATCH($B10,all!J$4:J$103,0)))","v":""},{"$f":"IF(ISNA(INDEX(all!$C$4:$C$103,MATCH($B10,all!K$4:K$103,0))),\"\",INDEX(all!$C$4:$C$103,MATCH($B10,all!K$4:K$103,0)))","v":""}]
{"$rows_left_out":16}