{"text_format":"1","workbook":"xlsx","n_sheets":4,"sheets":["سابق","data","شيت 2","كرم العرباوى"],"not_rendered":{"charts":0,"images":1,"macros":0,"external_links":1,"defined_names":7,"comments":0,"pivot_tables":0},"unopened":[],"bounds":{"document_bytes":16777216,"sheet_cells":100000,"rows_first":2000,"rows_last":500,"rows_between":2000,"halvings":0,"cell_chars":16384,"cell_head_chars":4096},"cells_cut":0,"cells_raw":0,"read":"whole","date_system":"1900"}

{"sheet":"سابق","index":0,"n_rows":8,"n_cols":11,"rows_kept":8,"cut":false,"hidden":true,"merged":[[6,0,6,10],[7,6,8,8],[7,5,8,5],[7,2,8,4],[5,0,5,8],[7,0,8,1],[7,9,8,10],[0,0,0,3],[0,4,0,6],[0,7,0,10],[1,0,1,1],[1,2,1,5],[1,8,1,10],[2,0,2,2],[2,3,2,5],[2,8,3,8],[2,9,3,9],[2,10,3,10]]}
["شركة/ دياجرام للمقاولات والتجارة والتوريدات            ",null,null,null,null,null,null,"المشروع/ مرابط الخيول"]
["إسم المقاول/هانى على جابر",null,"وصف العمل/ توريد مياة للموقع ",null,null,null,"مستخلص جاري",9,"   عن الفترة من  2/1 الي 2/15/ 2023        "]
["بيــــــانات التعــــــــــــاقد",null,null,"كـمـيــة الاعمـــــــــــــــال",null,null,"الفئـــــة","اجمــــــالي قيمة البند","نسبة الصرف","اجمــــــالي قيمة الاعمال","ملاحظــــــات"]
["رقم البند","بنود الاعمال","الوحدة","الكمية السابقة","الكمية الحالية","اجمالي الكميات","جنيه","جنيه"]
[1,"توريد مياة للموقع ","م.3",795,120,{"$f":"D5+E5","v":915},55,{"$f":"E5*G5","v":6600},null,{"$f":"F5*G5","v":50325},"جارى"]
["اجمالي قيمة الاعمال ",null,null,null,null,null,null,null,null,{"$f":"SUM(J5:J5)","v":50325}]
[]
["محاسب الموقع /",null,"مدير المشروع /",null,null,null,"مدير القطاع/",null,null,"مدير المشروعات/"]

{"sheet":"data","index":1,"n_rows":966,"n_cols":8,"rows_kept":966,"cut":false,"hidden":false,"merged":[]}
["م","التاريخ","جارى","البند","كمية حالية","نسبة الانجاز","كمية سابقة","الاجمالى"]
[{"$f":"ROW()-2","v":0},"2023-03-15",11,"توريد مياة للموقع ",1175,1,{"$f":"SUMIF($D$1:D1,D2,$E$1:E1)","v":0},{"$f":"SUMIF($D$2:D2,D2,$E$2:E2)","v":1175}]
[{"$f":"ROW()-2","v":1},"2023-03-31",12,"توريد مياة للموقع ",80,1,{"$f":"SUMIF($D$1:D2,D3,$E$1:E2)","v":1175},{"$f":"SUMIF($D$2:D3,D3,$E$2:E3)","v":1255}]
[2,"2023-04-30",13,"توريد مياة للموقع ",80,1,{"$f":"SUMIF($D$1:D3,D4,$E$1:E3)","v":1255},{"$f":"SUMIF($D$2:D4,D4,$E$2:E4)","v":1335}]
[3,"2023-05-15",14,"توريد مياة للموقع ",{"$f":"9*20","v":180},1,{"$f":"SUMIF($D$1:D4,D5,$E$1:E4)","v":1335},{"$f":"SUMIF($D$2:D5,D5,$E$2:E5)","v":1515}]
[4,"2023-05-31",15,"توريد مياة للموقع ",200,1,{"$f":"SUMIF($D$1:D5,D6,$E$1:E5)","v":1515},{"$f":"SUMIF($D$2:D6,D6,$E$2:E6)","v":1715}]
[5,"2023-05-31",15,"توريد سن مقاس موحد",12,1,{"$f":"SUMIF($D$1:D6,D7,$E$1:E6)","v":0},{"$f":"SUMIF($D$2:D7,D7,$E$2:E7)","v":12}]
[6,"2023-06-15",16,"توريد مياة للموقع ",{"$f":"11*20","v":220},1,{"$f":"SUMIF($D$1:D7,D8,$E$1:E7)","v":1715},{"$f":"SUMIF($D$2:D8,D8,$E$2:E8)","v":1935}]
[7,"2023-06-15",16,"توريد سن مقاس موحد",12,1,{"$f":"SUMIF($D$1:D8,D9,$E$1:E8)","v":12},{"$f":"SUMIF($D$2:D9,D9,$E$2:E9)","v":24}]
[8,null,null,null,null,null,{"$f":"SUMIF($D$1:D9,D10,$E$1:E9)","v":0},{"$f":"SUMIF($D$2:D10,D10,$E$2:E10)","v":0}]
[9,null,null,null,null,null,{"$f":"SUMIF($D$1:D10,D11,$E$1:E10)","v":0},{"$f":"SUMIF($D$2:D11,D11,$E$2:E11)","v":0}]
[10,null,null,null,null,null,{"$f":"SUMIF($D$1:D11,D12,$E$1:E11)","v":0},{"$f":"SUMIF($D$2:D12,D12,$E$2:E12)","v":0}]
[11,null,null,null,null,null,{"$f":"SUMIF($D$1:D12,D13,$E$1:E12)","v":0},{"$f":"SUMIF($D$2:D13,D13,$E$2:E13)","v":0}]
[12,null,null,null,null,null,{"$f":"SUMIF($D$1:D13,D14,$E$1:E13)","v":0},{"$f":"SUMIF($D$2:D14,D14,$E$2:E14)","v":0}]
[13,null,null,null,null,null,{"$f":"SUMIF($D$1:D14,D15,$E$1:E14)","v":0},{"$f":"SUMIF($D$2:D15,D15,$E$2:E15)","v":0}]
[14,null,null,null,null,null,{"$f":"SUMIF($D$1:D15,D16,$E$1:E15)","v":0},{"$f":"SUMIF($D$2:D16,D16,$E$2:E16)","v":0}]
[15,null,null,null,null,null,{"$f":"SUMIF($D$1:D16,D17,$E$1:E16)","v":0},{"$f":"SUMIF($D$2:D17,D17,$E$2:E17)","v":0}]
[16,null,null,null,null,null,{"$f":"SUMIF($D$1:D17,D18,$E$1:E17)","v":0},{"$f":"SUMIF($D$2:D18,D18,$E$2:E18)","v":0}]
[17,null,null,null,null,null,{"$f":"SUMIF($D$1:D18,D19,$E$1:E18)","v":0},{"$f":"SUMIF($D$2:D19,D19,$E$2:E19)","v":0}]
[18,null,null,null,null,null,{"$f":"SUMIF($D$1:D19,D20,$E$1:E19)","v":0},{"$f":"SUMIF($D$2:D20,D20,$E$2:E20)","v":0}]
[19,null,null,null,null,null,{"$f":"SUMIF($D$1:D20,D21,$E$1:E20)","v":0},{"$f":"SUMIF($D$2:D21,D21,$E$2:E21)","v":0}]
[20,null,null,null,null,null,{"$f":"SUMIF($D$1:D21,D22,$E$1:E21)","v":0},{"$f":"SUMIF($D$2:D22,D22,$E$2:E22)","v":0}]
[21,null,null,null,null,null,{"$f":"SUMIF($D$1:D22,D23,$E$1:E22)","v":0},{"$f":"SUMIF($D$2:D23,D23,$E$2:E23)","v":0}]
[22,null,null,null,null,null,{"$f":"SUMIF($D$1:D23,D24,$E$1:E23)","v":0},{"$f":"SUMIF($D$2:D24,D24,$E$2:E24)","v":0}]
[23,null,null,null,null,null,{"$f":"SUMIF($D$1:D24,D25,$E$1:E24)","v":0},{"$f":"SUMIF($D$2:D25,D25,$E$2:E25)","v":0}]
[24,null,null,null,null,null,{"$f":"SUMIF($D$1:D25,D26,$E$1:E25)","v":0},{"$f":"SUMIF($D$2:D26,D26,$E$2:E26)","v":0}]
[25,null,null,null,null,null,{"$f":"SUMIF($D$1:D26,D27,$E$1:E26)","v":0},{"$f":"SUMIF($D$2:D27,D27,$E$2:E27)","v":0}]
[26,null,null,null,null,null,{"$f":"SUMIF($D$1:D27,D28,$E$1:E27)","v":0},{"$f":"SUMIF($D$2:D28,D28,$E$2:E28)","v":0}]
[27,null,null,null,null,null,{"$f":"SUMIF($D$1:D28,D29,$E$1:E28)","v":0},{"$f":"SUMIF($D$2:D29,D29,$E$2:E29)","v":0}]
[28,null,null,null,null,null,{"$f":"SUMIF($D$1:D29,D30,$E$1:E29)","v":0},{"$f":"SUMIF($D$2:D30,D30,$E$2:E30)","v":0}]
[29,null,null,null,null,null,{"$f":"SUMIF($D$1:D30,D31,$E$1:E30)","v":0},{"$f":"SUMIF($D$2:D31,D31,$E$2:E31)","v":0}]
[30,null,null,null,null,null,{"$f":"SUMIF($D$1:D31,D32,$E$1:E31)","v":0},{"$f":"SUMIF($D$2:D32,D32,$E$2:E32)","v":0}]
[31,null,null,null,null,null,{"$f":"SUMIF($D$1:D32,D33,$E$1:E32)","v":0},{"$f":"SUMIF($D$2:D33,D33,$E$2:E33)","v":0}]
[32,null,null,null,null,null,{"$f":"SUMIF($D$1:D33,D34,$E$1:E33)","v":0},{"$f":"SUMIF($D$2:D34,D34,$E$2:E34)","v":0}]
[33,null,null,null,null,null,{"$f":"SUMIF($D$1:D34,D35,$E$1:E34)","v":0},{"$f":"SUMIF($D$2:D35,D35,$E$2:E35)","v":0}]
[34,null,null,null,null,null,{"$f":"SUMIF($D$1:D35,D36,$E$1:E35)","v":0},{"$f":"SUMIF($D$2:D36,D36,$E$2:E36)","v":0}]
[35,null,null,null,null,null,{"$f":"SUMIF($D$1:D36,D37,$E$1:E36)","v":0},{"$f":"SUMIF($D$2:D37,D37,$E$2:E37)","v":0}]
[36,null,null,null,null,null,{"$f":"SUMIF($D$1:D37,D38,$E$1:E37)","v":0},{"$f":"SUMIF($D$2:D38,D38,$E$2:E38)","v":0}]
[37,null,null,null,null,null,{"$f":"SUMIF($D$1:D38,D39,$E$1:E38)","v":0},{"$f":"SUMIF($D$2:D39,D39,$E$2:E39)","v":0}]
[38,null,null,null,null,null,{"$f":"SUMIF($D$1:D39,D40,$E$1:E39)","v":0},{"$f":"SUMIF($D$2:D40,D40,$E$2:E40)","v":0}]
[39,null,null,null,null,null,{"$f":"SUMIF($D$1:D40,D41,$E$1:E40)","v":0},{"$f":"SUMIF($D$2:D41,D41,$E$2:E41)","v":0}]
[40,null,null,null,null,null,{"$f":"SUMIF($D$1:D41,D42,$E$1:E41)","v":0},{"$f":"SUMIF($D$2:D42,D42,$E$2:E42)","v":0}]
[41,null,null,null,null,null,{"$f":"SUMIF($D$1:D42,D43,$E$1:E42)","v":0},{"$f":"SUMIF($D$2:D43,D43,$E$2:E43)","v":0}]
[42,null,null,null,null,null,{"$f":"SUMIF($D$1:D43,D44,$E$1:E43)","v":0},{"$f":"SUMIF($D$2:D44,D44,$E$2:E44)","v":0}]
[43,null,null,null,null,null,{"$f":"SUMIF($D$1:D44,D45,$E$1:E44)","v":0},{"$f":"SUMIF($D$2:D45,D45,$E$2:E45)","v":0}]
[44,null,null,null,null,null,{"$f":"SUMIF($D$1:D45,D46,$E$1:E45)","v":0},{"$f":"SUMIF($D$2:D46,D46,$E$2:E46)","v":0}]
[45,null,null,null,null,null,{"$f":"SUMIF($D$1:D46,D47,$E$1:E46)","v":0},{"$f":"SUMIF($D$2:D47,D47,$E$2:E47)","v":0}]
[46,null,null,null,null,null,{"$f":"SUMIF($D$1:D47,D48,$E$1:E47)","v":0},{"$f":"SUMIF($D$2:D48,D48,$E$2:E48)","v":0}]
[47,null,null,null,null,null,{"$f":"SUMIF($D$1:D48,D49,$E$1:E48)","v":0},{"$f":"SUMIF($D$2:D49,D49,$E$2:E49)","v":0}]
[48,null,null,null,null,null,{"$f":"SUMIF($D$1:D49,D50,$E$1:E49)","v":0},{"$f":"SUMIF($D$2:D50,D50,$E$2:E50)","v":0}]
[49,null,null,null,null,null,{"$f":"SUMIF($D$1:D50,D51,$E$1:E50)","v":0},{"$f":"SUMIF($D$2:D51,D51,$E$2:E51)","v":0}]
[50,null,null,null,null,null,{"$f":"SUMIF($D$1:D51,D52,$E$1:E51)","v":0},{"$f":"SUMIF($D$2:D52,D52,$E$2:E52)","v":0}]
[51,null,null,null,null,null,{"$f":"SUMIF($D$1:D52,D53,$E$1:E52)","v":0},{"$f":"SUMIF($D$2:D53,D53,$E$2:E53)","v":0}]
[52,null,null,null,null,null,{"$f":"SUMIF($D$1:D53,D54,$E$1:E53)","v":0},{"$f":"SUMIF($D$2:D54,D54,$E$2:E54)","v":0}]
[53,null,null,null,null,null,{"$f":"SUMIF($D$1:D54,D55,$E$1:E54)","v":0},{"$f":"SUMIF($D$2:D55,D55,$E$2:E55)","v":0}]
[54,null,null,null,null,null,{"$f":"SUMIF($D$1:D55,D56,$E$1:E55)","v":0},{"$f":"SUMIF($D$2:D56,D56,$E$2:E56)","v":0}]
[55,null,null,null,null,null,{"$f":"SUMIF($D$1:D56,D57,$E$1:E56)","v":0},{"$f":"SUMIF($D$2:D57,D57,$E$2:E57)","v":0}]
[56,null,null,null,null,null,{"$f":"SUMIF($D$1:D57,D58,$E$1:E57)","v":0},{"$f":"SUMIF($D$2:D58,D58,$E$2:E58)","v":0}]
[57,null,null,null,null,null,{"$f":"SUMIF($D$1:D58,D59,$E$1:E58)","v":0},{"$f":"SUMIF($D$2:D59,D59,$E$2:E59)","v":0}]
[58,null,null,null,null,null,{"$f":"SUMIF($D$1:D59,D60,$E$1:E59)","v":0},{"$f":"SUMIF($D$2:D60,D60,$E$2:E60)","v":0}]
[59,null,null,null,null,null,{"$f":"SUMIF($D$1:D60,D61,$E$1:E60)","v":0},{"$f":"SUMIF($D$2:D61,D61,$E$2:E61)","v":0}]
[60,null,null,null,null,null,{"$f":"SUMIF($D$1:D61,D62,$E$1:E61)","v":0},{"$f":"SUMIF($D$2:D62,D62,$E$2:E62)","v":0}]
[61,null,null,null,null,null,{"$f":"SUMIF($D$1:D62,D63,$E$1:E62)","v":0},{"$f":"SUMIF($D$2:D63,D63,$E$2:E63)","v":0}]
[62,null,null,null,null,null,{"$f":"SUMIF($D$1:D63,D64,$E$1:E63)","v":0},{"$f":"SUMIF($D$2:D64,D64,$E$2:E64)","v":0}]
[63,null,null,null,null,null,{"$f":"SUMIF($D$1:D64,D65,$E$1:E64)","v":0},{"$f":"SUMIF($D$2:D65,D65,$E$2:E65)","v":0}]
[{"$f":"ROW()-2","v":64},null,null,null,null,null,{"$f":"SUMIF($D$1:D65,D66,$E$1:E65)","v":0},{"$f":"SUMIF($D$2:D66,D66,$E$2:E66)","v":0}]
[65,null,null,null,null,null,{"$f":"SUMIF($D$1:D66,D67,$E$1:E66)","v":0},{"$f":"SUMIF($D$2:D67,D67,$E$2:E67)","v":0}]
[66,null,null,null,null,null,{"$f":"SUMIF($D$1:D67,D68,$E$1:E67)","v":0},{"$f":"SUMIF($D$2:D68,D68,$E$2:E68)","v":0}]
[67,null,null,null,null,null,{"$f":"SUMIF($D$1:D68,D69,$E$1:E68)","v":0},{"$f":"SUMIF($D$2:D69,D69,$E$2:E69)","v":0}]
[68,null,null,null,null,null,{"$f":"SUMIF($D$1:D69,D70,$E$1:E69)","v":0},{"$f":"SUMIF($D$2:D70,D70,$E$2:E70)","v":0}]
[69,null,null,null,null,null,{"$f":"SUMIF($D$1:D70,D71,$E$1:E70)","v":0},{"$f":"SUMIF($D$2:D71,D71,$E$2:E71)","v":0}]
[70,null,null,null,null,null,{"$f":"SUMIF($D$1:D71,D72,$E$1:E71)","v":0},{"$f":"SUMIF($D$2:D72,D72,$E$2:E72)","v":0}]
[71,null,null,null,null,null,{"$f":"SUMIF($D$1:D72,D73,$E$1:E72)","v":0},{"$f":"SUMIF($D$2:D73,D73,$E$2:E73)","v":0}]
[72,null,null,null,null,null,{"$f":"SUMIF($D$1:D73,D74,$E$1:E73)","v":0},{"$f":"SUMIF($D$2:D74,D74,$E$2:E74)","v":0}]
[73,null,null,null,null,null,{"$f":"SUMIF($D$1:D74,D75,$E$1:E74)","v":0},{"$f":"SUMIF($D$2:D75,D75,$E$2:E75)","v":0}]
[74,null,null,null,null,null,{"$f":"SUMIF($D$1:D75,D76,$E$1:E75)","v":0},{"$f":"SUMIF($D$2:D76,D76,$E$2:E76)","v":0}]
[75,null,null,null,null,null,{"$f":"SUMIF($D$1:D76,D77,$E$1:E76)","v":0},{"$f":"SUMIF($D$2:D77,D77,$E$2:E77)","v":0}]
[76,null,null,null,null,null,{"$f":"SUMIF($D$1:D77,D78,$E$1:E77)","v":0},{"$f":"SUMIF($D$2:D78,D78,$E$2:E78)","v":0}]
[77,null,null,null,null,null,{"$f":"SUMIF($D$1:D78,D79,$E$1:E78)","v":0},{"$f":"SUMIF($D$2:D79,D79,$E$2:E79)","v":0}]
[78,null,null,null,null,null,{"$f":"SUMIF($D$1:D79,D80,$E$1:E79)","v":0},{"$f":"SUMIF($D$2:D80,D80,$E$2:E80)","v":0}]
[79,null,null,null,null,null,{"$f":"SUMIF($D$1:D80,D81,$E$1:E80)","v":0},{"$f":"SUMIF($D$2:D81,D81,$E$2:E81)","v":0}]
[80,null,null,null,null,null,{"$f":"SUMIF($D$1:D81,D82,$E$1:E81)","v":0},{"$f":"SUMIF($D$2:D82,D82,$E$2:E82)","v":0}]
[81,null,null,null,null,null,{"$f":"SUMIF($D$1:D82,D83,$E$1:E82)","v":0},{"$f":"SUMIF($D$2:D83,D83,$E$2:E83)","v":0}]
[82,null,null,null,null,null,{"$f":"SUMIF($D$1:D83,D84,$E$1:E83)","v":0},{"$f":"SUMIF($D$2:D84,D84,$E$2:E84)","v":0}]
[83,null,null,null,null,null,{"$f":"SUMIF($D$1:D84,D85,$E$1:E84)","v":0},{"$f":"SUMIF($D$2:D85,D85,$E$2:E85)","v":0}]
[84,null,null,null,null,null,{"$f":"SUMIF($D$1:D85,D86,$E$1:E85)","v":0},{"$f":"SUMIF($D$2:D86,D86,$E$2:E86)","v":0}]
[85,null,null,null,null,null,{"$f":"SUMIF($D$1:D86,D87,$E$1:E86)","v":0},{"$f":"SUMIF($D$2:D87,D87,$E$2:E87)","v":0}]
[86,null,null,null,null,null,{"$f":"SUMIF($D$1:D87,D88,$E$1:E87)","v":0},{"$f":"SUMIF($D$2:D88,D88,$E$2:E88)","v":0}]
[87,null,null,null,null,null,{"$f":"SUMIF($D$1:D88,D89,$E$1:E88)","v":0},{"$f":"SUMIF($D$2:D89,D89,$E$2:E89)","v":0}]
[88,null,null,null,null,null,{"$f":"SUMIF($D$1:D89,D90,$E$1:E89)","v":0},{"$f":"SUMIF($D$2:D90,D90,$E$2:E90)","v":0}]
[89,null,null,null,null,null,{"$f":"SUMIF($D$1:D90,D91,$E$1:E90)","v":0},{"$f":"SUMIF($D$2:D91,D91,$E$2:E91)","v":0}]
[90,null,null,null,null,null,{"$f":"SUMIF($D$1:D91,D92,$E$1:E91)","v":0},{"$f":"SUMIF($D$2:D92,D92,$E$2:E92)","v":0}]
[91,null,null,null,null,null,{"$f":"SUMIF($D$1:D92,D93,$E$1:E92)","v":0},{"$f":"SUMIF($D$2:D93,D93,$E$2:E93)","v":0}]
[92,null,null,null,null,null,{"$f":"SUMIF($D$1:D93,D94,$E$1:E93)","v":0},{"$f":"SUMIF($D$2:D94,D94,$E$2:E94)","v":0}]
[93,null,null,null,null,null,{"$f":"SUMIF($D$1:D94,D95,$E$1:E94)","v":0},{"$f":"SUMIF($D$2:D95,D95,$E$2:E95)","v":0}]
[94,null,null,null,null,null,{"$f":"SUMIF($D$1:D95,D96,$E$1:E95)","v":0},{"$f":"SUMIF($D$2:D96,D96,$E$2:E96)","v":0}]
[95,null,null,null,null,null,{"$f":"SUMIF($D$1:D96,D97,$E$1:E96)","v":0},{"$f":"SUMIF($D$2:D97,D97,$E$2:E97)","v":0}]
[96,null,null,null,null,null,{"$f":"SUMIF($D$1:D97,D98,$E$1:E97)","v":0},{"$f":"SUMIF($D$2:D98,D98,$E$2:E98)","v":0}]
[97,null,null,null,null,null,{"$f":"SUMIF($D$1:D98,D99,$E$1:E98)","v":0},{"$f":"SUMIF($D$2:D99,D99,$E$2:E99)","v":0}]
[98,null,null,null,null,null,{"$f":"SUMIF($D$1:D99,D100,$E$1:E99)","v":0},{"$f":"SUMIF($D$2:D100,D100,$E$2:E100)","v":0}]
[99,null,null,null,null,null,{"$f":"SUMIF($D$1:D100,D101,$E$1:E100)","v":0},{"$f":"SUMIF($D$2:D101,D101,$E$2:E101)","v":0}]
[100,null,null,null,null,null,{"$f":"SUMIF($D$1:D101,D102,$E$1:E101)","v":0},{"$f":"SUMIF($D$2:D102,D102,$E$2:E102)","v":0}]
[101,null,null,null,null,null,{"$f":"SUMIF($D$1:D102,D103,$E$1:E102)","v":0},{"$f":"SUMIF($D$2:D103,D103,$E$2:E103)","v":0}]
[102,null,null,null,null,null,{"$f":"SUMIF($D$1:D103,D104,$E$1:E103)","v":0},{"$f":"SUMIF($D$2:D104,D104,$E$2:E104)","v":0}]
[103,null,null,null,null,null,{"$f":"SUMIF($D$1:D104,D105,$E$1:E104)","v":0},{"$f":"SUMIF($D$2:D105,D105,$E$2:E105)","v":0}]
[104,null,null,null,null,null,{"$f":"SUMIF($D$1:D105,D106,$E$1:E105)","v":0},{"$f":"SUMIF($D$2:D106,D106,$E$2:E106)","v":0}]
[105,null,null,null,null,null,{"$f":"SUMIF($D$1:D106,D107,$E$1:E106)","v":0},{"$f":"SUMIF($D$2:D107,D107,$E$2:E107)","v":0}]
[106,null,null,null,null,null,{"$f":"SUMIF($D$1:D107,D108,$E$1:E107)","v":0},{"$f":"SUMIF($D$2:D108,D108,$E$2:E108)","v":0}]
[107,null,null,null,null,null,{"$f":"SUMIF($D$1:D108,D109,$E$1:E108)","v":0},{"$f":"SUMIF($D$2:D109,D109,$E$2:E109)","v":0}]
[108,null,null,null,null,null,{"$f":"SUMIF($D$1:D109,D110,$E$1:E109)","v":0},{"$f":"SUMIF($D$2:D110,D110,$E$2:E110)","v":0}]
[109,null,null,null,null,null,{"$f":"SUMIF($D$1:D110,D111,$E$1:E110)","v":0},{"$f":"SUMIF($D$2:D111,D111,$E$2:E111)","v":0}]
[110,null,null,null,null,null,{"$f":"SUMIF($D$1:D111,D112,$E$1:E111)","v":0},{"$f":"SUMIF($D$2:D112,D112,$E$2:E112)","v":0}]
[111,null,null,null,null,null,{"$f":"SUMIF($D$1:D112,D113,$E$1:E112)","v":0},{"$f":"SUMIF($D$2:D113,D113,$E$2:E113)","v":0}]
[112,null,null,null,null,null,{"$f":"SUMIF($D$1:D113,D114,$E$1:E113)","v":0},{"$f":"SUMIF($D$2:D114,D114,$E$2:E114)","v":0}]
[113,null,null,null,null,null,{"$f":"SUMIF($D$1:D114,D115,$E$1:E114)","v":0},{"$f":"SUMIF($D$2:D115,D115,$E$2:E115)","v":0}]
[114,null,null,null,null,null,{"$f":"SUMIF($D$1:D115,D116,$E$1:E115)","v":0},{"$f":"SUMIF($D$2:D116,D116,$E$2:E116)","v":0}]
[115,null,null,null,null,null,{"$f":"SUMIF($D$1:D116,D117,$E$1:E116)","v":0},{"$f":"SUMIF($D$2:D117,D117,$E$2:E117)","v":0}]
[116,null,null,null,null,null,{"$f":"SUMIF($D$1:D117,D118,$E$1:E117)","v":0},{"$f":"SUMIF($D$2:D118,D118,$E$2:E118)","v":0}]
[117,null,null,null,null,null,{"$f":"SUMIF($D$1:D118,D119,$E$1:E118)","v":0},{"$f":"SUMIF($D$2:D119,D119,$E$2:E119)","v":0}]
[118,null,null,null,null,null,{"$f":"SUMIF($D$1:D119,D120,$E$1:E119)","v":0},{"$f":"SUMIF($D$2:D120,D120,$E$2:E120)","v":0}]
{"$rows_left_out":847}
{"sheet":"شيت 2","index":2,"n_rows":18,"n_cols":12,"rows_kept":18,"cut":false,"hidden":false,"merged":[[14,6,14,10],[15,6,15,10],[17,4,17,6],[17,8,17,9],[1,4,2,6],[13,6,13,10],[4,4,4,9],[10,6,10,10],[11,6,11,10],[12,6,12,10],[1,7,2,7]]}
[null,"شركة دياجرام للمقاولات العامة والتجارة والتوريدات",null,null,null,null,null,null,"التاريخ   ",{"$f":"INDEX(data!$B:$B,MAX(ROW(data!$B:$B)*(data!$B:$B<>\"\")))","v":"2023-06-15"}]
[null,"مشروع /  مرابط الخيول",null,null,"مستخلص جارى رقم ",null,null,12]
[]
[null,"مقاول /  هانى على جابر"]
[null,null,null,null,"الاعمال"]
["البند","بيان الاعمال","الوحدة","الفئة / جم","السابق كمية","السابق قيمة","الحالى كمية","نسبة الانجاز","الحالى قيمة","الاجمالى كمية","الاجمالى قيمة","ملاحظات"]
[1,"توريد مياة للموقع ","م.3",55,{"$f":"IFERROR(INDEX(data!G:G,MATCH(1,($B7=data!D:D)*($H$2=data!C:C),0)),0)","v":1175},{"$f":"IFERROR(Table1[[#This Row],[السابق كمية]]*Table1[[#This Row],[الفئة / جم]],0)","v":64625},{"$f":"IFERROR(INDEX(data!E:E,MATCH(1,($B7=data!D:D)*($H$2=data!C:C),0)),0)","v":80},{"$f":"IFERROR(INDEX(data!F:F,MATCH(1,($B7=data!D:D)*($H$2=data!C:C),0)),0)","v":1},{"$f":"IFERROR(Table1[[#This Row],[نسبة الانجاز]]*Table1[[#This Row],[الحالى كمية]]*Table1[[#This Row],[الفئة / جم]],0)","v":4400},{"$f":"IFERROR(Table1[[#This Row],[السابق كمية]]+(Table1[[#This Row],[الحالى كمية]]*Table1[[#This Row],[نسبة الانجاز]]),0)","v":1255},{"$f":"IFERROR(Table1[[#This Row],[الاجمالى كمية]]*Table1[[#This Row],[الفئة / جم]],0)","v":69025}]
[2,"توريد سن مقاس موحد","م.3",230,{"$f":"IFERROR(INDEX(data!G:G,MATCH(1,($B8=data!D:D)*($H$2=data!C:C),0)),0)","v":0},{"$f":"IFERROR(Table1[[#This Row],[السابق كمية]]*Table1[[#This Row],[الفئة / جم]],0)","v":0},{"$f":"IFERROR(INDEX(data!E:E,MATCH(1,($B8=data!D:D)*($H$2=data!C:C),0)),0)","v":0},{"$f":"IFERROR(INDEX(data!F:F,MATCH(1,($B8=data!D:D)*($H$2=data!C:C),0)),0)","v":0},{"$f":"IFERROR(Table1[[#This Row],[نسبة الانجاز]]*Table1[[#This Row],[الحالى كمية]]*Table1[[#This Row],[الفئة / جم]],0)","v":0},{"$f":"IFERROR(Table1[[#This Row],[السابق كمية]]+(Table1[[#This Row],[الحالى كمية]]*Table1[[#This Row],[نسبة الانجاز]]),0)","v":0},{"$f":"IFERROR(Table1[[#This Row],[الاجمالى كمية]]*Table1[[#This Row],[الفئة / جم]],0)","v":0}]
["Total",null,null,null,null,{"$f":"SUBTOTAL(109,Table1[السابق قيمة])","v":64625},null,null,{"$f":"SUBTOTAL(109,Table1[الحالى قيمة])","v":4400},null,{"$f":"SUBTOTAL(109,Table1[الاجمالى قيمة])","v":69025}]
[]
[null,null,null,null,null,null,"اجمالى الاعمال",null,null,null,null,{"$f":"SUM(Table1[[#Totals],[الاجمالى قيمة]])","v":69025}]
[null,null,null,null,null,null,"السابق من الاعمال",null,null,null,null,{"$f":"SUM(Table1[[#Totals],[السابق قيمة]])","v":64625}]
[null,null,null,null,null,null,"الحالــــى",null,null,null,null,{"$f":"L11-L12","v":4400}]
[null,null,null,null,null,null,"ضمان اعمال 5%",null,null,null,null,"."]
[null,null,null,null,null,null,"ضرائب منبع 3 %",null,null,null,null,"."]
[null,null,null,null,null,null,"صافى المستخلص",null,null,null,null,{"$f":"SUM(L13:L15)","v":4400}]
[]
[null,"محاسب الموقع",null,null,"مدير الموقع",null,null,"مدير القطاع","cost control",null,"مدير المشروعات"]

{"sheet":"كرم العرباوى","index":3,"n_rows":8,"n_cols":11,"rows_kept":8,"cut":false,"hidden":true,"merged":[[5,0,5,8],[0,0,0,3],[0,4,0,6],[0,7,0,10],[1,0,1,1],[1,2,1,5],[1,8,1,10],[2,0,2,2],[2,3,2,5],[2,8,3,8],[2,9,3,9],[2,10,3,10],[6,0,6,10],[7,0,8,1],[7,3,8,4],[7,6,8,8],[7,9,8,10]]}
["شركة/ دياجرام للمقاولات والتجارة والتوريدات            ",null,null,null,null,null,null,"المشروع/ مرابط الخيول"]
["إسم المقاول/كرم ربيع سالم",null,"وصف العمل/ توريد مياة للموقع ",null,null,null,"مستخلص جاري",1,"   عن الفترة من  10/1 الي 10/1/ 2022        "]
["بيــــــانات التعــــــــــــاقد",null,null,"كـمـيــة الاعمـــــــــــــــال",null,null,"الفئـــــة","اجمــــــالي قيمة الاعمال","نسبة الصرف","اجمـــــالي قيمة البند","ملاحظــــــات"]
["رقم البند","بنود الاعمال","الوحدة","الكمية السابقة","الكمية الحالية","اجمالي الكميات","جنيه","جنيه"]
[1,"توريد مياة للموقع ","م.3",null,20,{"$f":"D5+E5","v":20},60,{"$f":"F5*G5","v":1200},null,{"$f":"E5*G5","v":1200},"جارى"]
["اجمالي قيمة الاعمال ",null,null,null,null,null,null,null,null,{"$f":"SUM(J5:J5)","v":1200}]
[]
["محاسب الموقع /",null,null,"مدير المشروع /",null,null,"مدير القطاع/",null,null,"مدير المشروعات/"]