{"text_format":"1","workbook":"xlsx","n_sheets":5,"sheets":["النسب ","القائمة","الشغل","تفرير","النسب"],"not_rendered":{"charts":0,"images":0,"macros":1,"external_links":0,"defined_names":9,"comments":1,"pivot_tables":0},"unopened":[],"bounds":{"document_bytes":16777216,"sheet_cells":100000,"rows_first":2000,"rows_last":500,"rows_between":2000,"halvings":0,"cell_chars":16384,"cell_head_chars":4096},"cells_cut":0,"cells_raw":0,"read":"whole","date_system":"1900"}

{"sheet":"النسب ","index":0,"n_rows":163,"n_cols":10,"rows_kept":163,"cut":false,"hidden":false,"merged":[]}
[]
["النسبة المؤية","النسبة العامة","المبلغ","اسم البند","القيمة المستحقة ","النسبة المؤية",null,null,{"$f":"VLOOKUP($H5,'النسب '!$A$2:$E$23,6,0)","v":{"$error":"#N/A"}},"اسم البند"]
[{"$f":"D3&F3","v":"00"},0,0,0,0,0,null,null,null,0]
["مجارى مطر وكمر وتدعيمات0.05",5,32000,"مجارى مطر وكمر وتدعيمات",{"$f":"C4*F4","v":1600},0.05,null,null,null,"مجارى مطر وكمر وتدعيمات"]
["مجارى مطر وكمر وتدعيمات0.1",10,{"$f":"+C4","v":32000},{"$f":"+D4","v":"مجارى مطر وكمر وتدعيمات"},3200,0.1,null,null,null,"الاقواس والمدادات"]
["مجارى مطر وكمر وتدعيمات0.15",15,{"$f":"+C5","v":32000},"مجارى مطر وكمر وتدعيمات",4800,0.15,null,null,null,"البروفيل"]
["مجارى مطر وكمر وتدعيمات0.2",20,32000,"مجارى مطر وكمر وتدعيمات",6400,0.2,null,null,null,"البوابات"]
["مجارى مطر وكمر وتدعيمات0.25",25,32000,"مجارى مطر وكمر وتدعيمات",8000,0.25,null,null,null,"النهايز"]
["مجارى مطر وكمر وتدعيمات0.3",30,32000,"مجارى مطر وكمر وتدعيمات",9600,0.3,null,null,null,"حامل ثمار"]
["مجارى مطر وكمر وتدعيمات0.35",35,32000,"مجارى مطر وكمر وتدعيمات",11200,0.35,null,null,null,"أعمدة وجرابات"]
["مجارى مطر وكمر وتدعيمات0.4",40,32000,"مجارى مطر وكمر وتدعيمات",12800,0.4]
["مجارى مطر وكمر وتدعيمات0.45",45,32000,"مجارى مطر وكمر وتدعيمات",14400,0.45]
["مجارى مطر وكمر وتدعيمات0.5",50,32000,"مجارى مطر وكمر وتدعيمات",16000,0.5]
["مجارى مطر وكمر وتدعيمات0.55",55,32000,"مجارى مطر وكمر وتدعيمات",17600,0.55000000000000004]
["مجارى مطر وكمر وتدعيمات0.6",60,32000,"مجارى مطر وكمر وتدعيمات",19200,0.6]
["مجارى مطر وكمر وتدعيمات0.65",65,32000,"مجارى مطر وكمر وتدعيمات",20800,0.65]
["مجارى مطر وكمر وتدعيمات0.7",70,32000,"مجارى مطر وكمر وتدعيمات",22400,0.7]
["مجارى مطر وكمر وتدعيمات0.75",75,32000,"مجارى مطر وكمر وتدعيمات",24000,0.75]
["مجارى مطر وكمر وتدعيمات0.8",80,32000,"مجارى مطر وكمر وتدعيمات",25600,0.8]
["مجارى مطر وكمر وتدعيمات0.85",85,32000,"مجارى مطر وكمر وتدعيمات",27200,0.85]
["مجارى مطر وكمر وتدعيمات0.9",90,32000,"مجارى مطر وكمر وتدعيمات",28800,0.9]
["مجارى مطر وكمر وتدعيمات0.95",95,{"$f":"+C21","v":32000},"مجارى مطر وكمر وتدعيمات",30400,0.95]
["مجارى مطر وكمر وتدعيمات1",100,32000,"مجارى مطر وكمر وتدعيمات",32000,1]
["الاقواس والمدادات0.05",5,42000,"الاقواس والمدادات",2100,0.05]
["الاقواس والمدادات0.1",10,{"$f":"+C24","v":42000},"الاقواس والمدادات",4200,0.1]
["الاقواس والمدادات0.15",15,{"$f":"+C25","v":42000},"الاقواس والمدادات",6300,0.15]
["الاقواس والمدادات0.2",20,42000,"الاقواس والمدادات",8400,0.2]
["الاقواس والمدادات0.25",25,42000,"الاقواس والمدادات",10500,0.25]
["الاقواس والمدادات0.3",30,42000,"الاقواس والمدادات",12600,0.3]
["الاقواس والمدادات0.35",35,42000,"الاقواس والمدادات",14699.999999999998,0.35]
{"$rows_left_out":134}
{"sheet":"القائمة","index":1,"n_rows":105,"n_cols":9,"rows_kept":105,"cut":false,"hidden":false,"merged":[]}
["أسماء المقاولين","الكلاستر","الصوبة","العملية",{"$f":"+E2-تفرير!I4","v":2884869.1},"المقاول","المبلغ",null,"العقد"]
["احمد عبد العزيز",1,1,"مجارى مطر وكمر وتدعيمات",{"$f":"SUM(G2:G22)","v":2884875},{"$f":"+A2","v":"احمد عبد العزيز"},{"$f":"SUMIF(الشغل!C4:$J$16000,$F2,الشغل!M5:M6000)","v":246755},null,"1-2023"]
["هانى عبد المنجى احمد",2,2,"الاقواس والمدادات",null,{"$f":"+A3","v":"هانى عبد المنجى احمد"},{"$f":"SUMIF(الشغل!C5:$J$16000,$F3,الشغل!M6:M6001)","v":537965},null,"2-2023"]
["عبد الله عبد النبى",3,3,"البروفيل",null,"عبد الله عبد النبى",{"$f":"SUMIF(الشغل!C6:$J$16000,$F4,الشغل!M7:M6002)","v":196350},null,"3-2023"]
["عبد الرحمن محمد سيد",4,4,"البوابات",null,"عبد الرحمن محمد سيد",{"$f":"SUMIF(الشغل!C7:$J$16000,$F5,الشغل!M8:M6003)","v":206380},null,"4-2023"]
["حسن محمود قطب",5,5,"النهايز",null,"حسن محمود قطب",{"$f":"SUMIF(الشغل!C8:$J$16000,$F6,الشغل!M9:M6004)","v":124950},null,"5-2023"]
["خالد محمد محمد السيد",6,6,"حامل ثمار",null,"خالد محمد محمد السيد",{"$f":"SUMIF(الشغل!C9:$J$16000,$F7,الشغل!M10:M6005)","v":327480}]
["رجب أحمد محمد",7,7,"أعمدة وجرابات",null,"رجب أحمد محمد",{"$f":"SUMIF(الشغل!C10:$J$16000,$F8,الشغل!M11:M6006)","v":89250}]
["رمضان على محمد",8,8,null,null,"رمضان على محمد",{"$f":"SUMIF(الشغل!C11:$J$16000,$F9,الشغل!M12:M6007)","v":274550}]
["صفوت السيد عطية",9,null,null,null,"صفوت السيد عطية",{"$f":"SUMIF(الشغل!C12:$J$16000,$F10,الشغل!M13:M6008)","v":35190}]
["عبد الغفار عادل عبد الغفار",10,null,null,null,"عبد الغفار عادل عبد الغفار",{"$f":"SUMIF(الشغل!C13:$J$16000,$F11,الشغل!M14:M6009)","v":78370}]
["فتحى محمد عبد العزيز",11,null,null,null,"فتحى محمد عبد العزيز",{"$f":"SUMIF(الشغل!C14:$J$16000,$F12,الشغل!M15:M6010)","v":173230}]
["ماجد إبراهيم عبد المجيد",12,null,null,null,"ماجد إبراهيم عبد المجيد",{"$f":"SUMIF(الشغل!C15:$J$16000,$F13,الشغل!M16:M6011)","v":91630}]
["محمد سعداوى أنور",13,null,null,null,"محمد سعداوى أنور",{"$f":"SUMIF(الشغل!C16:$J$16000,$F14,الشغل!M17:M6012)","v":113390}]
["محمد إسماعيل عبد العظيم",14,null,null,null,"محمد إسماعيل عبد العظيم",{"$f":"SUMIF(الشغل!C17:$J$16000,$F15,الشغل!M18:M6013)","v":35190}]
["محمد عبد اللطيف إبراهيم",15,null,null,null,"محمد عبد اللطيف إبراهيم",{"$f":"SUMIF(الشغل!C18:$J$16000,$F16,الشغل!M19:M6014)","v":167790}]
["محمد ناجى إسماعيل",16,null,null,null,"محمد ناجى إسماعيل",{"$f":"SUMIF(الشغل!C19:$J$16000,$F17,الشغل!M20:M6015)","v":90270}]
["ياسين خيرت عبد الله",17,null,null,null,"ياسين خيرت عبد الله",{"$f":"SUMIF(الشغل!C20:$J$16000,$F18,الشغل!M21:M6016)","v":96135}]
[null,18,null,null,null,0,{"$f":"SUMIF(الشغل!C21:$J$16000,$F19,الشغل!M22:M6017)","v":0}]
[null,19,null,null,null,0,{"$f":"SUMIF(الشغل!C22:$J$16000,$F20,الشغل!M23:M6018)","v":0}]
[null,20,null,null,null,0,{"$f":"SUMIF(الشغل!C23:$J$16000,$F21,الشغل!M24:M6019)","v":0}]
[null,21,null,null,null,0,{"$f":"SUMIF(الشغل!C24:$J$16000,$F22,الشغل!M25:M6020)","v":0}]
[null,22,null,null,null,0,{"$f":"SUMIF(الشغل!C25:$J$16000,$F23,الشغل!M26:M6021)","v":0}]
[null,23,null,null,null,0,{"$f":"SUMIF(الشغل!C26:$J$16000,$F24,الشغل!M27:M6022)","v":0}]
[null,24,null,null,null,0,{"$f":"SUMIF(الشغل!C27:$J$16000,$F25,الشغل!M28:M6023)","v":0}]
[null,25,null,null,null,0,{"$f":"SUMIF(الشغل!C28:$J$16000,$F26,الشغل!M29:M6024)","v":0}]
[null,26,null,null,null,0,{"$f":"SUMIF(الشغل!C29:$J$16000,$F27,الشغل!M30:M6025)","v":0}]
[null,27,null,null,null,0,{"$f":"SUMIF(الشغل!C30:$J$16000,$F28,الشغل!M31:M6026)","v":0}]
[null,28,null,null,null,0,{"$f":"SUMIF(الشغل!C31:$J$16000,$F29,الشغل!M32:M6027)","v":0}]
[null,29,null,null,null,0,{"$f":"SUMIF(الشغل!C32:$J$16000,$F30,الشغل!M33:M6028)","v":0}]
{"$rows_left_out":76}
{"sheet":"الشغل","index":2,"n_rows":1111,"n_cols":17,"rows_kept":1111,"cut":false,"hidden":false,"merged":[]}
[null,null,null,null,null,null,null,null,null,null,0.1,0.05]
[null,null,null,null,null,null,null,null,null,{"$f":"SUBTOTAL(9,J5:J1000)","v":3365100},{"$f":"SUBTOTAL(9,K5:K1000)","v":302450},{"$f":"SUBTOTAL(9,L5:L1000)","v":168255},{"$f":"SUBTOTAL(9,M5:M1000)","v":2894395},null,{"$f":"262990-248115","v":14875}]
[null,null,null,null,null,null,null,null,null,null,null,null,null,null,{"$f":"+O2-14875","v":0}]
["اليوم","التاريخ","المقاول","رقم الجارى ","الكلاستر","الصوبة","رقم العقد","العملية","النسبة ","القيمة المستحقة","تامين10%","بيت5%","الصافى "]
[{"$f":"+B5","v":"2023-07-16"},"2023-07-16","احمد عبد العزيز",2,5,3,"37-2023","مجارى مطر وكمر وتدعيمات",0.35,{"$f":"IFERROR(VLOOKUP($H5&I5,'النسب '!$A$2:$E$143,5,0),\"\")","v":11200},{"$f":"IFERROR(IF(J4<>\"\",J5*$K$1,\"\"),\"\")","v":1120},{"$f":"IFERROR(IF(K4<>\"\",J5*$L$1,\"\"),\"\")","v":560},{"$f":"IFERROR(IF(J5<>\"\",J5-K5-L5,\"\"),\"\")","v":9520}]
[{"$f":"+B6","v":"2023-06-21"},"2023-06-21","احمد عبد العزيز",1,5,3,"37-2023","مجارى مطر وكمر وتدعيمات",0.55000000000000004,{"$f":"IFERROR(VLOOKUP($H6&$I6,'النسب '!$A$2:$E$143,5,0),\"\")","v":17600},{"$f":"IFERROR(IF(J5<>\"\",J6*$K$1,\"\"),\"\")","v":1760},{"$f":"IFERROR(IF(K5<>\"\",J6*$L$1,\"\"),\"\")","v":880},{"$f":"IFERROR(IF(J6<>\"\",J6-K6-L6,\"\"),\"\")","v":14960}]
["2023-07-16","2023-07-16","احمد عبد العزيز",2,5,3,"23-2023","الاقواس والمدادات",0.2,{"$f":"IFERROR(VLOOKUP($H7&$I7,'النسب '!$A$2:$E$143,5,0),\"\")","v":8400},{"$f":"IFERROR(IF(J6<>\"\",J7*$K$1,\"\"),\"\")","v":840},{"$f":"IFERROR(IF(K6<>\"\",J7*$L$1,\"\"),\"\")","v":420},{"$f":"IFERROR(IF(J7<>\"\",J7-K7-L7,\"\"),\"\")","v":7140}]
["2023-07-16","2023-07-16","احمد عبد العزيز",1,24,8,"50-2023","أعمدة وجرابات",1,{"$f":"IFERROR(VLOOKUP($H8&$I8,'النسب '!$A$2:$E$143,5,0),\"\")","v":35000},3500,1750,29750]
["2023-07-16","2023-07-16","احمد عبد العزيز",1,24,6,"50-2023","أعمدة وجرابات",0.5,{"$f":"IFERROR(VLOOKUP($H9&$I9,'النسب '!$A$2:$E$143,5,0),\"\")","v":17500},1750,875,14875]
["2023-06-25","2023-06-25","احمد عبد العزيز",2,5,1,"37-2023","أعمدة وجرابات",0.5,{"$f":"IFERROR(VLOOKUP($H10&$I10,'النسب '!$A$2:$E$143,5,0),\"\")","v":17500},1750,875,14875]
["2023-07-16","2023-07-16","احمد عبد العزيز",2,5,1,"37-2023","أعمدة وجرابات",0.5,{"$f":"IFERROR(VLOOKUP($H11&$I11,'النسب '!$A$2:$E$143,5,0),\"\")","v":17500},1750,875,14875]
["2023-07-16","2023-07-16","احمد عبد العزيز",1,5,1,"37-2023","مجارى مطر وكمر وتدعيمات",0.7,{"$f":"IFERROR(VLOOKUP($H12&$I12,'النسب '!$A$2:$E$143,5,0),\"\")","v":22400},2240,1120,19040]
["2023-06-20","2023-06-20","هانى عبد المنجى احمد",3,2,4,"8-2023","الاقواس والمدادات",0.3,{"$f":"IFERROR(VLOOKUP($H13&$I13,'النسب '!$A$2:$E$143,5,0),\"\")","v":12600},1260,630,10710]
["2023-07-17","2023-07-17","عبد الله عبد النبى",2,1,7,"27-2023","أعمدة وجرابات",0.3,{"$f":"IFERROR(VLOOKUP($H14&$I14,'النسب '!$A$2:$E$143,5,0),\"\")","v":10500},1050,525,8925]
["2023-06-21","2023-06-21","عبد الله عبد النبى",1,1,7,"27-2023","أعمدة وجرابات",0.7,{"$f":"IFERROR(VLOOKUP($H15&$I15,'النسب '!$A$2:$E$143,5,0),\"\")","v":24500},2450,1225,20825]
["2023-07-23","2023-07-23","حسن محمود قطب",1,12,7,"42-2023","أعمدة وجرابات",0.9,{"$f":"IFERROR(VLOOKUP($H16&$I16,'النسب '!$A$2:$E$143,5,0),\"\")","v":31500},3150,1575,26775]
["2023-06-21","2023-06-21","عبد الرحمن محمد سيد",1,11,3,"36-2023","مجارى مطر وكمر وتدعيمات",0.8,{"$f":"IFERROR(VLOOKUP($H17&$I17,'النسب '!$A$2:$E$143,5,0),\"\")","v":25600},2560,1280,21760]
["2023-06-21","2023-06-21","احمد عبد العزيز",1,3,2,"29-2023","أعمدة وجرابات",1,{"$f":"IFERROR(VLOOKUP($H18&$I18,'النسب '!$A$2:$E$143,5,0),\"\")","v":35000},3500,1750,29750]
["2023-06-21","2023-06-21","احمد عبد العزيز",1,3,2,"29-2023","مجارى مطر وكمر وتدعيمات",1,{"$f":"IFERROR(VLOOKUP($H19&$I19,'النسب '!$A$2:$E$143,5,0),\"\")","v":32000},3200,1600,27200]
["2023-06-21","2023-06-21","احمد عبد العزيز",1,3,2,"29-2023","الاقواس والمدادات",0.9,{"$f":"IFERROR(VLOOKUP($H20&$I20,'النسب '!$A$2:$E$143,5,0),\"\")","v":37800},3780,1890,32130]
["2023-07-16","2023-07-16","احمد عبد العزيز",2,3,2,"29-2023","حامل ثمار",0.5,{"$f":"IFERROR(VLOOKUP($H21&$I21,'النسب '!$A$2:$E$143,5,0),\"\")","v":5000},500,250,4250]
["2023-06-21","2023-06-21","احمد عبد العزيز",1,5,3,"37-2023","أعمدة وجرابات",1,{"$f":"IFERROR(VLOOKUP($H22&$I22,'النسب '!$A$2:$E$143,5,0),\"\")","v":35000},3500,1750,29750]
["2023-05-31","2023-05-31","هانى عبد المنجى احمد",1,2,4,"8-2023","مجارى مطر وكمر وتدعيمات",1,{"$f":"IFERROR(VLOOKUP($H23&$I23,'النسب '!$A$2:$E$143,5,0),\"\")","v":32000},3200,1600,27200]
["2023-05-31","2023-05-31","هانى عبد المنجى احمد",1,2,1,"9-2023","أعمدة وجرابات",1,{"$f":"IFERROR(VLOOKUP($H24&$I24,'النسب '!$A$2:$E$143,5,0),\"\")","v":35000},3500,1750,29750]
["2023-05-31","2023-05-31","هانى عبد المنجى احمد",1,2,2,"9-2023","أعمدة وجرابات",1,{"$f":"IFERROR(VLOOKUP($H25&$I25,'النسب '!$A$2:$E$143,5,0),\"\")","v":35000},3500,1750,29750]
["2023-05-31","2023-05-31","هانى عبد المنجى احمد",1,2,3,"9-2023","أعمدة وجرابات",1,{"$f":"IFERROR(VLOOKUP($H26&$I26,'النسب '!$A$2:$E$143,5,0),\"\")","v":35000},3500,1750,29750]
["2023-05-31","2023-05-31","هانى عبد المنجى احمد",1,2,4,"9-2023","أعمدة وجرابات",1,{"$f":"IFERROR(VLOOKUP($H27&$I27,'النسب '!$A$2:$E$143,5,0),\"\")","v":35000},3500,1750,29750]
["2023-05-31","2023-05-31","هانى عبد المنجى احمد",1,2,6,"9-2023","أعمدة وجرابات",0.5,{"$f":"IFERROR(VLOOKUP($H28&$I28,'النسب '!$A$2:$E$143,5,0),\"\")","v":17500},1750,875,14875]
["2023-05-31","2023-05-31","هانى عبد المنجى احمد",1,2,7,"13-2023","أعمدة وجرابات",0.5,{"$f":"IFERROR(VLOOKUP($H29&$I29,'النسب '!$A$2:$E$143,5,0),\"\")","v":17500},1750,875,14875]
["2023-06-20","2023-06-20","هانى عبد المنجى احمد",1,1,5,"19-2023","أعمدة وجرابات",1,{"$f":"IFERROR(VLOOKUP($H30&$I30,'النسب '!$A$2:$E$143,5,0),\"\")","v":35000},3500,1750,29750]
{"$rows_left_out":1082}
{"sheet":"تفرير","index":3,"n_rows":79,"n_cols":13,"rows_kept":79,"cut":false,"hidden":false,"merged":[[1,1,1,4],[5,5,5,12]]}
[]
[null,"تقرير النسب والمبلغ خلال العمليات للمقولين",null,null,null,null,null,null,null,null,{"$f":"+K4/J4*100","v":10},{"$f":"+L4/J4*100/100","v":0.05}]
[null,null,null,null,null,null,null,"البيان","النسبة ","القيمة المستحقة","تامين","بيت","الصافى "]
[null,"المقاول","العملية","الكلاستر","الصوبة","رقم العقد",null,"الاجمالى القيمة",{"$f":"SUBTOTAL(9,I10:I5000)","v":5.8999999999999995},{"$f":"SUBTOTAL(9,J10:J5000)","v":203800},20380,10190,173230]
[null,"فتحى محمد عبد العزيز"]
[null,null,null,null,"المبلغ",{"$f":"NoToTxt(M4,\"جنيها\",\"قرش\")","v":"فقط مائة وثلاثة وسبعون ألف ومائتان وثلاثون جنيها"}]
[]
[]
["م","التاريخ","المقاول","رقم الجارى ","الكلاستر","الصوبة","رقم العقد","العملية","النسبة ","القيمة المستحقة","تامين10%","بيت5%","الصافى "]
[{"$f":"IFERROR(IF(B10<>\"\",SUBTOTAL(3,$B$10:B10),\"\"),\"\")","v":1},"2023-06-21","فتحى محمد عبد العزيز",1,3,3,"24-2023","الاقواس والمدادات",0.5,21000,2100,1050,17850]
[{"$f":"IFERROR(IF(B11<>\"\",SUBTOTAL(3,$B$10:B11),\"\"),\"\")","v":2},"2023-06-21","فتحى محمد عبد العزيز",1,3,4,"24-2023","الاقواس والمدادات",0.9,37800,3780,1890,32130]
[{"$f":"IFERROR(IF(B12<>\"\",SUBTOTAL(3,$B$10:B12),\"\"),\"\")","v":3},"2023-07-16","فتحى محمد عبد العزيز",2,3,3,"24-2023","الاقواس والمدادات",0.4,16800,1680,840,14280]
[{"$f":"IFERROR(IF(B13<>\"\",SUBTOTAL(3,$B$10:B13),\"\"),\"\")","v":4},"2023-07-16","فتحى محمد عبد العزيز",2,3,4,"24-2023","حامل ثمار",0.5,5000,500,250,4250]
[{"$f":"IFERROR(IF(B14<>\"\",SUBTOTAL(3,$B$10:B14),\"\"),\"\")","v":5},"2023-06-21","فتحى محمد عبد العزيز",1,3,3,"24-2023","مجارى مطر وكمر وتدعيمات",1,32000,3200,1600,27200]
[{"$f":"IFERROR(IF(B15<>\"\",SUBTOTAL(3,$B$10:B15),\"\"),\"\")","v":6},"2023-06-21","فتحى محمد عبد العزيز",1,3,4,"24-2023","مجارى مطر وكمر وتدعيمات",1,32000,3200,1600,27200]
[{"$f":"IFERROR(IF(B16<>\"\",SUBTOTAL(3,$B$10:B16),\"\"),\"\")","v":7},"2023-07-16","فتحى محمد عبد العزيز",1,12,5,"24-2023","الاقواس والمدادات",0.8,33600,3360,1680,28560]
[{"$f":"IFERROR(IF(B17<>\"\",SUBTOTAL(3,$B$10:B17),\"\"),\"\")","v":8},"2023-07-16","فتحى محمد عبد العزيز",1,12,5,"24-2023","مجارى مطر وكمر وتدعيمات",0.8,25600,2560,1280,21760]
[{"$f":"IFERROR(IF(B18<>\"\",SUBTOTAL(3,$B$10:B18),\"\"),\"\")","v":""}]
[{"$f":"IFERROR(IF(B19<>\"\",SUBTOTAL(3,$B$10:B19),\"\"),\"\")","v":""}]
[{"$f":"IFERROR(IF(B20<>\"\",SUBTOTAL(3,$B$10:B20),\"\"),\"\")","v":""}]
[{"$f":"IFERROR(IF(B21<>\"\",SUBTOTAL(3,$B$10:B21),\"\"),\"\")","v":""}]
[{"$f":"IFERROR(IF(B22<>\"\",SUBTOTAL(3,$B$10:B22),\"\"),\"\")","v":""}]
[{"$f":"IFERROR(IF(B23<>\"\",SUBTOTAL(3,$B$10:B23),\"\"),\"\")","v":""}]
[{"$f":"IFERROR(IF(B24<>\"\",SUBTOTAL(3,$B$10:B24),\"\"),\"\")","v":""}]
[{"$f":"IFERROR(IF(B25<>\"\",SUBTOTAL(3,$B$10:B25),\"\"),\"\")","v":""}]
[{"$f":"IFERROR(IF(B26<>\"\",SUBTOTAL(3,$B$10:B26),\"\"),\"\")","v":""}]
[{"$f":"IFERROR(IF(B27<>\"\",SUBTOTAL(3,$B$10:B27),\"\"),\"\")","v":""}]
[{"$f":"IFERROR(IF(B28<>\"\",SUBTOTAL(3,$B$10:B28),\"\"),\"\")","v":""}]
[{"$f":"IFERROR(IF(B29<>\"\",SUBTOTAL(3,$B$10:B29),\"\"),\"\")","v":""}]
[{"$f":"IFERROR(IF(B30<>\"\",SUBTOTAL(3,$B$10:B30),\"\"),\"\")","v":""}]
{"$rows_left_out":50}
{"sheet":"النسب","index":4,"n_rows":306,"n_cols":35,"rows_kept":306,"cut":false,"hidden":false,"merged":[[47,1,54,1],[55,1,62,1],[63,1,70,1],[298,1,305,1],[234,1,241,1],[242,1,249,1],[250,1,257,1],[258,1,265,1],[266,1,273,1],[274,1,281,1],[282,1,289,1],[290,1,297,1],[226,1,233,1],[138,1,145,1],[146,1,153,1],[154,1,161,1],[162,1,169,1],[170,1,177,1],[218,1,225,1],[87,1,93,1],[94,1,97,1],[98,1,105,1],[202,1,209,1],[210,1,217,1],[130,1,137,1],[2,15,2,17],[2,18,2,20],[194,1,201,1],[39,1,46,1],[4,1,11,1],[12,1,19,1],[20,1,23,1],[24,1,30,1],[31,1,38,1],[106,1,113,1],[114,1,121,1],[122,1,129,1],[178,1,185,1],[186,1,193,1],[71,1,78,1],[79,1,86,1],[2,1,3,1],[2,2,3,2],[2,6,2,8],[2,9,2,11],[2,12,2,14],[2,3,2,5]]}
[null,null,null,null,null,100,null,null,100,null,null,100,null,null,100,null,null,100,null,null,100,null,null,null,null,null,null,null,null,100,100,100,100,100,100]
[]
[null,"رقم الكلاستر","رقم الصوبه","أعمدة وجربات",null,null," مجاري المطر - كمر- تدعيم اكسات- تدعيم كهات",null,null,"البروفيل",null,null,"البوابات",null,null,"النهايز",null,null,"حامل الثمار",null,null,null,null,null,null,null,null,null,null," مجاري المطر - كمر- تدعيم اكسات- تدعيم كهات","الاقواس- المدادات","البروفيل","البوابات","النهايز","حامل الثمار"]
[null,null,null,"نسبة سابقة","نسبة حالية","اجمالى النسبة","نسبة سابقة","نسبة حالية","اجمالى النسبة","نسبة سابقة","نسبة حالية","اجمالى النسبة","نسبة سابقة","نسبة حالية","اجمالى النسبة","نسبة سابقة","نسبة حالية","اجمالى النسبة","نسبة سابقة","نسبة حالية","اجمالى النسبة"]
[{"$f":"+F5/$F$1","v":2E-3},"E1",1,0.1,0.1,{"$f":"+D5+E5","v":0.2},0.5,0.4,{"$f":"+G5+H5","v":0.9},0.6,0.3,{"$f":"+J5+K5","v":0.89999999999999991},null,null,{"$f":"+M5+N5","v":0},null,null,{"$f":"+P5+Q5","v":0},null,null,{"$f":"+S5+T5","v":0},null,null,{"$f":"+V5+W5","v":0},null,null,null,null,null,0.2,0.3,0.4,0.5,0.5,1]
[null,null,2,null,null,{"$f":"+D6+E6","v":0},null,null,0,null,null,0,null,null,0,null,null,0,null,null,0,null,null,0,null,null,null,null,null,0.2,0.3,0.4,0.5,0.6,0.7]
[null,null,3,null,null,0,null,null,0,null,null,0,null,null,0,null,null,0,null,null,0,null,null,0,null,null,null,null,null,0.2,0.3,0.4,0.5,0.6,0.7]
[null,null,4,0.5,0.2,0.7,null,null,0,null,null,0,null,null,0,null,null,0,null,null,0,null,null,0,null,null,null,null,null,0.2,0.3,0.4,0.5,0.6,0.7]
[null,null,5,null,null,0,null,null,0,null,null,0,null,null,0,0.9,null,0.9,0.1,0.3,0.4,null,null,0,null,null,null,null,null,0.2,0.3,0.4,0.5,0.6,0.7]
[null,null,6,null,null,0,null,null,0,null,null,0,null,null,0,0.2,0.8,1,null,0.7,0.7,null,null,0,null,null,null,null,null,0.2,0.3,0.4,0.5,0.6,0.7]
[null,null,7,null,null,0,null,null,0,null,null,0,null,null,0,null,null,0,null,null,0,null,null,0,null,null,null,null,null,0.2,0.3,0.4,0.5,0.6,0.7]
[null,null,8,null,null,0,null,null,0,null,null,0,null,null,0,null,null,0,null,null,0,null,null,0,null,null,null,null,null,0.2,0.3,0.4,0.5,0.6,0.7]
[null,"E2",1,null,null,0,null,null,0,null,null,0,null,null,0,null,null,0,null,null,0,null,null,0,null,null,null,null,null,0.2,0.3,0.4,0.5,0.6,0.7]
[null,null,2,null,null,0,null,null,0,null,null,0,null,null,0,null,null,0,null,null,0,null,null,0,null,null,null,null,null,0.2,0.3,0.4,0.5,0.6,0.7]
[null,null,3,null,null,0,null,null,0,null,null,0,null,null,0,null,null,0,null,null,0,null,null,0,null,null,null,null,null,0.2,0.3,0.4,0.5,0.6,0.7]
[null,null,4,null,null,0,null,null,0,null,null,0,null,null,0,null,null,0,null,null,0,null,null,0,null,null,null,null,null,0.2,0.3,0.4,0.5,0.6,0.7]
[null,null,5,null,null,0,null,null,0,null,null,0,null,null,0,null,null,0,null,null,0,null,null,0,null,null,null,null,null,0.2,0.3,0.4,0.5,0.6,0.7]
[null,null,6,null,null,0,null,null,0,null,null,0,null,null,0,null,null,0,null,null,0,null,null,0,null,null,null,null,null,0.2,0.3,0.4,0.5,0.6,0.7]
[null,null,7,null,null,0,null,null,0,null,null,0,null,null,0,null,null,0,null,null,0,null,null,0,null,null,null,null,null,0.2,0.3,0.4,0.5,0.6,0.7]
[null,null,8,null,null,0,null,null,0,null,null,0,null,null,0,null,null,0,null,null,0,null,null,0,null,null,null,null,null,0.2,0.3,0.4,0.5,0.6,0.7]
[null,"E3",1,null,null,0,null,null,0,null,null,0,null,null,0,null,null,0,null,null,0,null,null,0,null,null,null,null,null,0.2,0.3,0.4,0.5,0.6,0.7]
[null,null,2,null,null,0,null,null,0,null,null,0,null,null,0,null,null,0,null,null,0,null,null,0,null,null,null,null,null,0.2,0.3,0.4,0.5,0.6,0.7]
[null,null,3,null,null,0,null,null,0,null,null,0,null,null,0,null,null,0,null,null,0,null,null,0,null,null,null,null,null,0.2,0.3,0.4,0.5,0.6,0.7]
[null,null,4,null,null,0,null,null,0,null,null,0,null,null,0,null,null,0,null,null,0,null,null,0,null,null,null,null,null,0.2,0.3,0.4,0.5,0.6,0.7]
[null,"E4",1,null,null,0,null,null,0,null,null,0,null,null,0,null,null,0,null,null,0,null,null,0,null,null,null,null,null,0.2,0.3,0.4,0.5,0.6,0.7]
[null,null,2,null,null,0,null,null,0,null,null,0,null,null,0,null,null,0,null,null,0,null,null,0,null,null,null,null,null,0.2,0.3,0.4,0.5,0.6,0.7]
[null,null,3,null,null,0,null,null,0,null,null,0,null,null,0,null,null,0,null,null,0,null,null,0,null,null,null,null,null,0.2,0.3,0.4,0.5,0.6,0.7]
[null,null,4,null,null,0,null,null,0,null,null,0,null,null,0,null,null,0,null,null,0,null,null,0,null,null,null,null,null,0.2,0.3,0.4,0.5,0.6,0.7]
[null,null,5,null,null,0,null,null,0,null,null,0,null,null,0,null,null,0,null,null,0,null,null,0,null,null,null,null,null,0.2,0.3,0.4,0.5,0.6,0.7]
[null,null,6,null,null,0,null,null,0,null,null,0,null,null,0,null,null,0,null,null,0,null,null,0,null,null,null,null,null,0.2,0.3,0.4,0.5,0.6,0.7]
{"$rows_left_out":276}