{"text_format":"1","workbook":"xlsx","n_sheets":7,"sheets":["Month 03-2023","Month 05-2023","Month 06-2023","Month 07-2023","suspended contract hospital","Sheet1","pos"],"not_rendered":{"charts":0,"images":0,"macros":1,"external_links":1,"defined_names":5,"comments":4,"pivot_tables":0},"unopened":[],"bounds":{"document_bytes":16777216,"sheet_cells":100000,"rows_first":2000,"rows_last":500,"rows_between":2000,"halvings":0,"cell_chars":16384,"cell_head_chars":4096},"cells_cut":0,"cells_raw":0,"read":"whole","date_system":"1900"}

{"sheet":"Month 03-2023","index":0,"n_rows":240,"n_cols":50,"rows_kept":240,"cut":false,"hidden":false,"merged":[]}
["Status","Helper","Provider Code",null,"BATCH NO:","Number of claims","AMOUNT","Date Received ","TAT","Date posting","Paid","Rejected","H.H","Pending","Comment","Rev Diff","Pay Diff","Taxes","Checks no.","Amount checks","Checks no.","Amount checks","Checks no.","Amount checks","Checks no.","Amount checks","Checks no.","Amount checks","Checks no.","Amount checks","Checks no.","Amount checks","Checks no.","Amount checks","Checks no.","Amount checks","Checks no.","Amount checks","Checks no.","Amount checks","Checks no.","Amount checks","Checks no.","Amount checks","Checks no.","Amount checks","Checks no.","Amount checks","TAT",{"$f":"CONCATENATE(C1,\"-\",TEXT(H1,\"DD-MM-YYYY\"))","v":"Provider Code-Date Received "}]
[{"$f":"IFERROR(VLOOKUP(C2,#REF!,9,FALSE),\"\")","v":""},{"$f":"C2&COUNTIF($C$2:C2,C2)","v":"FCC05801"},"FCC0580",null,"advance",65,876959,"2023-03-01",{"$f":"+TODAY()-H2","v":156},"2023-04-05",859528.82,1522.439999999935,15907.74,0,0,{"$f":"+G2-K2-L2-M2-N2","v":1.1641532182693481E-10},{"$f":"+G2-R2-T2-V2-X2-Z2-AB2-AD2-AF2-AH2-AJ2-AL2-AN2-AP2-AT2-AV2","v":876959},null,null,null,null,null,null,null,null,null,null,null,null,null,null,null,null,null,null,null,null,null,null,null,null,null,null,null,null,null,null,null,{"$f":"G2-(L2++R2+T2+V2+X2+Z2+AB2+AD2+AF2+AH2+AJ2+AL2+AN2+AP2+AR2)","v":875436.56},{"$f":"CONCATENATE(C2,\"-\",TEXT(H2,\"DD-MM-YYYY\"))","v":"FCC0580-01-03-2023"}]
[{"$f":"IFERROR(VLOOKUP(C3,#REF!,9,FALSE),\"\")","v":""},{"$f":"C3&COUNTIF($C$2:C3,C3)","v":"FCC29801"},"FCC2980",null,null,15,178409.64,"2023-03-01",156,"2023-03-22",177609.62,800.02000000001863,0,0,"New RR",{"$f":"+G3-K3-L3-M3-N3","v":0},{"$f":"+G3-R3-T3-V3-X3-Z3-AB3-AD3-AF3-AH3-AJ3-AL3-AN3-AP3-AT3-AV3","v":178409.64},null,null,null,null,null,null,null,null,null,null,null,null,null,null,null,null,null,null,null,null,null,null,null,null,null,null,null,null,null,null,null,{"$f":"G3-(L3++R3+T3+V3+X3+Z3+AB3+AD3+AF3+AH3+AJ3+AL3+AN3+AP3+AR3)","v":177609.62},{"$f":"CONCATENATE(C3,\"-\",TEXT(H3,\"DD-MM-YYYY\"))","v":"FCC2980-01-03-2023"}]
[{"$f":"IFERROR(VLOOKUP(C4,#REF!,9,FALSE),\"\")","v":""},{"$f":"C4&COUNTIF($C$2:C4,C4)","v":"FCF23101"},"FCF2310",null,null,3,8622.58,"2023-03-01",156,"2023-03-21",8622.58,-1.0000000000218279E-2,0,0,0,0,8622.58,null,null,null,null,null,null,null,null,null,null,null,null,null,null,null,null,null,null,null,null,null,null,null,null,null,null,null,null,null,null,null,8622.59,"FCF2310-01-03-2023"]
[{"$f":"IFERROR(VLOOKUP(C5,#REF!,9,FALSE),\"\")","v":""},{"$f":"C5&COUNTIF($C$2:C5,C5)","v":"FCC91911"},"FCC9191",null,null,3,21779.67,"2023-03-01",156,"2023-03-22",21779.67,-1.0000000002037268E-2,0,0,0,0,21779.67,null,null,null,null,null,null,null,null,null,null,null,null,null,null,null,null,null,null,null,null,null,null,null,null,null,null,null,null,null,null,null,21779.68,"FCC9191-01-03-2023"]
[{"$f":"IFERROR(VLOOKUP(C6,#REF!,9,FALSE),\"\")","v":""},{"$f":"C6&COUNTIF($C$2:C6,C6)","v":"FCE00971"},"FCE0097",null,null,1,1550,"2023-03-01",156,"2023-03-21",1540,10,0,0,0,0,1550,null,null,null,null,null,null,null,null,null,null,null,null,null,null,null,null,null,null,null,null,null,null,null,null,null,null,null,null,null,null,null,1540,"FCE0097-01-03-2023"]
[{"$f":"IFERROR(VLOOKUP(C7,#REF!,9,FALSE),\"\")","v":""},{"$f":"C7&COUNTIF($C$2:C7,C7)","v":"FCC21501"},"FCC2150",null,null,9,83749.45,"2023-03-01",156,"2023-04-13",83035.45,714,0,0,0,0,83749.45,null,null,null,null,null,null,null,null,null,null,null,null,null,null,null,null,null,null,null,null,null,null,null,null,null,null,null,null,null,null,null,83035.45,"FCC2150-01-03-2023"]
[{"$f":"IFERROR(VLOOKUP(C8,#REF!,9,FALSE),\"\")","v":""},{"$f":"C8&COUNTIF($C$2:C8,C8)","v":"FCC25801"},"FCC2580",null,null,2,7687.6,"2023-03-01",156,"2023-03-22",7687.6,0,0,0,0,0,7687.6,null,null,null,null,null,null,null,null,null,null,null,null,null,null,null,null,null,null,null,null,null,null,null,null,null,null,null,null,null,null,null,7687.6,"FCC2580-01-03-2023"]
[{"$f":"IFERROR(VLOOKUP(C9,#REF!,9,FALSE),\"\")","v":""},{"$f":"C9&COUNTIF($C$2:C9,C9)","v":"FCU11301"},"FCU1130",null,null,1,32727.1,"2023-03-01",156,"2023-04-11",32727.1,-2.0000000000436557E-2,0,0,0,2.0000000000436557E-2,32727.1,null,null,null,null,null,null,null,null,null,null,null,null,null,null,null,null,null,null,null,null,null,null,null,null,null,null,null,null,null,null,null,32727.119999999999,"FCU1130-01-03-2023"]
[{"$f":"IFERROR(VLOOKUP(C10,#REF!,9,FALSE),\"\")","v":""},{"$f":"C10&COUNTIF($C$2:C10,C10)","v":"FCR34601"},"FCR3460",null,null,4,28885,"2023-03-01",156,"2023-03-30",28885,0,0,0,0,0,28885,null,null,null,null,null,null,null,null,null,null,null,null,null,null,null,null,null,null,null,null,null,null,null,null,null,null,null,null,null,null,null,28885,"FCR3460-01-03-2023"]
[{"$f":"IFERROR(VLOOKUP(C11,#REF!,9,FALSE),\"\")","v":""},{"$f":"C11&COUNTIF($C$2:C11,C11)","v":"FCC18001"},"FCC1800",null,null,2,132000,"2023-03-01",156,"2023-03-20",132000,-0.19000000000232831,0,0,0,0,132000,null,null,null,null,null,null,null,null,null,null,null,null,null,null,null,null,null,null,null,null,null,null,null,null,null,null,null,null,null,null,null,132000.19,"FCC1800-01-03-2023"]
[{"$f":"IFERROR(VLOOKUP(C12,#REF!,9,FALSE),\"\")","v":""},{"$f":"C12&COUNTIF($C$2:C12,C12)","v":"FCF24701"},"FCF2470",null,null,6,28645.9,"2023-03-02",155,"2023-04-12",28605.7,40.190000000002328,0,0,0,0,28645.9,null,null,null,null,null,null,null,null,null,null,null,null,null,null,null,null,null,null,null,null,null,null,null,null,null,null,null,null,null,null,null,28605.71,"FCF2470-02-03-2023"]
[{"$f":"IFERROR(VLOOKUP(C13,#REF!,9,FALSE),\"\")","v":""},{"$f":"C13&COUNTIF($C$2:C13,C13)","v":"FCC15901"},"FCC1590",null,null,6,30095,"2023-03-05",152,"2023-03-28",30095,0,0,0,0,0,30095,null,null,null,null,null,null,null,null,null,null,null,null,null,null,null,null,null,null,null,null,null,null,null,null,null,null,null,null,null,null,null,30095,"FCC1590-05-03-2023"]
[{"$f":"IFERROR(VLOOKUP(C14,#REF!,9,FALSE),\"\")","v":""},{"$f":"C14&COUNTIF($C$2:C14,C14)","v":"FCC01501"},"FCC0150",null,"advance",18,435964,"2023-03-05",152,"2023-03-20",422282.28,14061.715999999942,0,0,"shared folder",-379.99599999997008,435964,null,null,null,null,null,null,null,null,null,null,null,null,null,null,null,null,null,null,null,null,null,null,null,null,null,null,null,null,null,null,null,421902.28400000004,"FCC0150-05-03-2023"]
[{"$f":"IFERROR(VLOOKUP(C15,#REF!,9,FALSE),\"\")","v":""},{"$f":"C15&COUNTIF($C$2:C15,C15)","v":"FCB26301"},"FCB2630",null,null,7,28867.96,"2023-03-05",152,"2023-03-22",28865.14,2.819999999999709,0,0,0,0,28867.96,null,null,null,null,null,null,null,null,null,null,null,null,null,null,null,null,null,null,null,null,null,null,null,null,null,null,null,null,null,null,null,28865.14,"FCB2630-05-03-2023"]
[{"$f":"IFERROR(VLOOKUP(C16,#REF!,9,FALSE),\"\")","v":""},{"$f":"C16&COUNTIF($C$2:C16,C16)","v":"FCC29701"},"FCC2970",null,null,4,16800,"2023-03-05",152,"2023-04-26",16800,0,0,0,0,0,16800,null,null,null,null,null,null,null,null,null,null,null,null,null,null,null,null,null,null,null,null,null,null,null,null,null,null,null,null,null,null,null,16800,"FCC2970-05-03-2023"]
[{"$f":"IFERROR(VLOOKUP(C17,#REF!,9,FALSE),\"\")","v":""},{"$f":"C17&COUNTIF($C$2:C17,C17)","v":"FCC01101"},"FCC0110",null,"advance",109,2796147.39,"2023-03-05",152,"2023-03-30",2665858.09,38351.399999999827,91937.9,0,"Shared Folder",4.6566128730773926E-10,2796147.39,null,null,null,null,null,null,null,null,null,null,null,null,null,null,null,null,null,null,null,null,null,null,null,null,null,null,null,null,null,null,null,2757795.99,"FCC0110-05-03-2023"]
[{"$f":"IFERROR(VLOOKUP(C18,#REF!,9,FALSE),\"\")","v":""},{"$f":"C18&COUNTIF($C$2:C18,C18)","v":"FCK34201"},"FCK3420",null,"advance",39,266329.71000000002,"2023-03-06",151,"2023-04-11",263175.39,3154.320000000007,0,0,0,0,266329.71000000002,null,null,null,null,null,null,null,null,null,null,null,null,null,null,null,null,null,null,null,null,null,null,null,null,null,null,null,null,null,null,null,263175.39,"FCK3420-06-03-2023"]
[{"$f":"IFERROR(VLOOKUP(C19,#REF!,9,FALSE),\"\")","v":""},{"$f":"C19&COUNTIF($C$2:C19,C19)","v":"FCC04001"},"FCC0400",null,"advance",123,3320144.09,"2023-03-06",151,"2023-03-22",3164802.18,2.2899999996297993,155341.82,0,0,-2.1999999999534339,3320144.09,null,null,null,null,null,null,null,null,null,null,null,null,null,null,null,null,null,null,null,null,null,null,null,null,null,null,null,null,null,null,null,3320141.8000000003,"FCC0400-06-03-2023"]
[{"$f":"IFERROR(VLOOKUP(C20,#REF!,9,FALSE),\"\")","v":""},{"$f":"C20&COUNTIF($C$2:C20,C20)","v":"FCF26101"},"FCF2610",null,null,10,144066.4,"2023-03-06",151,"2023-03-29",143146.03,920.36999999999534,0,0,0,0,144066.4,null,null,null,null,null,null,null,null,null,null,null,null,null,null,null,null,null,null,null,null,null,null,null,null,null,null,null,null,null,null,null,143146.03,"FCF2610-06-03-2023"]
[{"$f":"IFERROR(VLOOKUP(C21,#REF!,9,FALSE),\"\")","v":""},{"$f":"C21&COUNTIF($C$2:C21,C21)","v":"FCZ18101"},"FCZ1810",null,null,20,11474.2,"2023-03-06",151,"2023-03-20",11474.16,4.0000000000873115E-2,0,0,0,0,11474.2,null,null,null,null,null,null,null,null,null,null,null,null,null,null,null,null,null,null,null,null,null,null,null,null,null,null,null,null,null,null,null,11474.16,"FCZ1810-06-03-2023"]
[{"$f":"IFERROR(VLOOKUP(C22,#REF!,9,FALSE),\"\")","v":""},{"$f":"C22&COUNTIF($C$2:C22,C22)","v":"FCX25601"},"FCX2560",null,null,4,38431.51,"2023-03-06",151,"2023-04-12",34797.43,3634.0800000000017,0,0,0,0,38431.51,null,null,null,null,null,null,null,null,null,null,null,null,null,null,null,null,null,null,null,null,null,null,null,null,null,null,null,null,null,null,null,34797.43,"FCX2560-06-03-2023"]
[{"$f":"IFERROR(VLOOKUP(C23,#REF!,9,FALSE),\"\")","v":""},{"$f":"C23&COUNTIF($C$2:C23,C23)","v":"FCD30501"},"FCD3050",null,null,1,21108,"2023-03-06",151,"2023-03-22",21108,-9.9999999983992893E-3,0,0,0,0,21108,null,null,null,null,null,null,null,null,null,null,null,null,null,null,null,null,null,null,null,null,null,null,null,null,null,null,null,null,null,null,null,21108.01,"FCD3050-06-03-2023"]
[{"$f":"IFERROR(VLOOKUP(C24,#REF!,9,FALSE),\"\")","v":""},{"$f":"C24&COUNTIF($C$2:C24,C24)","v":"FCC00901"},"FCC0090",null,"advance",84,3077598.78,"2023-03-06",151,"2023-04-06",2978849.74,13009.47999999969,85739.199999999997,0,"new",0,3077598.78,null,null,null,null,null,null,null,null,null,null,null,null,null,null,null,null,null,null,null,null,null,null,null,null,null,null,null,null,null,null,null,3064589.3000000003,"FCC0090-06-03-2023"]
[{"$f":"IFERROR(VLOOKUP(C25,#REF!,9,FALSE),\"\")","v":""},{"$f":"C25&COUNTIF($C$2:C25,C25)","v":"FCX27961"},"FCX2796",null,null,1,7107.8,"2023-03-06",151,"2023-03-22",6857.7,250.10000000000036,0,0,0,0,7107.8,null,null,null,null,null,null,null,null,null,null,null,null,null,null,null,null,null,null,null,null,null,null,null,null,null,null,null,null,null,null,null,6857.7,"FCX2796-06-03-2023"]
[{"$f":"IFERROR(VLOOKUP(C26,#REF!,9,FALSE),\"\")","v":""},{"$f":"C26&COUNTIF($C$2:C26,C26)","v":"FCN33701"},"FCN3370",null,null,3,35633,"2023-03-06",151,"2023-04-12",33268,2365,0,0,0,0,35633,null,null,null,null,null,null,null,null,null,null,null,null,null,null,null,null,null,null,null,null,null,null,null,null,null,null,null,null,null,null,null,33268,"FCN3370-06-03-2023"]
[{"$f":"IFERROR(VLOOKUP(C27,#REF!,9,FALSE),\"\")","v":""},{"$f":"C27&COUNTIF($C$2:C27,C27)","v":"FCF26141"},"FCF2614",null,null,5,52653.4,"2023-03-06",151,"2023-03-28",52623.92,29.480000000003201,0,0,0,0,52653.4,null,null,null,null,null,null,null,null,null,null,null,null,null,null,null,null,null,null,null,null,null,null,null,null,null,null,null,null,null,null,null,52623.92,"FCF2614-06-03-2023"]
[{"$f":"IFERROR(VLOOKUP(C28,#REF!,9,FALSE),\"\")","v":""},{"$f":"C28&COUNTIF($C$2:C28,C28)","v":"FCC91621"},"FCC9162",null,"advance",17,394994,"2023-03-06",151,"2023-04-03",394789.87,204.13000000000466,0,0,0,0,394994,null,null,null,null,null,null,null,null,null,null,null,null,null,null,null,null,null,null,null,null,null,null,null,null,null,null,null,null,null,null,null,394789.87,"FCC9162-06-03-2023"]
[{"$f":"IFERROR(VLOOKUP(C29,#REF!,9,FALSE),\"\")","v":""},{"$f":"C29&COUNTIF($C$2:C29,C29)","v":"FCS10601"},"FCS1060",null,null,7,22163,"2023-03-07",150,"2023-04-12",22158,5,0,0,0,0,22163,null,null,null,null,null,null,null,null,null,null,null,null,null,null,null,null,null,null,null,null,null,null,null,null,null,null,null,null,null,null,null,22158,"FCS1060-07-03-2023"]
[{"$f":"IFERROR(VLOOKUP(C30,#REF!,9,FALSE),\"\")","v":""},{"$f":"C30&COUNTIF($C$2:C30,C30)","v":"FCC91901"},"FCC9190",null,null,3,10427,"2023-03-07",150,"2023-05-07",10427,0,0,0,0,0,10427,null,null,null,null,null,null,null,null,null,null,null,null,null,null,null,null,null,null,null,null,null,null,null,null,null,null,null,null,null,null,null,10427,"FCC9190-07-03-2023"]
[{"$f":"IFERROR(VLOOKUP(C31,#REF!,9,FALSE),\"\")","v":""},{"$f":"C31&COUNTIF($C$2:C31,C31)","v":"FCC32001"},"FCC3200",null,"advance",7,214889.91,"2023-03-07",150,"2023-03-27",213473.8,10109.49000000002,0,0,"Price differecne",-8693.3800000000047,214889.91,null,null,null,null,null,null,null,null,null,null,null,null,null,null,null,null,null,null,null,null,null,null,null,null,null,null,null,null,null,null,null,204780.41999999998,"FCC3200-07-03-2023"]
[{"$f":"IFERROR(VLOOKUP(C32,#REF!,9,FALSE),\"\")","v":""},{"$f":"C32&COUNTIF($C$2:C32,C32)","v":"FCF06901"},"FCF0690",null,null,9,37692.300000000003,"2023-03-07",150,"2023-05-09",35782.6,1909.6100000000006,0,0,"price differnce",9.0000000003783498E-2,37692.300000000003,null,null,null,null,null,null,null,null,null,null,null,null,null,null,null,null,null,null,null,null,null,null,null,null,null,null,null,null,null,null,null,35782.69,"FCF0690-07-03-2023"]
[{"$f":"IFERROR(VLOOKUP(C33,#REF!,9,FALSE),\"\")","v":""},{"$f":"C33&COUNTIF($C$2:C33,C33)","v":"fce01001"},"fce0100",null,null,5,29881,"2023-03-07",150,"2023-03-22",24505.200000000001,9.9800000000004729,5365.8,0,0,1.9999999998617568E-2,29881,null,null,null,null,null,null,null,null,null,null,null,null,null,null,null,null,null,null,null,null,null,null,null,null,null,null,null,null,null,null,null,29871.02,"fce0100-07-03-2023"]
[{"$f":"IFERROR(VLOOKUP(C34,#REF!,9,FALSE),\"\")","v":""},{"$f":"C34&COUNTIF($C$2:C34,C34)","v":"FCC21801"},"FCC2180",null,"advance",65,1678265.53,"2023-03-07",150,"2023-04-11",1660022.91,8318.5100000001112,9924.11,0,"Shared Folder",0,1678265.53,null,null,null,null,null,null,null,null,null,null,null,null,null,null,null,null,null,null,null,null,null,null,null,null,null,null,null,null,null,null,null,1669947.02,"FCC2180-07-03-2023"]
[{"$f":"IFERROR(VLOOKUP(C35,#REF!,9,FALSE),\"\")","v":""},{"$f":"C35&COUNTIF($C$2:C35,C35)","v":"FCX32201"},"FCX3220",null,null,1,10942.99,"2023-03-07",150,"2023-04-26",10797.42,145.56999999999971,0,0,0,0,10942.99,null,null,null,null,null,null,null,null,null,null,null,null,null,null,null,null,null,null,null,null,null,null,null,null,null,null,null,null,null,null,null,10797.42,"FCX3220-07-03-2023"]
[{"$f":"IFERROR(VLOOKUP(C36,#REF!,9,FALSE),\"\")","v":""},{"$f":"C36&COUNTIF($C$2:C36,C36)","v":"FCC91551"},"FCC9155",null,null,3,103548.35,"2023-03-08",149,"2023-03-26",103548.34,1.0000000009313226E-2,0,0,0,0,103548.35,null,null,null,null,null,null,null,null,null,null,null,null,null,null,null,null,null,null,null,null,null,null,null,null,null,null,null,null,null,null,null,103548.34,"FCC9155-08-03-2023"]
[{"$f":"IFERROR(VLOOKUP(C37,#REF!,9,FALSE),\"\")","v":""},{"$f":"C37&COUNTIF($C$2:C37,C37)","v":"FCX27931"},"FCX2793",null,null,6,32645.33,"2023-03-08",149,"2023-04-05",32645.32,1.0000000002037268E-2,0,0,0,0,32645.33,null,null,null,null,null,null,null,null,null,null,null,null,null,null,null,null,null,null,null,null,null,null,null,null,null,null,null,null,null,null,null,32645.32,"FCX2793-08-03-2023"]
[{"$f":"IFERROR(VLOOKUP(C38,#REF!,9,FALSE),\"\")","v":""},{"$f":"C38&COUNTIF($C$2:C38,C38)","v":"FCU19921"},"FCU1992",null,null,3,20686.98,"2023-03-08",149,"2023-04-18",20686.98,0,0,0,0,0,20686.98,null,null,null,null,null,null,null,null,null,null,null,null,null,null,null,null,null,null,null,null,null,null,null,null,null,null,null,null,null,null,null,20686.98,"FCU1992-08-03-2023"]
[{"$f":"IFERROR(VLOOKUP(C39,#REF!,9,FALSE),\"\")","v":""},{"$f":"C39&COUNTIF($C$2:C39,C39)","v":"FCC06501"},"FCC0650",null,null,4,33809.410000000003,"2023-03-08",149,"2023-03-26",33780.67,28.740000000005239,0,0,"stamp 20 LE only",0,33809.410000000003,null,null,null,null,null,null,null,null,null,null,null,null,null,null,null,null,null,null,null,null,null,null,null,null,null,null,null,null,null,null,null,33780.67,"FCC0650-08-03-2023"]
[{"$f":"IFERROR(VLOOKUP(C40,#REF!,9,FALSE),\"\")","v":""},{"$f":"C40&COUNTIF($C$2:C40,C40)","v":"FCC91641"},"FCC9164",null,null,40,294566.59999999998,"2023-03-08",149,"2023-03-28",270674.90000000002,23891.63999999997,0,0,0,0,294566.59999999998,null,null,null,null,null,null,null,null,null,null,null,null,null,null,null,null,null,null,null,null,null,null,null,null,null,null,null,null,null,null,null,270674.96000000002,"FCC9164-08-03-2023"]
[{"$f":"IFERROR(VLOOKUP(C41,#REF!,9,FALSE),\"\")","v":""},{"$f":"C41&COUNTIF($C$2:C41,C41)","v":"FCP32811"},"FCP3281",null,null,4,33562.199999999997,"2023-03-08",149,"2023-05-08",21082.9,3960.7299999999959,8518.5,0,0,6.9999999999708962E-2,33562.199999999997,null,null,null,null,null,null,null,null,null,null,null,null,null,null,null,null,null,null,null,null,null,null,null,null,null,null,null,null,null,null,null,29601.47,"FCP3281-08-03-2023"]
[{"$f":"IFERROR(VLOOKUP(C42,#REF!,9,FALSE),\"\")","v":""},{"$f":"C42&COUNTIF($C$2:C42,C42)","v":"FCT22301"},"FCT2230",null,null,14,52287.86,"2023-03-08",149,"2023-03-26",51795.839999999997,492.02000000000407,0,0,"new",0,52287.86,null,null,null,null,null,null,null,null,null,null,null,null,null,null,null,null,null,null,null,null,null,null,null,null,null,null,null,null,null,null,null,51795.839999999997,"FCT2230-08-03-2023"]
[{"$f":"IFERROR(VLOOKUP(C43,#REF!,9,FALSE),\"\")","v":""},{"$f":"C43&COUNTIF($C$2:C43,C43)","v":"FCC02301"},"FCC0230",null,null,27,201937.6,"2023-03-08",149,"2023-03-28",200555.8,1.0000000012269084E-2,1381.8,0,"CORRECTED AMOUNT ACCORDING TO PHYSICAL CLAIMS",-9.9999999947613105E-3,201937.6,null,null,null,null,null,null,null,null,null,null,null,null,null,null,null,null,null,null,null,null,null,null,null,null,null,null,null,null,null,null,null,201937.59,"FCC0230-08-03-2023"]
[{"$f":"IFERROR(VLOOKUP(C44,#REF!,9,FALSE),\"\")","v":""},{"$f":"C44&COUNTIF($C$2:C44,C44)","v":"FCC27801"},"FCC2780",null,null,9,27678,"2023-03-08",149,"2023-04-12",27595,83,0,0,0,0,27678,null,null,null,null,null,null,null,null,null,null,null,null,null,null,null,null,null,null,null,null,null,null,null,null,null,null,null,null,null,null,null,27595,"FCC2780-08-03-2023"]
[{"$f":"IFERROR(VLOOKUP(C45,#REF!,9,FALSE),\"\")","v":""},{"$f":"C45&COUNTIF($C$2:C45,C45)","v":"FCS28301"},"FCS2830",null,null,20,128196.45,"2023-03-08",149,"2023-03-30",128196.45,-0.41999999999825377,0,0,0,0,128196.45,null,null,null,null,null,null,null,null,null,null,null,null,null,null,null,null,null,null,null,null,null,null,null,null,null,null,null,null,null,null,null,128196.87,"FCS2830-08-03-2023"]
[{"$f":"IFERROR(VLOOKUP(C46,#REF!,9,FALSE),\"\")","v":""},{"$f":"C46&COUNTIF($C$2:C46,C46)","v":"FCC33101"},"FCC3310",null,null,4,19564.259999999998,"2023-03-08",149,"2023-03-22",19543.900000000001,20.309999999997672,0,0,"corrected amount as physical claims ",0,19564.259999999998,null,null,null,null,null,null,null,null,null,null,null,null,null,null,null,null,null,null,null,null,null,null,null,null,null,null,null,null,null,null,null,19543.95,"FCC3310-08-03-2023"]
[{"$f":"IFERROR(VLOOKUP(C47,#REF!,9,FALSE),\"\")","v":""},{"$f":"C47&COUNTIF($C$2:C47,C47)","v":"FCX26901"},"FCX2690",null,null,14,264172.42,"2023-03-08",149,"2023-04-27",253556.95,10407.489999999976,208,0,0,0,264172.42,null,null,null,null,null,null,null,null,null,null,null,null,null,null,null,null,null,null,null,null,null,null,null,null,null,null,null,null,null,null,null,253764.93,"FCX2690-08-03-2023"]
[{"$f":"IFERROR(VLOOKUP(C48,#REF!,9,FALSE),\"\")","v":""},{"$f":"C48&COUNTIF($C$2:C48,C48)","v":"FCX27401"},"FCX2740",null,"advance",63,1177202.19,"2023-03-08",149,"2023-03-30",1166221.68,1.629999999931897,10980.51,0,0,0,1177202.19,null,null,null,null,null,null,null,null,null,null,null,null,null,null,null,null,null,null,null,null,null,null,null,null,null,null,null,null,null,null,null,1177200.56,"FCX2740-08-03-2023"]
[{"$f":"IFERROR(VLOOKUP(C49,#REF!,9,FALSE),\"\")","v":""},{"$f":"C49&COUNTIF($C$2:C49,C49)","v":"FCX12901"},"FCX1290",null,"advance",94,1537153.6,"2023-03-08",149,"2023-03-22",1462238.65,74914.950000000186,0,0,0,0,1537153.6,null,null,null,null,null,null,null,null,null,null,null,null,null,null,null,null,null,null,null,null,null,null,null,null,null,null,null,null,null,null,null,1462238.65,"FCX1290-08-03-2023"]
[{"$f":"IFERROR(VLOOKUP(C50,#REF!,9,FALSE),\"\")","v":""},{"$f":"C50&COUNTIF($C$2:C50,C50)","v":"FCC28801"},"FCC2880",null,null,27,392890.46,"2023-03-09",148,"2023-03-27",390370.46,-5.5499999999647116,2520,0,0,0,392890.46,null,null,null,null,null,null,null,null,null,null,null,null,null,null,null,null,null,null,null,null,null,null,null,null,null,null,null,null,null,null,null,392896.01,"FCC2880-09-03-2023"]
[{"$f":"IFERROR(VLOOKUP(C51,#REF!,9,FALSE),\"\")","v":""},{"$f":"C51&COUNTIF($C$2:C51,C51)","v":"FCC91931"},"FCC9193",null,null,4,307186.3,"2023-03-09",148,"2023-03-28",298534.55,3776.7499999999891,4875,0,0,1.0913936421275139E-11,307186.3,null,null,null,null,null,null,null,null,null,null,null,null,null,null,null,null,null,null,null,null,null,null,null,null,null,null,null,null,null,null,null,303409.55,"FCC9193-09-03-2023"]
[{"$f":"IFERROR(VLOOKUP(C52,#REF!,9,FALSE),\"\")","v":""},{"$f":"C52&COUNTIF($C$2:C52,C52)","v":"FCX27981"},"FCX2798",null,null,8,227896.78,"2023-03-09",148,"2023-04-13",218554.18,9342.6000000000058,0,0,"Discount diff in G0290 / Price Difference",0,227896.78,null,null,null,null,null,null,null,null,null,null,null,null,null,null,null,null,null,null,null,null,null,null,null,null,null,null,null,null,null,null,null,218554.18,"FCX2798-09-03-2023"]
[{"$f":"IFERROR(VLOOKUP(C53,#REF!,9,FALSE),\"\")","v":""},{"$f":"C53&COUNTIF($C$2:C53,C53)","v":"FCC27301"},"FCC2730",null,"advance",15,139281,"2023-03-09",148,"2023-03-28",138617.4,5.7980287238024175E-12,663.6,0,0,0,139281,null,null,null,null,null,null,null,null,null,null,null,null,null,null,null,null,null,null,null,null,null,null,null,null,null,null,null,null,null,null,null,139281,"FCC2730-09-03-2023"]
[{"$f":"IFERROR(VLOOKUP(C54,#REF!,9,FALSE),\"\")","v":""},{"$f":"C54&COUNTIF($C$2:C54,C54)","v":"FCX18301"},"FCX1830",null,null,8,104871.39,"2023-03-09",148,"2023-03-27",104871.39,-9.9999999947613105E-3,0,0,0,0,104871.39,null,null,null,null,null,null,null,null,null,null,null,null,null,null,null,null,null,null,null,null,null,null,null,null,null,null,null,null,null,null,null,104871.4,"FCX1830-09-03-2023"]
[{"$f":"IFERROR(VLOOKUP(C55,#REF!,9,FALSE),\"\")","v":""},{"$f":"C55&COUNTIF($C$2:C55,C55)","v":"FCC91981"},"FCC9198",null,"advance",10,530263.73,"2023-03-09",148,"2023-03-30",295748.86,12792.139999999985,221722.73,0,"Price diff & Discount diff in second accomdation and packages ",0,530263.73,null,null,null,null,null,null,null,null,null,null,null,null,null,null,null,null,null,null,null,null,null,null,null,null,null,null,null,null,null,null,null,517471.58999999997,"FCC9198-09-03-2023"]
[{"$f":"IFERROR(VLOOKUP(C56,#REF!,9,FALSE),\"\")","v":""},{"$f":"C56&COUNTIF($C$2:C56,C56)","v":"FCC35101"},"FCC3510",null,null,1,1686.75,"2023-03-09",148,"2023-03-30",1686.75,0,0,0,0,0,1686.75,null,null,null,null,null,null,null,null,null,null,null,null,null,null,null,null,null,null,null,null,null,null,null,null,null,null,null,null,null,null,null,1686.75,"FCC3510-09-03-2023"]
[{"$f":"IFERROR(VLOOKUP(C57,#REF!,9,FALSE),\"\")","v":""},{"$f":"C57&COUNTIF($C$2:C57,C57)","v":"FCC00801"},"FCC0080",null,null,18,81784.39,"2023-03-09",148,"2023-03-28",78014.100000000006,120.24999999999363,3650.04,0,0,0,81784.39,null,null,null,null,null,null,null,null,null,null,null,null,null,null,null,null,null,null,null,null,null,null,null,null,null,null,null,null,null,null,null,81664.14,"FCC0080-09-03-2023"]
[{"$f":"IFERROR(VLOOKUP(C58,#REF!,9,FALSE),\"\")","v":""},{"$f":"C58&COUNTIF($C$2:C58,C58)","v":"FCC03001"},"FCC0300",null,"advance",194,6349718.79,"2023-03-09",148,"2023-04-09",6223180,43936.230854999929,82602.31,0,0,0.2491450001107296,6349718.79,null,null,null,null,null,null,null,null,null,null,null,null,null,null,null,null,null,null,null,null,null,null,null,null,null,null,null,null,null,null,null,6305782.5591449998,"FCC0300-09-03-2023"]
[{"$f":"IFERROR(VLOOKUP(C59,#REF!,9,FALSE),\"\")","v":""},{"$f":"C59&COUNTIF($C$2:C59,C59)","v":"FCC21301"},"FCC2130",null,null,9,45202.1,"2023-03-09",148,"2023-04-04",42808.34,2393.760000000002,0,0,"classification difference in claim 9 + no discount applied",0,45202.1,null,null,null,null,null,null,null,null,null,null,null,null,null,null,null,null,null,null,null,null,null,null,null,null,null,null,null,null,null,null,null,42808.34,"FCC2130-09-03-2023"]
[{"$f":"IFERROR(VLOOKUP(C60,#REF!,9,FALSE),\"\")","v":""},{"$f":"C60&COUNTIF($C$2:C60,C60)","v":"FCS23401"},"FCS2340",null,null,13,71561,"2023-03-09",148,"2023-03-22",66941,4620,0,0,0,0,71561,null,null,null,null,null,null,null,null,null,null,null,null,null,null,null,null,null,null,null,null,null,null,null,null,null,null,null,null,null,null,null,66941,"FCS2340-09-03-2023"]
[{"$f":"IFERROR(VLOOKUP(C61,#REF!,9,FALSE),\"\")","v":""},{"$f":"C61&COUNTIF($C$2:C61,C61)","v":"FCC17101"},"FCC1710",null,"advance",8,57433,"2023-03-09",148,"2023-03-27",56673.38,759.62000000000262,0,0,"Price differecne",0,57433,null,null,null,null,null,null,null,null,null,null,null,null,null,null,null,null,null,null,null,null,null,null,null,null,null,null,null,null,null,null,null,56673.38,"FCC1710-09-03-2023"]
[{"$f":"IFERROR(VLOOKUP(C62,#REF!,9,FALSE),\"\")","v":""},{"$f":"C62&COUNTIF($C$2:C62,C62)","v":"FCC18301"},"FCC1830",null,null,1,1200,"2023-03-09",148,"2023-03-28",1000,200,0,0,0,0,1200,null,null,null,null,null,null,null,null,null,null,null,null,null,null,null,null,null,null,null,null,null,null,null,null,null,null,null,null,null,null,null,1000,"FCC1830-09-03-2023"]
[{"$f":"IFERROR(VLOOKUP(C63,#REF!,9,FALSE),\"\")","v":""},{"$f":"C63&COUNTIF($C$2:C63,C63)","v":"FCC26601"},"FCC2660",null,null,16,53685,"2023-03-09",148,"2023-03-22",53359.97,325.02999999999884,0,0,0,0,53685,null,null,null,null,null,null,null,null,null,null,null,null,null,null,null,null,null,null,null,null,null,null,null,null,null,null,null,null,null,null,null,53359.97,"FCC2660-09-03-2023"]
[{"$f":"IFERROR(VLOOKUP(C64,#REF!,9,FALSE),\"\")","v":""},{"$f":"C64&COUNTIF($C$2:C64,C64)","v":"FCC30401"},"FCC3040",null,"advance",26,302636.90000000002,"2023-03-09",148,"2023-03-13",292873,9763.7503000000324,0,0,0,0,302636.90000000002,null,null,null,null,null,null,null,null,null,null,null,null,null,null,null,null,null,null,null,null,null,null,null,null,null,null,null,null,null,null,null,292873.14970000001,"FCC3040-09-03-2023"]
[{"$f":"IFERROR(VLOOKUP(C65,#REF!,9,FALSE),\"\")","v":""},{"$f":"C65&COUNTIF($C$2:C65,C65)","v":"FCB28001"},"FCB2800",null,null,3,36500,"2023-03-12",145,"2023-04-30",36203.5,296.40000000000146,0,0,0,0,36500,null,null,null,null,null,null,null,null,null,null,null,null,null,null,null,null,null,null,null,null,null,null,null,null,null,null,null,null,null,null,null,36203.599999999999,"FCB2800-12-03-2023"]
[{"$f":"IFERROR(VLOOKUP(C66,#REF!,9,FALSE),\"\")","v":""},{"$f":"C66&COUNTIF($C$2:C66,C66)","v":"FCC91851"},"FCC9185",null,null,8,300445.39,"2023-03-12",{"$f":"+TODAY()-H66","v":145},"2023-03-22",300325.37,120.02000000001863,0,0,"Discount diff in 99253 (New)",0,300445.39,null,null,null,null,null,null,null,null,null,null,null,null,null,null,null,null,null,null,null,null,null,null,null,null,null,null,null,null,null,null,null,300325.37,"FCC9185-12-03-2023"]
[{"$f":"IFERROR(VLOOKUP(C67,#REF!,9,FALSE),\"\")","v":""},{"$f":"C67&COUNTIF($C$2:C67,C67)","v":"FCC28701"},"FCC2870",null,null,1,7362.45,"2023-03-12",145,"2023-05-01",7362.37,7.999999999992724E-2,0,0,0,{"$f":"+G67-K67-L67-M67-N67","v":0},{"$f":"+G67-R67-T67-V67-X67-Z67-AB67-AD67-AF67-AH67-AJ67-AL67-AN67-AP67-AT67-AV67","v":7362.45},null,null,null,null,null,null,null,null,null,null,null,null,null,null,null,null,null,null,null,null,null,null,null,null,null,null,null,null,null,null,null,{"$f":"G67-(L67++R67+T67+V67+X67+Z67+AB67+AD67+AF67+AH67+AJ67+AL67+AN67+AP67+AR67)","v":7362.37},{"$f":"CONCATENATE(C67,\"-\",TEXT(H67,\"DD-MM-YYYY\"))","v":"FCC2870-12-03-2023"}]
[{"$f":"IFERROR(VLOOKUP(C68,#REF!,9,FALSE),\"\")","v":""},{"$f":"C68&COUNTIF($C$2:C68,C68)","v":"FCC91561"},"FCC9156",null,"advance",18,313676.69,"2023-03-12",145,"2023-03-29",203364.02,9976.7786255669671,93723.12,0,0,6612.771374433054,313676.69,null,null,null,null,null,null,null,null,null,null,null,null,null,null,null,null,null,null,null,null,null,null,null,null,null,null,null,null,null,null,null,303699.91137443302,"FCC9156-12-03-2023"]
[{"$f":"IFERROR(VLOOKUP(C69,#REF!,9,FALSE),\"\")","v":""},{"$f":"C69&COUNTIF($C$2:C69,C69)","v":"FCM27601"},"FCM2760",null,null,11,101927.21,"2023-03-12",145,"2023-03-29",101323.1,604.09000000000742,0,0,0,0,101927.21,null,null,null,null,null,null,null,null,null,null,null,null,null,null,null,null,null,null,null,null,null,null,null,null,null,null,null,null,null,null,null,101323.12,"FCM2760-12-03-2023"]
[{"$f":"IFERROR(VLOOKUP(C70,#REF!,9,FALSE),\"\")","v":""},{"$f":"C70&COUNTIF($C$2:C70,C70)","v":"FCC91841"},"FCC9184",null,null,2,55518.75,"2023-03-12",145,"2023-03-27",51743.67,3775.0800000000017,0,0,0,0,55518.75,null,null,null,null,null,null,null,null,null,null,null,null,null,null,null,null,null,null,null,null,null,null,null,null,null,null,null,null,null,null,null,51743.67,"FCC9184-12-03-2023"]
[{"$f":"IFERROR(VLOOKUP(C71,#REF!,9,FALSE),\"\")","v":""},{"$f":"C71&COUNTIF($C$2:C71,C71)","v":"FCC31201"},"FCC3120",null,null,65,1608148.6,"2023-03-12",145,"2023-04-13",1421237.5,3040.5200000000477,186784.33,0,"10% Discount Difference in Physiotherapy claim 60",-2913.7499999999418,1608148.6,null,null,null,null,null,null,null,null,null,null,null,null,null,null,null,null,null,null,null,null,null,null,null,null,null,null,null,null,null,null,null,1605108.08,"FCC3120-12-03-2023"]
[{"$f":"IFERROR(VLOOKUP(C72,#REF!,9,FALSE),\"\")","v":""},{"$f":"C72&COUNTIF($C$2:C72,C72)","v":"FCC91801"},"FCC9180",null,null,15,167078.29,"2023-03-12",145,"2023-04-12",165662.26999999999,1416.0200000000186,0,0,"Discount diff in 99253(S.F)",0,167078.29,null,null,null,null,null,null,null,null,null,null,null,null,null,null,null,null,null,null,null,null,null,null,null,null,null,null,null,null,null,null,null,165662.26999999999,"FCC9180-12-03-2023"]
[{"$f":"IFERROR(VLOOKUP(C73,#REF!,9,FALSE),\"\")","v":""},{"$f":"C73&COUNTIF($C$2:C73,C73)","v":"FCI22101"},"FCI2210",null,null,2,5611,"2023-03-12",145,"2023-03-27",5611,0,0,0,0,0,5611,null,null,null,null,null,null,null,null,null,null,null,null,null,null,null,null,null,null,null,null,null,null,null,null,null,null,null,null,null,null,null,5611,"FCI2210-12-03-2023"]
[{"$f":"IFERROR(VLOOKUP(C74,#REF!,9,FALSE),\"\")","v":""},{"$f":"C74&COUNTIF($C$2:C74,C74)","v":"FCC14101"},"FCC1410",null,"advance",20,312010.40999999997,"2023-03-12",145,"2023-04-13",310546.14,27826.318719999916,0,0,0,-26362.048719999955,312010.40999999997,null,null,null,null,null,null,null,null,null,null,null,null,null,null,null,null,null,null,null,null,null,null,null,null,null,null,null,null,null,null,null,284184.09128000005,"FCC1410-12-03-2023"]
[{"$f":"IFERROR(VLOOKUP(C75,#REF!,9,FALSE),\"\")","v":""},{"$f":"C75&COUNTIF($C$2:C75,C75)","v":"FCC15801"},"FCC1580",null,"advance",119,2638539.63,"2023-03-12",145,"2023-04-13",2444586.06,11582.459999999846,182371.11,0,0,0,2638539.63,null,null,null,null,null,null,null,null,null,null,null,null,null,null,null,null,null,null,null,null,null,null,null,null,null,null,null,null,null,null,null,2626957.17,"FCC1580-12-03-2023"]
[{"$f":"IFERROR(VLOOKUP(C76,#REF!,9,FALSE),\"\")","v":""},{"$f":"C76&COUNTIF($C$2:C76,C76)","v":"FCX18401"},"FCX1840",null,"advance",50,576049.24,"2023-03-12",145,"2023-04-13",570359.56999999995,5689.6700000000419,0,0,0,0,576049.24,null,null,null,null,null,null,null,null,null,null,null,null,null,null,null,null,null,null,null,null,null,null,null,null,null,null,null,null,null,null,null,570359.56999999995,"FCX1840-12-03-2023"]
[{"$f":"IFERROR(VLOOKUP(C77,#REF!,9,FALSE),\"\")","v":""},{"$f":"C77&COUNTIF($C$2:C77,C77)","v":"FCC03401"},"FCC0340",null,null,3,24239.83,"2023-03-12",145,"2023-03-27",23942.82,297,0,0,0,0,24239.83,null,null,null,null,null,null,null,null,null,null,null,null,null,null,null,null,null,null,null,null,null,null,null,null,null,null,null,null,null,null,null,23942.83,"FCC0340-12-03-2023"]
[{"$f":"IFERROR(VLOOKUP(C78,#REF!,9,FALSE),\"\")","v":""},{"$f":"C78&COUNTIF($C$2:C78,C78)","v":"FCS10301"},"FCS1030",null,"advance",82,1085250.6499999999,"2023-03-12",145,"2023-04-13",1061096,11552.924399999896,12599,0,0,2.7256000000106724,1085250.6499999999,null,null,null,null,null,null,null,null,null,null,null,null,null,null,null,null,null,null,null,null,null,null,null,null,null,null,null,null,null,null,null,1073697.7256,"FCS1030-12-03-2023"]
[{"$f":"IFERROR(VLOOKUP(C79,#REF!,9,FALSE),\"\")","v":""},{"$f":"C79&COUNTIF($C$2:C79,C79)","v":"FCC04801"},"FCC0480",null,null,15,79873,"2023-03-12",145,"2023-04-06",76133,3740,0,0,0,0,79873,null,null,null,null,null,null,null,null,null,null,null,null,null,null,null,null,null,null,null,null,null,null,null,null,null,null,null,null,null,null,null,76133,"FCC0480-12-03-2023"]
[{"$f":"IFERROR(VLOOKUP(C80,#REF!,9,FALSE),\"\")","v":""},{"$f":"C80&COUNTIF($C$2:C80,C80)","v":"FCF23102"},"FCF2310",null,null,5,57454.06,"2023-03-12",145,"2023-03-13",57354,99.979999999995925,0,0,0,0,57454.06,null,null,null,null,null,null,null,null,null,null,null,null,null,null,null,null,null,null,null,null,null,null,null,null,null,null,null,null,null,null,null,57354.080000000002,"FCF2310-12-03-2023"]
[{"$f":"IFERROR(VLOOKUP(C81,#REF!,9,FALSE),\"\")","v":""},{"$f":"C81&COUNTIF($C$2:C81,C81)","v":"FCN31421"},"FCN3142",null,null,12,93112.05,"2023-03-13",144,"2023-03-28",91323.9,1788.0999999999913,0,0,0,0,93112.05,null,null,null,null,null,null,null,null,null,null,null,null,null,null,null,null,null,null,null,null,null,null,null,null,null,null,null,null,null,null,null,91323.950000000012,"FCN3142-13-03-2023"]
[{"$f":"IFERROR(VLOOKUP(C82,#REF!,9,FALSE),\"\")","v":""},{"$f":"C82&COUNTIF($C$2:C82,C82)","v":"FCX16101"},"FCX1610",null,null,8,115398.5,"2023-03-13",144,"2023-04-27",115398.49,9.9999999947613105E-3,0,0,0,0,115398.5,null,null,null,null,null,null,null,null,null,null,null,null,null,null,null,null,null,null,null,null,null,null,null,null,null,null,null,null,null,null,null,115398.49,"FCX1610-13-03-2023"]
[{"$f":"IFERROR(VLOOKUP(C83,#REF!,9,FALSE),\"\")","v":""},{"$f":"C83&COUNTIF($C$2:C83,C83)","v":"FCX26701"},"FCX2670",null,null,4,17500,"2023-03-13",144,"2023-03-29",17500,0,0,0,0,0,17500,null,null,null,null,null,null,null,null,null,null,null,null,null,null,null,null,null,null,null,null,null,null,null,null,null,null,null,null,null,null,null,17500,"FCX2670-13-03-2023"]
[{"$f":"IFERROR(VLOOKUP(C84,#REF!,9,FALSE),\"\")","v":""},{"$f":"C84&COUNTIF($C$2:C84,C84)","v":"FCH07101"},"FCH0710",null,null,1,4649.88,"2023-03-13",144,"2023-03-29",4552.57,97.3100000000004,0,0,0,0,4649.88,null,null,null,null,null,null,null,null,null,null,null,null,null,null,null,null,null,null,null,null,null,null,null,null,null,null,null,null,null,null,null,4552.57,"FCH0710-13-03-2023"]
[{"$f":"IFERROR(VLOOKUP(C85,#REF!,9,FALSE),\"\")","v":""},{"$f":"C85&COUNTIF($C$2:C85,C85)","v":"FCC31101"},"FCC3110",null,"advance+VD",4,41700,"2023-03-13",144,"2023-03-29",39300,2400,0,0,0,0,41700,null,null,null,null,null,null,null,null,null,null,null,null,null,null,null,null,null,null,null,null,null,null,null,null,null,null,null,null,null,null,null,39300,"FCC3110-13-03-2023"]
[{"$f":"IFERROR(VLOOKUP(C86,#REF!,9,FALSE),\"\")","v":""},{"$f":"C86&COUNTIF($C$2:C86,C86)","v":"FCC91451"},"FCC9145",null,null,1,4504,"2023-03-13",144,"2023-03-29",4404.4799999999996,99.520000000000437,0,0,0,0,4504,null,null,null,null,null,null,null,null,null,null,null,null,null,null,null,null,null,null,null,null,null,null,null,null,null,null,null,null,null,null,null,4404.4799999999996,"FCC9145-13-03-2023"]
[{"$f":"IFERROR(VLOOKUP(C87,#REF!,9,FALSE),\"\")","v":""},{"$f":"C87&COUNTIF($C$2:C87,C87)","v":"FCC26201"},"FCC2620",null,"advance",46,487137,"2023-03-13",144,"2023-03-28",464796.05,16739.510000000013,5601.44,0,"updated requested amount as per physical claim (please check ur email sent 28/3)",-9.0949470177292824E-13,487137,null,null,null,null,null,null,null,null,null,null,null,null,null,null,null,null,null,null,null,null,null,null,null,null,null,null,null,null,null,null,null,470397.49,"FCC2620-13-03-2023"]
[{"$f":"IFERROR(VLOOKUP(C88,#REF!,9,FALSE),\"\")","v":""},{"$f":"C88&COUNTIF($C$2:C88,C88)","v":"FCC91681"},"FCC9168",null,null,2,12709.4,"2023-03-13",144,"2023-03-29",12709.35,4.9999999999272404E-2,0,0,0,0,12709.4,null,null,null,null,null,null,null,null,null,null,null,null,null,null,null,null,null,null,null,null,null,null,null,null,null,null,null,null,null,null,null,12709.35,"FCC9168-13-03-2023"]
[{"$f":"IFERROR(VLOOKUP(C89,#REF!,9,FALSE),\"\")","v":""},{"$f":"C89&COUNTIF($C$2:C89,C89)","v":"FCC26501"},"FCC2650",null,null,4,257733.5,"2023-03-13",144,"2023-04-06",161370.74,20.000000000014552,96342.76,0,0,0,257733.5,null,null,null,null,null,null,null,null,null,null,null,null,null,null,null,null,null,null,null,null,null,null,null,null,null,null,null,null,null,null,null,257713.5,"FCC2650-13-03-2023"]
[{"$f":"IFERROR(VLOOKUP(C90,#REF!,9,FALSE),\"\")","v":""},{"$f":"C90&COUNTIF($C$2:C90,C90)","v":"FCC06401"},"FCC0640",null,null,4,27337.03,"2023-03-14",143,"2023-03-27",26687,649.66999999999825,0,0,0,0,27337.03,null,null,null,null,null,null,null,null,null,null,null,null,null,null,null,null,null,null,null,null,null,null,null,null,null,null,null,null,null,null,null,26687.360000000001,"FCC0640-14-03-2023"]
[{"$f":"IFERROR(VLOOKUP(C91,#REF!,9,FALSE),\"\")","v":""},{"$f":"C91&COUNTIF($C$2:C91,C91)","v":"FCC02001"},"FCC0200",null,"advance",17,121779,"2023-03-14",143,"2023-04-10",121013,559.8760000000002,205.67,0,0,0,121779,null,null,null,null,null,null,null,null,null,null,null,null,null,null,null,null,null,null,null,null,null,null,null,null,null,null,null,null,null,null,null,121219.124,"FCC0200-14-03-2023"]
[{"$f":"IFERROR(VLOOKUP(C92,#REF!,9,FALSE),\"\")","v":""},{"$f":"C92&COUNTIF($C$2:C92,C92)","v":"FCV11711"},"FCV1171",null,null,1,7243.65,"2023-03-14",143,"2023-03-29",7243.65,0,0,0,0,0,7243.65,null,null,null,null,null,null,null,null,null,null,null,null,null,null,null,null,null,null,null,null,null,null,null,null,null,null,null,null,null,null,null,7243.65,"FCV1171-14-03-2023"]
[{"$f":"IFERROR(VLOOKUP(C93,#REF!,9,FALSE),\"\")","v":""},{"$f":"C93&COUNTIF($C$2:C93,C93)","v":"FCC01301"},"FCC0130",null,"advance",35,795004.37,"2023-03-14",143,"2023-04-09",791666,3338.6099999999569,0,0,0,0,795004.37,null,null,null,null,null,null,null,null,null,null,null,null,null,null,null,null,null,null,null,null,null,null,null,null,null,null,null,null,null,null,null,791665.76,"FCC0130-14-03-2023"]
[{"$f":"IFERROR(VLOOKUP(C94,#REF!,9,FALSE),\"\")","v":""},{"$f":"C94&COUNTIF($C$2:C94,C94)","v":"FCS10501"},"FCS1050",null,null,3,14159,"2023-03-14",143,"2023-03-29",13978.92,180.07999999999993,0,0,0,0,14159,null,null,null,null,null,null,null,null,null,null,null,null,null,null,null,null,null,null,null,null,null,null,null,null,null,null,null,null,null,null,null,13978.92,"FCS1050-14-03-2023"]
[{"$f":"IFERROR(VLOOKUP(C95,#REF!,9,FALSE),\"\")","v":""},{"$f":"C95&COUNTIF($C$2:C95,C95)","v":"FCS22701"},"FCS2270",null,null,2,8588.1,"2023-03-14",143,"2023-03-29",8588.1,0,0,0,"CORRECTED AMOUNT AS PHYISICAL CLAIMS",0,8588.1,null,null,null,null,null,null,null,null,null,null,null,null,null,null,null,null,null,null,null,null,null,null,null,null,null,null,null,null,null,null,null,8588.1,"FCS2270-14-03-2023"]
[{"$f":"IFERROR(VLOOKUP(C96,#REF!,9,FALSE),\"\")","v":""},{"$f":"C96&COUNTIF($C$2:C96,C96)","v":"FCC02801"},"FCC0280",null,"advance",53,2343031.67,"2023-03-14",143,"2023-05-03",1929183.94,14161.619999999995,399686.11,0,"Price diff,Discount diff in 420,400",0,{"$f":"+G96-R96-T96-V96-X96-Z96-AB96-AD96-AF96-AH96-AJ96-AL96-AN96-AP96-AT96-AV96","v":2343031.67},null,null,null,null,null,null,null,null,null,null,null,null,null,null,null,null,null,null,null,null,null,null,null,null,null,null,null,null,null,null,null,2328870.0499999998,"FCC0280-14-03-2023"]
[{"$f":"IFERROR(VLOOKUP(C97,#REF!,9,FALSE),\"\")","v":""},{"$f":"C97&COUNTIF($C$2:C97,C97)","v":"FCC91671"},"FCC9167",null,"advance",81,1804854.18,"2023-03-14",143,"2023-04-12",1666640.2,74734.807419999852,64054.57,0,"Price Difference , Classification diff & Discount diff in 99291,400,420",-575.39741999987018,1804854.18,null,null,null,null,null,null,null,null,null,null,null,null,null,null,null,null,null,null,null,null,null,null,null,null,null,null,null,null,null,null,null,1730119.3725800002,"FCC9167-14-03-2023"]
[{"$f":"IFERROR(VLOOKUP(C98,#REF!,9,FALSE),\"\")","v":""},{"$f":"C98&COUNTIF($C$2:C98,C98)","v":"FCS17001"},"FCS1700",null,null,36,421065.42,"2023-03-15",142,"2023-04-13",410491.86,3910.0400000000172,6663.52,0,0,-2.0008883439004421E-11,421065.42,null,null,null,null,null,null,null,null,null,null,null,null,null,null,null,null,null,null,null,null,null,null,null,null,null,null,null,null,null,null,null,417155.37999999995,"FCS1700-15-03-2023"]
[{"$f":"IFERROR(VLOOKUP(C99,#REF!,9,FALSE),\"\")","v":""},{"$f":"C99&COUNTIF($C$2:C99,C99)","v":"FCS10201"},"FCS1020",null,null,51,560070.25,"2023-03-15",142,"2023-04-26",559422.35,647.90000000002328,0,0,"shared folder",0,560070.25,null,null,null,null,null,null,null,null,null,null,null,null,null,null,null,null,null,null,null,null,null,null,null,null,null,null,null,null,null,null,null,559422.35,"FCS1020-15-03-2023"]
[{"$f":"IFERROR(VLOOKUP(C100,#REF!,9,FALSE),\"\")","v":""},{"$f":"C100&COUNTIF($C$2:C100,C100)","v":"FCC06001"},"FCC0600",null,null,29,208988.77,"2023-03-15",142,"2023-04-03",196893.77,0,12095,0,0,0,208988.77,null,null,null,null,null,null,null,null,null,null,null,null,null,null,null,null,null,null,null,null,null,null,null,null,null,null,null,null,null,null,null,208988.77,"FCC0600-15-03-2023"]
[{"$f":"IFERROR(VLOOKUP(C101,#REF!,9,FALSE),\"\")","v":""},{"$f":"C101&COUNTIF($C$2:C101,C101)","v":"FCC91661"},"FCC9166",null,null,2,17600,"2023-03-15",142,"2023-04-03",17600,0,0,0,0,0,17600,null,null,null,null,null,null,null,null,null,null,null,null,null,null,null,null,null,null,null,null,null,null,null,null,null,null,null,null,null,null,null,17600,"FCC9166-15-03-2023"]
[{"$f":"IFERROR(VLOOKUP(C102,#REF!,9,FALSE),\"\")","v":""},{"$f":"C102&COUNTIF($C$2:C102,C102)","v":"FCK30781"},"FCK3078",null,null,13,63031.5,"2023-03-15",142,"2023-04-05",62888.9,-1.4495071809506044E-12,142.6,0,0,0,63031.5,null,null,null,null,null,null,null,null,null,null,null,null,null,null,null,null,null,null,null,null,null,null,null,null,null,null,null,null,null,null,null,63031.5,"FCK3078-15-03-2023"]
[{"$f":"IFERROR(VLOOKUP(C103,#REF!,9,FALSE),\"\")","v":""},{"$f":"C103&COUNTIF($C$2:C103,C103)","v":"FCC33501"},"FCC3350",null,null,19,194251,"2023-03-15",142,"2023-04-03",194251,0,0,0,0,0,194251,null,null,null,null,null,null,null,null,null,null,null,null,null,null,null,null,null,null,null,null,null,null,null,null,null,null,null,null,null,null,null,194251,"FCC3350-15-03-2023"]
[{"$f":"IFERROR(VLOOKUP(C104,#REF!,9,FALSE),\"\")","v":""},{"$f":"C104&COUNTIF($C$2:C104,C104)","v":"FCS10701"},"FCS1070",null,null,1,3818,"2023-03-15",142,"2023-04-04",3678,140,0,0,0,0,3818,null,null,null,null,null,null,null,null,null,null,null,null,null,null,null,null,null,null,null,null,null,null,null,null,null,null,null,null,null,null,null,3678,"FCS1070-15-03-2023"]
[{"$f":"IFERROR(VLOOKUP(C105,#REF!,9,FALSE),\"\")","v":""},{"$f":"C105&COUNTIF($C$2:C105,C105)","v":"FCC91541"},"FCC9154",null,null,12,255276.76,"2023-03-15",142,"2023-04-11",255276.76,-1.9999999989522621E-2,0,0,0,0,255276.76,null,null,null,null,null,null,null,null,null,null,null,null,null,null,null,null,null,null,null,null,null,null,null,null,null,null,null,null,null,null,null,255276.78,"FCC9154-15-03-2023"]
[{"$f":"IFERROR(VLOOKUP(C106,#REF!,9,FALSE),\"\")","v":""},{"$f":"C106&COUNTIF($C$2:C106,C106)","v":"FCS29271"},"FCS2927",null,null,22,233708.29,"2023-03-15",142,"2023-03-29",230921.75,2786.5400000000081,0,0,0,0,233708.29,null,null,null,null,null,null,null,null,null,null,null,null,null,null,null,null,null,null,null,null,null,null,null,null,null,null,null,null,null,null,null,230921.75,"FCS2927-15-03-2023"]
[{"$f":"IFERROR(VLOOKUP(C107,#REF!,9,FALSE),\"\")","v":""},{"$f":"C107&COUNTIF($C$2:C107,C107)","v":"FCC91761"},"FCC9176",null,null,58,918960.76,"2023-03-15",142,"2023-04-18",888527.85,30432.910000000033,0,0,0,0,918960.76,null,null,null,null,null,null,null,null,null,null,null,null,null,null,null,null,null,null,null,null,null,null,null,null,null,null,null,null,null,null,null,888527.85,"FCC9176-15-03-2023"]
[{"$f":"IFERROR(VLOOKUP(C108,#REF!,9,FALSE),\"\")","v":""},{"$f":"C108&COUNTIF($C$2:C108,C108)","v":"FCG30911"},"FCG3091",null,null,41,199959.8,"2023-03-15",142,"2023-05-01",164109.79999999999,35850,0,0,0,0,199959.8,null,null,null,null,null,null,null,null,null,null,null,null,null,null,null,null,null,null,null,null,null,null,null,null,null,null,null,null,null,null,null,164109.79999999999,"FCG3091-15-03-2023"]
[{"$f":"IFERROR(VLOOKUP(C109,#REF!,9,FALSE),\"\")","v":""},{"$f":"C109&COUNTIF($C$2:C109,C109)","v":"FCC17801"},"FCC1780",null,null,4,143700,"2023-03-16",141,"2023-03-30",143700,0,0,0,0,0,143700,null,null,null,null,null,null,null,null,null,null,null,null,null,null,null,null,null,null,null,null,null,null,null,null,null,null,null,null,null,null,null,143700,"FCC1780-16-03-2023"]
[{"$f":"IFERROR(VLOOKUP(C110,#REF!,9,FALSE),\"\")","v":""},{"$f":"C110&COUNTIF($C$2:C110,C110)","v":"FCS29151"},"FCS2915",null,null,3,17172,"2023-03-16",141,"2023-04-12",12954.5,4217.5,0,0,"NEW RR",0,17172,null,null,null,null,null,null,null,null,null,null,null,null,null,null,null,null,null,null,null,null,null,null,null,null,null,null,null,null,null,null,null,12954.5,"FCS2915-16-03-2023"]
[{"$f":"IFERROR(VLOOKUP(C111,#REF!,9,FALSE),\"\")","v":""},{"$f":"C111&COUNTIF($C$2:C111,C111)","v":"FCC01201"},"FCC0120",null,null,28,472488.14,"2023-03-16",141,"2023-04-12",472455.8,32.300000000017462,0,0,0,0,472488.14,null,null,null,null,null,null,null,null,null,null,null,null,null,null,null,null,null,null,null,null,null,null,null,null,null,null,null,null,null,null,null,472455.83999999997,"FCC0120-16-03-2023"]
[{"$f":"IFERROR(VLOOKUP(C112,#REF!,9,FALSE),\"\")","v":""},{"$f":"C112&COUNTIF($C$2:C112,C112)","v":"FCC29501"},"FCC2950",null,null,20,89216,"2023-03-16",141,"2023-04-10",88514.43,701.57,0,0,0,6.9348971010185778E-12,89216,null,null,null,null,null,null,null,null,null,null,null,null,null,null,null,null,null,null,null,null,null,null,null,null,null,null,null,null,null,null,null,88514.43,"FCC2950-16-03-2023"]
[{"$f":"IFERROR(VLOOKUP(C113,#REF!,9,FALSE),\"\")","v":""},{"$f":"C113&COUNTIF($C$2:C113,C113)","v":"FCC91651"},"FCC9165",null,null,5,38534,"2023-03-16",141,"2023-04-12",35087.949999999997,3446.0500000000029,0,0,0,0,38534,null,null,null,null,null,null,null,null,null,null,null,null,null,null,null,null,null,null,null,null,null,null,null,null,null,null,null,null,null,null,null,35087.949999999997,"FCC9165-16-03-2023"]
[{"$f":"IFERROR(VLOOKUP(C114,#REF!,9,FALSE),\"\")","v":""},{"$f":"C114&COUNTIF($C$2:C114,C114)","v":"FCR34602"},"FCR3460",null,null,3,48365,"2023-03-16",141,"2023-04-12",48365,0,0,0,0,0,48365,null,null,null,null,null,null,null,null,null,null,null,null,null,null,null,null,null,null,null,null,null,null,null,null,null,null,null,null,null,null,null,48365,"FCR3460-16-03-2023"]
[{"$f":"IFERROR(VLOOKUP(C115,#REF!,9,FALSE),\"\")","v":""},{"$f":"C115&COUNTIF($C$2:C115,C115)","v":"FCC05901"},"FCC0590",null,"advance",112,3145299.65,"2023-03-16",141,"2023-04-13",2671279,226834.92000000016,247365.62,0,"new",-179.8900000002468,3145299.65,null,null,null,null,null,null,null,null,null,null,null,null,null,null,null,null,null,null,null,null,null,null,null,null,null,null,null,null,null,null,null,2918464.7299999995,"FCC0590-16-03-2023"]
[{"$f":"IFERROR(VLOOKUP(C116,#REF!,9,FALSE),\"\")","v":""},{"$f":"C116&COUNTIF($C$2:C116,C116)","v":"FCC91821"},"FCC9182",null,null,3,13221.25,"2023-03-16",141,"2023-04-12",13221.25,0,0,0,0,0,13221.25,null,null,null,null,null,null,null,null,null,null,null,null,null,null,null,null,null,null,null,null,null,null,null,null,null,null,null,null,null,null,null,13221.25,"FCC9182-16-03-2023"]
[{"$f":"IFERROR(VLOOKUP(C117,#REF!,9,FALSE),\"\")","v":""},{"$f":"C117&COUNTIF($C$2:C117,C117)","v":"FCX18201"},"FCX1820",null,null,3,11888.47,"2023-03-19",138,"2023-04-12",11885.85,2.6199999999989814,0,0,0,0,11888.47,null,null,null,null,null,null,null,null,null,null,null,null,null,null,null,null,null,null,null,null,null,null,null,null,null,null,null,null,null,null,null,11885.85,"FCX1820-19-03-2023"]
[{"$f":"IFERROR(VLOOKUP(C118,#REF!,9,FALSE),\"\")","v":""},{"$f":"C118&COUNTIF($C$2:C118,C118)","v":"FCF26181"},"FCF2618",null,null,1,32676.080000000002,"2023-03-19",138,"2023-04-12",32636.080000000002,40,0,0,0,0,32676.080000000002,null,null,null,null,null,null,null,null,null,null,null,null,null,null,null,null,null,null,null,null,null,null,null,null,null,null,null,null,null,null,null,32636.080000000002,"FCF2618-19-03-2023"]
[{"$f":"IFERROR(VLOOKUP(C119,#REF!,9,FALSE),\"\")","v":""},{"$f":"C119&COUNTIF($C$2:C119,C119)","v":"FCX28001"},"FCX2800",null,null,3,13280,"2023-03-19",138,"2023-04-03",13280,0,0,0,0,0,13280,null,null,null,null,null,null,null,null,null,null,null,null,null,null,null,null,null,null,null,null,null,null,null,null,null,null,null,null,null,null,null,13280,"FCX2800-19-03-2023"]
[{"$f":"IFERROR(VLOOKUP(C120,#REF!,9,FALSE),\"\")","v":""},{"$f":"C120&COUNTIF($C$2:C120,C120)","v":"FCC91941"},"FCC9194",null,null,2,36823,"2023-03-19",138,"2023-04-03",36775,48,0,0,0,0,36823,null,null,null,null,null,null,null,null,null,null,null,null,null,null,null,null,null,null,null,null,null,null,null,null,null,null,null,null,null,null,null,36775,"FCC9194-19-03-2023"]
[{"$f":"IFERROR(VLOOKUP(C121,#REF!,9,FALSE),\"\")","v":""},{"$f":"C121&COUNTIF($C$2:C121,C121)","v":"FCJ20401"},"FCJ2040",null,null,1,4114.5,"2023-03-19",138,"2023-04-03",4114.5,0,0,0,0,0,4114.5,null,null,null,null,null,null,null,null,null,null,null,null,null,null,null,null,null,null,null,null,null,null,null,null,null,null,null,null,null,null,null,4114.5,"FCJ2040-19-03-2023"]
[{"$f":"IFERROR(VLOOKUP(C122,#REF!,9,FALSE),\"\")","v":""},{"$f":"C122&COUNTIF($C$2:C122,C122)","v":"FCC91721"},"FCC9172",null,null,6,183996.35,"2023-03-19",138,"2023-04-13",176531.14,7465.2099999999919,0,0,"shared folder",0,183996.35,null,null,null,null,null,null,null,null,null,null,null,null,null,null,null,null,null,null,null,null,null,null,null,null,null,null,null,null,null,null,null,176531.14,"FCC9172-19-03-2023"]
[{"$f":"IFERROR(VLOOKUP(C123,#REF!,9,FALSE),\"\")","v":""},{"$f":"C123&COUNTIF($C$2:C123,C123)","v":"FCC21101"},"FCC2110",null,null,1,14188,"2023-03-19",138,"2023-04-18",14188,0,0,0,0,0,14188,null,null,null,null,null,null,null,null,null,null,null,null,null,null,null,null,null,null,null,null,null,null,null,null,null,null,null,null,null,null,null,14188,"FCC2110-19-03-2023"]
[{"$f":"IFERROR(VLOOKUP(C124,#REF!,9,FALSE),\"\")","v":""},{"$f":"C124&COUNTIF($C$2:C124,C124)","v":"FCD30531"},"FCD3053",null,null,1,240,"2023-03-19",138,"2023-04-03",240,0,0,0,0,0,240,null,null,null,null,null,null,null,null,null,null,null,null,null,null,null,null,null,null,null,null,null,null,null,null,null,null,null,null,null,null,null,240,"FCD3053-19-03-2023"]
[{"$f":"IFERROR(VLOOKUP(C125,#REF!,9,FALSE),\"\")","v":""},{"$f":"C125&COUNTIF($C$2:C125,C125)","v":"FCX27951"},"FCX2795",null,null,7,45698.29,"2023-03-19",138,"2023-04-03",40962.51,4735.7799999999988,0,0,"discount difference in all services applying 5% instead of 20%",0,45698.29,null,null,null,null,null,null,null,null,null,null,null,null,null,null,null,null,null,null,null,null,null,null,null,null,null,null,null,null,null,null,null,40962.51,"FCX2795-19-03-2023"]
[{"$f":"IFERROR(VLOOKUP(C126,#REF!,9,FALSE),\"\")","v":""},{"$f":"C126&COUNTIF($C$2:C126,C126)","v":"FCC33001"},"FCC3300",null,"advance",189,5060046.29,"2023-03-19",138,"2023-05-01",5029905.34,-0.92000000039797669,30140.95,0,0,0.92000000058396836,5060046.29,null,null,null,null,null,null,null,null,null,null,null,null,null,null,null,null,null,null,null,null,null,null,null,null,null,null,null,null,null,null,null,5060047.2100000009,"FCC3300-19-03-2023"]
[{"$f":"IFERROR(VLOOKUP(C127,#REF!,9,FALSE),\"\")","v":""},{"$f":"C127&COUNTIF($C$2:C127,C127)","v":"FCC17401"},"FCC1740",null,null,20,156233,"2023-03-19",138,"2023-04-10",156227.35,5.6500000000123691,0,0,0,-1.8189894035458565E-11,156233,null,null,null,null,null,null,null,null,null,null,null,null,null,null,null,null,null,null,null,null,null,null,null,null,null,null,null,null,null,null,null,156227.34999999998,"FCC1740-19-03-2023"]
[{"$f":"IFERROR(VLOOKUP(C128,#REF!,9,FALSE),\"\")","v":""},{"$f":"C128&COUNTIF($C$2:C128,C128)","v":"FCX32202"},"FCX3220",null,null,1,14872.16,"2023-03-19",138,"2023-04-30",14725.16,146.55999999999949,0,0,0,0,14872.16,null,null,null,null,null,null,null,null,null,null,null,null,null,null,null,null,null,null,null,null,null,null,null,null,null,null,null,null,null,null,null,14725.6,"FCX3220-19-03-2023"]
[{"$f":"IFERROR(VLOOKUP(C129,#REF!,9,FALSE),\"\")","v":""},{"$f":"C129&COUNTIF($C$2:C129,C129)","v":"FCC91391"},"FCC9139",null,null,2,5466,"2023-03-19",138,"2023-05-02",5466,0,0,0,0,0,5466,null,null,null,null,null,null,null,null,null,null,null,null,null,null,null,null,null,null,null,null,null,null,null,null,null,null,null,null,null,null,null,5466,"FCC9139-19-03-2023"]
[{"$f":"IFERROR(VLOOKUP(C130,#REF!,9,FALSE),\"\")","v":""},{"$f":"C130&COUNTIF($C$2:C130,C130)","v":"FCS29781"},"FCS2978",null,null,12,47218.5,"2023-03-19",{"$f":"+TODAY()-H130","v":138},"2023-05-01",44949.5,1485,784,0,0,0,47218.5,null,null,null,null,null,null,null,null,null,null,null,null,null,null,null,null,null,null,null,null,null,null,null,null,null,null,null,null,null,null,null,45733.5,"FCS2978-19-03-2023"]
[{"$f":"IFERROR(VLOOKUP(C131,#REF!,9,FALSE),\"\")","v":""},{"$f":"C131&COUNTIF($C$2:C131,C131)","v":"FCB17601"},"FCB1760",null,null,13,71773.38,"2023-03-20",137,"2023-04-30",61223,10550,0,0,0,0,{"$f":"+G131-R131-T131-V131-X131-Z131-AB131-AD131-AF131-AH131-AJ131-AL131-AN131-AP131-AT131-AV131","v":71773.38},null,null,null,null,null,null,null,null,null,null,null,null,null,null,null,null,null,null,null,null,null,null,null,null,null,null,null,null,null,null,null,{"$f":"G131-(L131++R131+T131+V131+X131+Z131+AB131+AD131+AF131+AH131+AJ131+AL131+AN131+AP131+AR131)","v":61223.380000000005},{"$f":"CONCATENATE(C131,\"-\",TEXT(H131,\"DD-MM-YYYY\"))","v":"FCB1760-20-03-2023"}]
[{"$f":"IFERROR(VLOOKUP(C132,#REF!,9,FALSE),\"\")","v":""},{"$f":"C132&COUNTIF($C$2:C132,C132)","v":"FCC91521"},"FCC9152",null,null,12,206000,"2023-03-20",137,"2023-04-18",203700.1,2299.8999999999942,0,0,0,{"$f":"+G132-K132-L132-M132-N132","v":0},206000,null,null,null,null,null,null,null,null,null,null,null,null,null,null,null,null,null,null,null,null,null,null,null,null,null,null,null,null,null,null,null,203700.1,"FCC9152-20-03-2023"]
[{"$f":"IFERROR(VLOOKUP(C133,#REF!,9,FALSE),\"\")","v":""},{"$f":"C133&COUNTIF($C$2:C133,C133)","v":"FCC14901"},"FCC1490",null,null,7,89087.88,"2023-03-20",137,"2023-04-13",88439.89,647.99000000000524,0,0,0,0,89087.88,null,null,null,null,null,null,null,null,null,null,null,null,null,null,null,null,null,null,null,null,null,null,null,null,null,null,null,null,null,null,null,88439.89,"FCC1490-20-03-2023"]
[{"$f":"IFERROR(VLOOKUP(C134,#REF!,9,FALSE),\"\")","v":""},{"$f":"C134&COUNTIF($C$2:C134,C134)","v":"FCC91811"},"FCC9181",null,null,5,111892.5,"2023-03-20",137,"2023-04-13",111892.5,0,0,0,0,0,111892.5,null,null,null,null,null,null,null,null,null,null,null,null,null,null,null,null,null,null,null,null,null,null,null,null,null,null,null,null,null,null,null,111892.5,"FCC9181-20-03-2023"]
[{"$f":"IFERROR(VLOOKUP(C135,#REF!,9,FALSE),\"\")","v":""},{"$f":"C135&COUNTIF($C$2:C135,C135)","v":"FCK24101"},"FCK2410",null,null,15,85682,"2023-03-20",137,"2023-04-05",85062.88,619.11999999999534,0,0,0,0,85682,null,null,null,null,null,null,null,null,null,null,null,null,null,null,null,null,null,null,null,null,null,null,null,null,null,null,null,null,null,null,null,85062.88,"FCK2410-20-03-2023"]
[{"$f":"IFERROR(VLOOKUP(C136,#REF!,9,FALSE),\"\")","v":""},{"$f":"C136&COUNTIF($C$2:C136,C136)","v":"FCK30841"},"FCK3084",null,null,6,72653,"2023-03-20",137,"2023-04-03",64407.8,7770.400000000006,474.8,0,0,-8.9244167611468583E-12,72653,null,null,null,null,null,null,null,null,null,null,null,null,null,null,null,null,null,null,null,null,null,null,null,null,null,null,null,null,null,null,null,64882.599999999991,"FCK3084-20-03-2023"]
[{"$f":"IFERROR(VLOOKUP(C137,#REF!,9,FALSE),\"\")","v":""},{"$f":"C137&COUNTIF($C$2:C137,C137)","v":"FCC06601"},"FCC0660",null,null,5,139501.20000000001,"2023-03-20",137,"2023-07-13",135947.20000000001,3554,0,0,0,0,139501.20000000001,null,null,null,null,null,null,null,null,null,null,null,null,null,null,null,null,null,null,null,null,null,null,null,null,null,null,null,null,null,null,null,135947.20000000001,"FCC0660-20-03-2023"]
[{"$f":"IFERROR(VLOOKUP(C138,#REF!,9,FALSE),\"\")","v":""},{"$f":"C138&COUNTIF($C$2:C138,C138)","v":"FCC00601"},"FCC0060",null,"advance",17,156531.25,"2023-03-20",137,"2023-04-13",154855.57999999999,2606.2600000000093,0,0,"NEW",-930.58999999999651,156531.25,null,null,null,null,null,null,null,null,null,null,null,null,null,null,null,null,null,null,null,null,null,null,null,null,null,null,null,null,null,null,null,153924.99,"FCC0060-20-03-2023"]
[{"$f":"IFERROR(VLOOKUP(C139,#REF!,9,FALSE),\"\")","v":""},{"$f":"C139&COUNTIF($C$2:C139,C139)","v":"FCC35201"},"FCC3520",null,"advance+VD",33,405619.41,"2023-03-20",137,"2023-04-13",389982.67,9516.005839999958,6120.75,0,"Updated Final Reconcilation",0,405619.41,null,null,null,null,null,null,null,null,null,null,null,null,null,null,null,null,null,null,null,null,null,null,null,null,null,null,null,null,null,null,null,396103.40416000003,"FCC3520-20-03-2023"]
[{"$f":"IFERROR(VLOOKUP(C140,#REF!,9,FALSE),\"\")","v":""},{"$f":"C140&COUNTIF($C$2:C140,C140)","v":"FCC91921"},"FCC9192",null,null,8,150055.06,"2023-03-20",137,"2023-05-02",142629.78,7425.2799999999988,0,0,0,0,150055.06,null,null,null,null,null,null,null,null,null,null,null,null,null,null,null,null,null,null,null,null,null,null,null,null,null,null,null,null,null,null,null,142629.78,"FCC9192-20-03-2023"]
[{"$f":"IFERROR(VLOOKUP(C141,#REF!,9,FALSE),\"\")","v":""},{"$f":"C141&COUNTIF($C$2:C141,C141)","v":"FCC90901"},"FCC9090",null,null,23,669388.78,"2023-03-20",137,"2023-04-13",635509.18999999994,0.29000000008454663,33878.800000000003,0,"corrected amount according to provider's statement ",0.5,669388.78,null,null,null,null,null,null,null,null,null,null,null,null,null,null,null,null,null,null,null,null,null,null,null,null,null,null,null,null,null,null,null,669388.49,"FCC9090-20-03-2023"]
[{"$f":"IFERROR(VLOOKUP(C142,#REF!,9,FALSE),\"\")","v":""},{"$f":"C142&COUNTIF($C$2:C142,C142)","v":"FCC91711"},"FCC9171",null,null,13,618215.84,"2023-03-20",137,"2023-05-03",592989.77,13323.570000000007,0,0,0,11902.499999999942,618215.84,null,null,null,null,null,null,null,null,null,null,null,null,null,null,null,null,null,null,null,null,null,null,null,null,null,null,null,null,null,null,null,604892.27,"FCC9171-20-03-2023"]
[{"$f":"IFERROR(VLOOKUP(C143,#REF!,9,FALSE),\"\")","v":""},{"$f":"C143&COUNTIF($C$2:C143,C143)","v":"FCX27921"},"FCX2792",null,null,8,103284.45,"2023-03-21",136,"2023-05-01",71354.25,31930.199999999997,0,0,0,0,103284.45,null,null,null,null,null,null,null,null,null,null,null,null,null,null,null,null,null,null,null,null,null,null,null,null,null,null,null,null,null,null,null,71354.25,"FCX2792-21-03-2023"]
[{"$f":"IFERROR(VLOOKUP(C144,#REF!,9,FALSE),\"\")","v":""},{"$f":"C144&COUNTIF($C$2:C144,C144)","v":"FCB30801"},"FCB3080",null,null,1,8219,"2023-03-21",136,"2023-04-10",8142,77,0,0,0,0,8219,null,null,null,null,null,null,null,null,null,null,null,null,null,null,null,null,null,null,null,null,null,null,null,null,null,null,null,null,null,null,null,8142,"FCB3080-21-03-2023"]
[{"$f":"IFERROR(VLOOKUP(C145,#REF!,9,FALSE),\"\")","v":""},{"$f":"C145&COUNTIF($C$2:C145,C145)","v":"FCC91861"},"FCC9186",null,null,1,4800,"2023-03-21",136,"2023-07-16",4500,300,0,0,0,0,4800,null,null,null,null,null,null,null,null,null,null,null,null,null,null,null,null,null,null,null,null,null,null,null,null,null,null,null,null,null,null,null,4500,"FCC9186-21-03-2023"]
[{"$f":"IFERROR(VLOOKUP(C146,#REF!,9,FALSE),\"\")","v":""},{"$f":"C146&COUNTIF($C$2:C146,C146)","v":"FCF26221"},"FCF2622",null,null,2,18931.8,"2023-03-21",136,"2023-04-10",18931.8,0,0,0,0,0,18931.8,null,null,null,null,null,null,null,null,null,null,null,null,null,null,null,null,null,null,null,null,null,null,null,null,null,null,null,null,null,null,null,18931.8,"FCF2622-21-03-2023"]
[{"$f":"IFERROR(VLOOKUP(C147,#REF!,9,FALSE),\"\")","v":""},{"$f":"C147&COUNTIF($C$2:C147,C147)","v":"FCC33801"},"FCC3380",null,null,18,136202,"2023-03-21",136,"2023-04-13",134438.65,1763.3500000000058,0,0,0,0,136202,null,null,null,null,null,null,null,null,null,null,null,null,null,null,null,null,null,null,null,null,null,null,null,null,null,null,null,null,null,null,null,134438.65,"FCC3380-21-03-2023"]
[{"$f":"IFERROR(VLOOKUP(C148,#REF!,9,FALSE),\"\")","v":""},{"$f":"C148&COUNTIF($C$2:C148,C148)","v":"FCN21701"},"FCN2170",null,null,1,59300,"2023-03-21",136,"2023-04-13",59300,0,0,0,0,0,59300,null,null,null,null,null,null,null,null,null,null,null,null,null,null,null,null,null,null,null,null,null,null,null,null,null,null,null,null,null,null,null,59300,"FCN2170-21-03-2023"]
[{"$f":"IFERROR(VLOOKUP(C149,#REF!,9,FALSE),\"\")","v":""},{"$f":"C149&COUNTIF($C$2:C149,C149)","v":"FCC16501"},"FCC1650",null,"advance",4,61419,"2023-03-21",136,"2023-04-10",61338.01,80.989999999999995,0,0,"NEW",-2.0321522242738865E-12,61419,null,null,null,null,null,null,null,null,null,null,null,null,null,null,null,null,null,null,null,null,null,null,null,null,null,null,null,null,null,null,null,61338.01,"FCC1650-21-03-2023"]
[{"$f":"IFERROR(VLOOKUP(C150,#REF!,9,FALSE),\"\")","v":""},{"$f":"C150&COUNTIF($C$2:C150,C150)","v":"FCM27621"},"FCM2762",null,null,6,64030,"2023-03-21",136,"2023-05-02",64030,-0.15000000000145519,0,0,0,0,64030,null,null,null,null,null,null,null,null,null,null,null,null,null,null,null,null,null,null,null,null,null,null,null,null,null,null,null,null,null,null,null,64030.15,"FCM2762-21-03-2023"]
[{"$f":"IFERROR(VLOOKUP(C151,#REF!,9,FALSE),\"\")","v":""},{"$f":"C151&COUNTIF($C$2:C151,C151)","v":"FCS29171"},"FCS2917",null,null,11,37694.25,"2023-03-21",136,"2023-05-01",37694.25,0,0,0,0,0,37694.25,null,null,null,null,null,null,null,null,null,null,null,null,null,null,null,null,null,null,null,null,null,null,null,null,null,null,null,null,null,null,null,37694.25,"FCS2917-21-03-2023"]
[{"$f":"IFERROR(VLOOKUP(C152,#REF!,9,FALSE),\"\")","v":""},{"$f":"C152&COUNTIF($C$2:C152,C152)","v":"FCC91501"},"FCC9150",null,null,2,20277.830000000002,"2023-03-21",136,"2023-04-18",20277.830000000002,0,0,0,0,0,20277.830000000002,null,null,null,null,null,null,null,null,null,null,null,null,null,null,null,null,null,null,null,null,null,null,null,null,null,null,null,null,null,null,null,20277.830000000002,"FCC9150-21-03-2023"]
[{"$f":"IFERROR(VLOOKUP(C153,#REF!,9,FALSE),\"\")","v":""},{"$f":"C153&COUNTIF($C$2:C153,C153)","v":"FCF26161"},"FCF2616",null,null,3,9028.5,"2023-03-21",136,"2023-04-13",7930.65,1097.8500000000004,0,0,0,0,9028.5,null,null,null,null,null,null,null,null,null,null,null,null,null,null,null,null,null,null,null,null,null,null,null,null,null,null,null,null,null,null,null,7930.65,"FCF2616-21-03-2023"]
[{"$f":"IFERROR(VLOOKUP(C154,#REF!,9,FALSE),\"\")","v":""},{"$f":"C154&COUNTIF($C$2:C154,C154)","v":"FCC18002"},"FCC1800",null,null,2,96573.47,"2023-03-21",136,"2023-04-26",96535.97,163.49999999999818,0,0,0,-125.99999999999818,96573.47,null,null,null,null,null,null,null,null,null,null,null,null,null,null,null,null,null,null,null,null,null,null,null,null,null,null,null,null,null,null,null,96409.97,"FCC1800-21-03-2023"]
[{"$f":"IFERROR(VLOOKUP(C155,#REF!,9,FALSE),\"\")","v":""},{"$f":"C155&COUNTIF($C$2:C155,C155)","v":"FCX27991"},"FCX2799",null,null,8,80665.440000000002,"2023-03-22",135,"2023-04-10",80044.039999999994,621.4,0,0,0,8.7538865045644343E-12,80665.440000000002,null,null,null,null,null,null,null,null,null,null,null,null,null,null,null,null,null,null,null,null,null,null,null,null,null,null,null,null,null,null,null,80044.040000000008,"FCX2799-22-03-2023"]
[{"$f":"IFERROR(VLOOKUP(C156,#REF!,9,FALSE),\"\")","v":""},{"$f":"C156&COUNTIF($C$2:C156,C156)","v":"FCV11701"},"FCV1170",null,null,4,20957.18,"2023-03-22",135,"2023-04-13",19237.13,1720.0499999999993,0,0,0,0,20957.18,null,null,null,null,null,null,null,null,null,null,null,null,null,null,null,null,null,null,null,null,null,null,null,null,null,null,null,null,null,null,null,19237.13,"FCV1170-22-03-2023"]
[{"$f":"IFERROR(VLOOKUP(C157,#REF!,9,FALSE),\"\")","v":""},{"$f":"C157&COUNTIF($C$2:C157,C157)","v":"FCS29141"},"FCS2914",null,null,13,82949.05,"2023-03-22",135,"2023-04-18",73166.539999999994,9782.5100000000093,0,0,0,0,82949.05,null,null,null,null,null,null,null,null,null,null,null,null,null,null,null,null,null,null,null,null,null,null,null,null,null,null,null,null,null,null,null,73166.539999999994,"FCS2914-22-03-2023"]
[{"$f":"IFERROR(VLOOKUP(C158,#REF!,9,FALSE),\"\")","v":""},{"$f":"C158&COUNTIF($C$2:C158,C158)","v":"FCC28401"},"FCC2840",null,"advance",40,233792.25,"2023-03-22",135,"2023-04-30",193465,36373.303999999967,3954,0,0,0,233792.25,null,null,null,null,null,null,null,null,null,null,null,null,null,null,null,null,null,null,null,null,null,null,null,null,null,null,null,null,null,null,null,197418.94600000003,"FCC2840-22-03-2023"]
[{"$f":"IFERROR(VLOOKUP(C159,#REF!,9,FALSE),\"\")","v":""},{"$f":"C159&COUNTIF($C$2:C159,C159)","v":"FCZ13601"},"FCZ1360",null,null,1,2404,"2023-03-22",135,"2023-04-10",2404,0,0,0,0,0,2404,null,null,null,null,null,null,null,null,null,null,null,null,null,null,null,null,null,null,null,null,null,null,null,null,null,null,null,null,null,null,null,2404,"FCZ1360-22-03-2023"]
[{"$f":"IFERROR(VLOOKUP(C160,#REF!,9,FALSE),\"\")","v":""},{"$f":"C160&COUNTIF($C$2:C160,C160)","v":"FCC91581"},"FCC9158",null,"advance",35,1744981.8,"2023-03-22",135,"2023-04-13",1454037.98,255580.43000000011,35723.39,0,0,-360.00000000004366,1744981.8,null,null,null,null,null,null,null,null,null,null,null,null,null,null,null,null,null,null,null,null,null,null,null,null,null,null,null,null,null,null,null,1489401.3699999999,"FCC9158-22-03-2023"]
[{"$f":"IFERROR(VLOOKUP(C161,#REF!,9,FALSE),\"\")","v":""},{"$f":"C161&COUNTIF($C$2:C161,C161)","v":"FCC30201"},"FCC3020",null,null,2,30000,"2023-03-22",135,"2023-04-26",30000,0,0,0,0,0,30000,null,null,null,null,null,null,null,null,null,null,null,null,null,null,null,null,null,null,null,null,null,null,null,null,null,null,null,null,null,null,null,30000,"FCC3020-22-03-2023"]
[{"$f":"IFERROR(VLOOKUP(C162,#REF!,9,FALSE),\"\")","v":""},{"$f":"C162&COUNTIF($C$2:C162,C162)","v":"FCC29802"},"FCC2980",null,null,14,200405.78,"2023-03-22",135,"2023-04-18",200066.38,339.39999999999418,0,0,"new",0,200405.78,null,null,null,null,null,null,null,null,null,null,null,null,null,null,null,null,null,null,null,null,null,null,null,null,null,null,null,null,null,null,null,200066.38,"FCC2980-22-03-2023"]
[{"$f":"IFERROR(VLOOKUP(C163,#REF!,9,FALSE),\"\")","v":""},{"$f":"C163&COUNTIF($C$2:C163,C163)","v":"FCC91751"},"FCC9175",null,null,6,45386.98,"2023-03-22",135,"2023-04-18",44096.98,1290,0,0,0,0,45386.98,null,null,null,null,null,null,null,null,null,null,null,null,null,null,null,null,null,null,null,null,null,null,null,null,null,null,null,null,null,null,null,44096.98,"FCC9175-22-03-2023"]
[{"$f":"IFERROR(VLOOKUP(C164,#REF!,9,FALSE),\"\")","v":""},{"$f":"C164&COUNTIF($C$2:C164,C164)","v":"FCC91831"},"FCC9183",null,null,3,11928.03,"2023-03-22",135,"2023-04-13",11928.02,1.0000000000218279E-2,0,0,0,0,11928.03,null,null,null,null,null,null,null,null,null,null,null,null,null,null,null,null,null,null,null,null,null,null,null,null,null,null,null,null,null,null,null,11928.02,"FCC9183-22-03-2023"]
[{"$f":"IFERROR(VLOOKUP(C165,#REF!,9,FALSE),\"\")","v":""},{"$f":"C165&COUNTIF($C$2:C165,C165)","v":"FCC22501"},"FCC2250",null,null,1,10181,"2023-03-26",131,"2023-05-11",10181,0,0,0,0,0,10181,null,null,null,null,null,null,null,null,null,null,null,null,null,null,null,null,null,null,null,null,null,null,null,null,null,null,null,null,null,null,null,10181,"FCC2250-26-03-2023"]
[{"$f":"IFERROR(VLOOKUP(C166,#REF!,9,FALSE),\"\")","v":""},{"$f":"C166&COUNTIF($C$2:C166,C166)","v":"FCK35501"},"FCK3550",null,null,2,7370.32,"2023-03-26",131,"2023-04-13",7050.22,320.09999999999945,0,0,"new",0,7370.32,null,null,null,null,null,null,null,null,null,null,null,null,null,null,null,null,null,null,null,null,null,null,null,null,null,null,null,null,null,null,null,7050.22,"FCK3550-26-03-2023"]
[{"$f":"IFERROR(VLOOKUP(C167,#REF!,9,FALSE),\"\")","v":""},{"$f":"C167&COUNTIF($C$2:C167,C167)","v":"FCK30821"},"FCK3082",null,null,6,15190.36,"2023-03-26",131,"2023-04-04",14798.36,392,0,0,0,0,15190.36,null,null,null,null,null,null,null,null,null,null,null,null,null,null,null,null,null,null,null,null,null,null,null,null,null,null,null,null,null,null,null,14798.36,"FCK3082-26-03-2023"]
[{"$f":"IFERROR(VLOOKUP(C168,#REF!,9,FALSE),\"\")","v":""},{"$f":"C168&COUNTIF($C$2:C168,C168)","v":"FCC91691"},"FCC9169",null,null,4,40383.19,"2023-03-26",131,"2023-04-13",40323.18,60.010000000002037,0,0,0,0,40383.19,null,null,null,null,null,null,null,null,null,null,null,null,null,null,null,null,null,null,null,null,null,null,null,null,null,null,null,null,null,null,null,40323.18,"FCC9169-26-03-2023"]
[{"$f":"IFERROR(VLOOKUP(C169,#REF!,9,FALSE),\"\")","v":""},{"$f":"C169&COUNTIF($C$2:C169,C169)","v":"FCB31941"},"FCB3194",null,null,4,10280,"2023-03-26",131,"2023-05-01",10280,-0.24000000000023647,0,0,0,0,10280,null,null,null,null,null,null,null,null,null,null,null,null,null,null,null,null,null,null,null,null,null,null,null,null,null,null,null,null,null,null,null,10280.24,"FCB3194-26-03-2023"]
[{"$f":"IFERROR(VLOOKUP(C170,#REF!,9,FALSE),\"\")","v":""},{"$f":"C170&COUNTIF($C$2:C170,C170)","v":"FCX34901"},"FCX3490",null,null,1,6300,"2023-03-26",131,"2023-05-01",6300,0,0,0,0,0,6300,null,null,null,null,null,null,null,null,null,null,null,null,null,null,null,null,null,null,null,null,null,null,null,null,null,null,null,null,null,null,null,6300,"FCX3490-26-03-2023"]
[{"$f":"IFERROR(VLOOKUP(C171,#REF!,9,FALSE),\"\")","v":""},{"$f":"C171&COUNTIF($C$2:C171,C171)","v":"FCQ34401"},"FCQ3440",null,null,2,10153,"2023-03-26",131,"2023-07-19",8323,1830,0,0,0,0,10153,null,null,null,null,null,null,null,null,null,null,null,null,null,null,null,null,null,null,null,null,null,null,null,null,null,null,null,null,null,null,null,8323,"FCQ3440-26-03-2023"]
[{"$f":"IFERROR(VLOOKUP(C172,#REF!,9,FALSE),\"\")","v":""},{"$f":"C172&COUNTIF($C$2:C172,C172)","v":"FCY27061"},"FCY2706",null,null,3,15171,"2023-03-26",131,"2023-05-01",13701,1470,0,0,0,0,15171,null,null,null,null,null,null,null,null,null,null,null,null,null,null,null,null,null,null,null,null,null,null,null,null,null,null,null,null,null,null,null,13701,"FCY2706-26-03-2023"]
[{"$f":"IFERROR(VLOOKUP(C173,#REF!,9,FALSE),\"\")","v":""},{"$f":"C173&COUNTIF($C$2:C173,C173)","v":"FCX34801"},"FCX3480",null,null,4,48060.37,"2023-03-26",131,"2023-05-01",44838.2,3222.1400000000067,0,0,0,0,48060.37,null,null,null,null,null,null,null,null,null,null,null,null,null,null,null,null,null,null,null,null,null,null,null,null,null,null,null,null,null,null,null,44838.229999999996,"FCX3480-26-03-2023"]
[{"$f":"IFERROR(VLOOKUP(C174,#REF!,9,FALSE),\"\")","v":""},{"$f":"C174&COUNTIF($C$2:C174,C174)","v":"FCT10801"},"FCT1080",null,null,1,12450,"2023-03-26",131,"2023-04-30",12450,0,0,0,0,0,12450,null,null,null,null,null,null,null,null,null,null,null,null,null,null,null,null,null,null,null,null,null,null,null,null,null,null,null,null,null,null,null,12450,"FCT1080-26-03-2023"]
[{"$f":"IFERROR(VLOOKUP(C175,#REF!,9,FALSE),\"\")","v":""},{"$f":"C175&COUNTIF($C$2:C175,C175)","v":"fcn31451"},"fcn3145",null,null,16,21103.1,"2023-03-26",131,"2023-04-13",18037.099999999999,2736,330,0,0,0,21103.1,null,null,null,null,null,null,null,null,null,null,null,null,null,null,null,null,null,null,null,null,null,null,null,null,null,null,null,null,null,null,null,18367.099999999999,"fcn3145-26-03-2023"]
[{"$f":"IFERROR(VLOOKUP(C176,#REF!,9,FALSE),\"\")","v":""},{"$f":"C176&COUNTIF($C$2:C176,C176)","v":"FCY27051"},"FCY2705",null,null,1,12083.5,"2023-03-26",131,"2023-05-01",7930,4153.1000000000004,0,0,0,0,12083.5,null,null,null,null,null,null,null,null,null,null,null,null,null,null,null,null,null,null,null,null,null,null,null,null,null,null,null,null,null,null,null,7930.4,"FCY2705-26-03-2023"]
[{"$f":"IFERROR(VLOOKUP(C177,#REF!,9,FALSE),\"\")","v":""},{"$f":"C177&COUNTIF($C$2:C177,C177)","v":"FCS29261"},"FCS2926",null,null,1,8135,"2023-03-26",131,"2023-05-03",7718.36,416.64000000000033,0,0,0,0,8135,null,null,null,null,null,null,null,null,null,null,null,null,null,null,null,null,null,null,null,null,null,null,null,null,null,null,null,null,null,null,null,7718.36,"FCS2926-26-03-2023"]
[{"$f":"IFERROR(VLOOKUP(C178,#REF!,9,FALSE),\"\")","v":""},{"$f":"C178&COUNTIF($C$2:C178,C178)","v":"FCC00401"},"FCC0040",null,null,3,7466,"2023-03-26",131,"2023-05-03",7256,210,0,0,0,0,7466,null,null,null,null,null,null,null,null,null,null,null,null,null,null,null,null,null,null,null,null,null,null,null,null,null,null,null,null,null,null,null,7256,"FCC0040-26-03-2023"]
[{"$f":"IFERROR(VLOOKUP(C179,#REF!,9,FALSE),\"\")","v":""},{"$f":"C179&COUNTIF($C$2:C179,C179)","v":"FCK25201"},"FCK2520",null,null,5,44000,"2023-03-26",131,"2023-04-30",44000,0,0,0,0,0,44000,null,null,null,null,null,null,null,null,null,null,null,null,null,null,null,null,null,null,null,null,null,null,null,null,null,null,null,null,null,null,null,44000,"FCK2520-26-03-2023"]
[{"$f":"IFERROR(VLOOKUP(C180,#REF!,9,FALSE),\"\")","v":""},{"$f":"C180&COUNTIF($C$2:C180,C180)","v":"FCC91881"},"FCC9188",null,null,6,461058.98,"2023-03-26",131,"2023-05-03",81059,0.61999999999534339,380000,0,0,-0.64000000001396984,461058.98,null,null,null,null,null,null,null,null,null,null,null,null,null,null,null,null,null,null,null,null,null,null,null,null,null,null,null,null,null,null,null,461058.36,"FCC9188-26-03-2023"]
[{"$f":"IFERROR(VLOOKUP(C181,#REF!,9,FALSE),\"\")","v":""},{"$f":"C181&COUNTIF($C$2:C181,C181)","v":"FCZ27281"},"FCZ2728",null,null,2,594.86,"2023-03-26",131,"2023-05-01",534.79999999999995,60.040000000000077,0,0,0,0,594.86,null,null,null,null,null,null,null,null,null,null,null,null,null,null,null,null,null,null,null,null,null,null,null,null,null,null,null,null,null,null,null,534.81999999999994,"FCZ2728-26-03-2023"]
[{"$f":"IFERROR(VLOOKUP(C182,#REF!,9,FALSE),\"\")","v":""},{"$f":"C182&COUNTIF($C$2:C182,C182)","v":"FCL07701"},"FCL0770",null,null,2,14702,"2023-03-26",131,"2023-05-01",14402,300,0,0,0,0,14702,null,null,null,null,null,null,null,null,null,null,null,null,null,null,null,null,null,null,null,null,null,null,null,null,null,null,null,null,null,null,null,14402,"FCL0770-26-03-2023"]
[{"$f":"IFERROR(VLOOKUP(C183,#REF!,9,FALSE),\"\")","v":""},{"$f":"C183&COUNTIF($C$2:C183,C183)","v":"FCC04501"},"FCC0450",null,null,3,18668.919999999998,"2023-03-26",131,"2023-05-09",18611.919999999998,57,0,0,0,0,18668.919999999998,null,null,null,null,null,null,null,null,null,null,null,null,null,null,null,null,null,null,null,null,null,null,null,null,null,null,null,null,null,null,null,18611.919999999998,"FCC0450-26-03-2023"]
[{"$f":"IFERROR(VLOOKUP(C184,#REF!,9,FALSE),\"\")","v":""},{"$f":"C184&COUNTIF($C$2:C184,C184)","v":"FCC01901"},"FCC0190",null,null,7,23395,"2023-03-26",131,"2023-04-04",23395,-9.9999999983992893E-3,0,0,0,0,23395,null,null,null,null,null,null,null,null,null,null,null,null,null,null,null,null,null,null,null,null,null,null,null,null,null,null,null,null,null,null,null,23395.01,"FCC0190-26-03-2023"]
[{"$f":"IFERROR(VLOOKUP(C185,#REF!,9,FALSE),\"\")","v":""},{"$f":"C185&COUNTIF($C$2:C185,C185)","v":"FCB35401"},"FCB3540",null,null,5,18101,"2023-03-26",131,"2023-05-03",18101,0,0,0,0,0,18101,null,null,null,null,null,null,null,null,null,null,null,null,null,null,null,null,null,null,null,null,null,null,null,null,null,null,null,null,null,null,null,18101,"FCB3540-26-03-2023"]
[{"$f":"IFERROR(VLOOKUP(C186,#REF!,9,FALSE),\"\")","v":""},{"$f":"C186&COUNTIF($C$2:C186,C186)","v":"FCE01011"},"FCE0101",null,null,6,35846.82,"2023-03-26",131,"2023-04-04",32434.32,3412.5,0,0,0,0,35846.82,null,null,null,null,null,null,null,null,null,null,null,null,null,null,null,null,null,null,null,null,null,null,null,null,null,null,null,null,null,null,null,32434.32,"FCE0101-26-03-2023"]
[{"$f":"IFERROR(VLOOKUP(C187,#REF!,9,FALSE),\"\")","v":""},{"$f":"C187&COUNTIF($C$2:C187,C187)","v":"FCE33901"},"FCE3390",null,null,6,11879,"2023-03-26",131,"2023-04-11",7844,4035,0,0,0,0,11879,null,null,null,null,null,null,null,null,null,null,null,null,null,null,null,null,null,null,null,null,null,null,null,null,null,null,null,null,null,null,null,7844,"FCE3390-26-03-2023"]
[{"$f":"IFERROR(VLOOKUP(C188,#REF!,9,FALSE),\"\")","v":""},{"$f":"C188&COUNTIF($C$2:C188,C188)","v":"FCV11721"},"FCV1172",null,null,2,9069.4,"2023-03-26",131,"2023-04-11",9069.4,0,0,0,0,0,9069.4,null,null,null,null,null,null,null,null,null,null,null,null,null,null,null,null,null,null,null,null,null,null,null,null,null,null,null,null,null,null,null,9069.4,"FCV1172-26-03-2023"]
[{"$f":"IFERROR(VLOOKUP(C189,#REF!,9,FALSE),\"\")","v":""},{"$f":"C189&COUNTIF($C$2:C189,C189)","v":"FCF26131"},"FCF2613",null,null,1,4476.59,"2023-03-26",131,"2023-04-11",4356.59,120,0,0,0,0,4476.59,null,null,null,null,null,null,null,null,null,null,null,null,null,null,null,null,null,null,null,null,null,null,null,null,null,null,null,null,null,null,null,4356.59,"FCF2613-26-03-2023"]
[{"$f":"IFERROR(VLOOKUP(C190,#REF!,9,FALSE),\"\")","v":""},{"$f":"C190&COUNTIF($C$2:C190,C190)","v":"FCU11302"},"FCU1130",null,null,1,10200,"2023-03-26",131,"2023-04-11",10200,0,0,0,"shared folder",0,10200,null,null,null,null,null,null,null,null,null,null,null,null,null,null,null,null,null,null,null,null,null,null,null,null,null,null,null,null,null,null,null,10200,"FCU1130-26-03-2023"]
[{"$f":"IFERROR(VLOOKUP(C191,#REF!,9,FALSE),\"\")","v":""},{"$f":"C191&COUNTIF($C$2:C191,C191)","v":"FCS29191"},"FCS2919",null,null,1,3610.08,"2023-03-26",131,"2023-05-07",3610.08,0,0,0,0,0,3610.08,null,null,null,null,null,null,null,null,null,null,null,null,null,null,null,null,null,null,null,null,null,null,null,null,null,null,null,null,null,null,null,3610.08,"FCS2919-26-03-2023"]
[{"$f":"IFERROR(VLOOKUP(C192,#REF!,9,FALSE),\"\")","v":""},{"$f":"C192&COUNTIF($C$2:C192,C192)","v":"FCP22801"},"FCP2280",null,null,2,18639.349999999999,"2023-03-26",131,"2023-05-11",18639.349999999999,0,0,0,0,0,18639.349999999999,null,null,null,null,null,null,null,null,null,null,null,null,null,null,null,null,null,null,null,null,null,null,null,null,null,null,null,null,null,null,null,18639.349999999999,"FCP2280-26-03-2023"]
[{"$f":"IFERROR(VLOOKUP(C193,#REF!,9,FALSE),\"\")","v":""},{"$f":"C193&COUNTIF($C$2:C193,C193)","v":"FCS29181"},"FCS2918",null,null,1,27158.7,"2023-03-26",131,"2023-05-03",26813.7,345,0,0,0,0,27158.7,null,null,null,null,null,null,null,null,null,null,null,null,null,null,null,null,null,null,null,null,null,null,null,null,null,null,null,null,null,null,null,26813.7,"FCS2918-26-03-2023"]
[{"$f":"IFERROR(VLOOKUP(C194,#REF!,9,FALSE),\"\")","v":""},{"$f":"C194&COUNTIF($C$2:C194,C194)","v":"FCP17201"},"FCP1720",null,null,9,45708.49,"2023-03-26",{"$f":"+TODAY()-H194","v":131},"2023-05-07",45708.49,0,0,0,0,0,45708.49,null,null,null,null,null,null,null,null,null,null,null,null,null,null,null,null,null,null,null,null,null,null,null,null,null,null,null,null,null,null,null,45708.49,"FCP1720-26-03-2023"]
[{"$f":"IFERROR(VLOOKUP(C195,#REF!,9,FALSE),\"\")","v":""},{"$f":"C195&COUNTIF($C$2:C195,C195)","v":"FCU19901"},"FCU1990",null,null,4,48955.95,"2023-03-26",131,"2023-05-15",48740.95,215,0,0,"Price Difference",{"$f":"+G195-K195-L195-M195-N195","v":0},{"$f":"+G195-R195-T195-V195-X195-Z195-AB195-AD195-AF195-AH195-AJ195-AL195-AN195-AP195-AT195-AV195","v":48955.95},null,null,null,null,null,null,null,null,null,null,null,null,null,null,null,null,null,null,null,null,null,null,null,null,null,null,null,null,null,null,null,{"$f":"G195-(L195++R195+T195+V195+X195+Z195+AB195+AD195+AF195+AH195+AJ195+AL195+AN195+AP195+AR195)","v":48740.95},{"$f":"CONCATENATE(C195,\"-\",TEXT(H195,\"DD-MM-YYYY\"))","v":"FCU1990-26-03-2023"}]
[{"$f":"IFERROR(VLOOKUP(C196,#REF!,9,FALSE),\"\")","v":""},{"$f":"C196&COUNTIF($C$2:C196,C196)","v":"FCC02701"},"FCC0270",null,"advance",19,148400,"2023-03-26",131,"2023-04-13",145126.34,3273.6600000000035,0,0,0,0,148400,null,null,null,null,null,null,null,null,null,null,null,null,null,null,null,null,null,null,null,null,null,null,null,null,null,null,null,null,null,null,null,145126.34,"FCC0270-26-03-2023"]
[{"$f":"IFERROR(VLOOKUP(C197,#REF!,9,FALSE),\"\")","v":""},{"$f":"C197&COUNTIF($C$2:C197,C197)","v":"FCQ09801"},"FCQ0980",null,null,1,25000,"2023-03-26",131,"2023-05-08",25000,0,0,0,0,0,25000,null,null,null,null,null,null,null,null,null,null,null,null,null,null,null,null,null,null,null,null,null,null,null,null,null,null,null,null,null,null,null,25000,"FCQ0980-26-03-2023"]
[{"$f":"IFERROR(VLOOKUP(C198,#REF!,9,FALSE),\"\")","v":""},{"$f":"C198&COUNTIF($C$2:C198,C198)","v":"FCL32101"},"FCL3210",null,null,3,56460,"2023-03-26",131,"2023-05-08",56460,0,0,0,0,0,56460,null,null,null,null,null,null,null,null,null,null,null,null,null,null,null,null,null,null,null,null,null,null,null,null,null,null,null,null,null,null,null,56460,"FCL3210-26-03-2023"]
[{"$f":"IFERROR(VLOOKUP(C199,#REF!,9,FALSE),\"\")","v":""},{"$f":"C199&COUNTIF($C$2:C199,C199)","v":"FCC91461"},"FCC9146",null,null,1,20508.52,"2023-03-26",131,"2023-05-09",20508.52,0,0,0,0,0,20508.52,null,null,null,null,null,null,null,null,null,null,null,null,null,null,null,null,null,null,null,null,null,null,null,null,null,null,null,null,null,null,null,20508.52,"FCC9146-26-03-2023"]
[{"$f":"IFERROR(VLOOKUP(C200,#REF!,9,FALSE),\"\")","v":""},{"$f":"C200&COUNTIF($C$2:C200,C200)","v":"FCC01401"},"FCC0140",null,null,12,133495.66,"2023-03-26",131,"2023-05-01",132261,6.0000000005629772E-2,1234.3,0,0,0.29999999999790816,133495.66,null,null,null,null,null,null,null,null,null,null,null,null,null,null,null,null,null,null,null,null,null,null,null,null,null,null,null,null,null,null,null,133495.6,"FCC0140-26-03-2023"]
[{"$f":"IFERROR(VLOOKUP(C201,#REF!,9,FALSE),\"\")","v":""},{"$f":"C201&COUNTIF($C$2:C201,C201)","v":"FCC03801"},"FCC0380",null,null,24,464474.5,"2023-03-26",131,"2023-05-09",458672.38,2301.6399999999958,3500,0,0,0.47999999999956344,464474.5,null,null,null,null,null,null,null,null,null,null,null,null,null,null,null,null,null,null,null,null,null,null,null,null,null,null,null,null,null,null,null,462172.86,"FCC0380-26-03-2023"]
[{"$f":"IFERROR(VLOOKUP(C202,#REF!,9,FALSE),\"\")","v":""},{"$f":"C202&COUNTIF($C$2:C202,C202)","v":"FCE00941"},"FCE0094",null,null,1,2615,"2023-03-27",130,"2023-04-11",2100,515,0,0,0,0,2615,null,null,null,null,null,null,null,null,null,null,null,null,null,null,null,null,null,null,null,null,null,null,null,null,null,null,null,null,null,null,null,2100,"FCE0094-27-03-2023"]
[{"$f":"IFERROR(VLOOKUP(C203,#REF!,9,FALSE),\"\")","v":""},{"$f":"C203&COUNTIF($C$2:C203,C203)","v":"FCS22601"},"FCS2260",null,null,12,37727,"2023-03-27",130,"2023-05-01",26810,10916.599999999999,0,0,"corrected amount as provicer's statement",0,37727,null,null,null,null,null,null,null,null,null,null,null,null,null,null,null,null,null,null,null,null,null,null,null,null,null,null,null,null,null,null,null,26810.400000000001,"FCS2260-27-03-2023"]
[{"$f":"IFERROR(VLOOKUP(C204,#REF!,9,FALSE),\"\")","v":""},{"$f":"C204&COUNTIF($C$2:C204,C204)","v":"FCN31431"},"FCN3143",null,null,5,25919.5,"2023-03-27",130,"2023-04-30",25795.84,123.65999999999985,0,0,"rejection report ",0,25919.5,null,null,null,null,null,null,null,null,null,null,null,null,null,null,null,null,null,null,null,null,null,null,null,null,null,null,null,null,null,null,null,25795.84,"FCN3143-27-03-2023"]
[{"$f":"IFERROR(VLOOKUP(C205,#REF!,9,FALSE),\"\")","v":""},{"$f":"C205&COUNTIF($C$2:C205,C205)","v":"FCC16601"},"FCC1660",null,"advance",50,442587.13,"2023-03-27",130,"2023-05-17",426372.79,5766.7800000000261,10447.56,0,"rejection report ",0,442587.13,null,null,null,null,null,null,null,null,null,null,null,null,null,null,null,null,null,null,null,null,null,null,null,null,null,null,null,null,null,null,null,436820.35,"FCC1660-27-03-2023"]
[{"$f":"IFERROR(VLOOKUP(C206,#REF!,9,FALSE),\"\")","v":""},{"$f":"C206&COUNTIF($C$2:C206,C206)","v":"FCC20901"},"FCC2090",null,"advance",3,47042.42,"2023-03-27",130,"2023-04-30",45474.42,1568,0,0,"rejection report(new) ",0,47042.42,null,null,null,null,null,null,null,null,null,null,null,null,null,null,null,null,null,null,null,null,null,null,null,null,null,null,null,null,null,null,null,45474.42,"FCC2090-27-03-2023"]
[{"$f":"IFERROR(VLOOKUP(C207,#REF!,9,FALSE),\"\")","v":""},{"$f":"C207&COUNTIF($C$2:C207,C207)","v":"FCC22001"},"FCC2200",null,null,1,6500,"2023-03-27",130,"2023-04-30",4550,1950,0,0,"rejection report(new) ",0,6500,null,null,null,null,null,null,null,null,null,null,null,null,null,null,null,null,null,null,null,null,null,null,null,null,null,null,null,null,null,null,null,4550,"FCC2200-27-03-2023"]
[{"$f":"IFERROR(VLOOKUP(C208,#REF!,9,FALSE),\"\")","v":""},{"$f":"C208&COUNTIF($C$2:C208,C208)","v":"fcc91951"},"fcc9195",null,null,6,66753.91,"2023-03-27",130,"2023-04-30",66753.91,-9.9999999947613105E-3,0,0,0,0,66753.91,null,null,null,null,null,null,null,null,null,null,null,null,null,null,null,null,null,null,null,null,null,null,null,null,null,null,null,null,null,null,null,66753.919999999998,"fcc9195-27-03-2023"]
[{"$f":"IFERROR(VLOOKUP(C209,#REF!,9,FALSE),\"\")","v":""},{"$f":"C209&COUNTIF($C$2:C209,C209)","v":"FCC91731"},"FCC9173",null,null,1,6000,"2023-03-27",130,"2023-05-11",6000,0,0,0,0,0,6000,null,null,null,null,null,null,null,null,null,null,null,null,null,null,null,null,null,null,null,null,null,null,null,null,null,null,null,null,null,null,null,6000,"FCC9173-27-03-2023"]
[{"$f":"IFERROR(VLOOKUP(C210,#REF!,9,FALSE),\"\")","v":""},{"$f":"C210&COUNTIF($C$2:C210,C210)","v":"FCC35701"},"FCC3570",null,"advance",6,17774.689999999999,"2023-03-28",129,"2023-05-01",17669.599999999999,104.99999999999682,0,0,0,0,17774.689999999999,null,null,null,null,null,null,null,null,null,null,null,null,null,null,null,null,null,null,null,null,null,null,null,null,null,null,null,null,null,null,null,17669.690000000002,"FCC3570-28-03-2023"]
[{"$f":"IFERROR(VLOOKUP(C211,#REF!,9,FALSE),\"\")","v":""},{"$f":"C211&COUNTIF($C$2:C211,C211)","v":"FCG30921"},"FCG3092",null,null,10,36973.79,"2023-03-28",129,"2023-04-11",34550.29,2423.5,0,0,0,0,36973.79,null,null,null,null,null,null,null,null,null,null,null,null,null,null,null,null,null,null,null,null,null,null,null,null,null,null,null,null,null,null,null,34550.29,"FCG3092-28-03-2023"]
[{"$f":"IFERROR(VLOOKUP(C212,#REF!,9,FALSE),\"\")","v":""},{"$f":"C212&COUNTIF($C$2:C212,C212)","v":"FCN31441"},"FCN3144",null,null,13,150196.29999999999,"2023-03-28",129,"2023-04-12",150166.29999999999,30,0,0,0,0,150196.29999999999,null,null,null,null,null,null,null,null,null,null,null,null,null,null,null,null,null,null,null,null,null,null,null,null,null,null,null,null,null,null,null,150166.29999999999,"FCN3144-28-03-2023"]
[{"$f":"IFERROR(VLOOKUP(C213,#REF!,9,FALSE),\"\")","v":""},{"$f":"C213&COUNTIF($C$2:C213,C213)","v":"FCY27062"},"FCY2706",null,null,1,7000,"2023-03-28",129,"2023-04-11",7000,0,0,0,0,0,7000,null,null,null,null,null,null,null,null,null,null,null,null,null,null,null,null,null,null,null,null,null,null,null,null,null,null,null,null,null,null,null,7000,"FCY2706-28-03-2023"]
[{"$f":"IFERROR(VLOOKUP(C214,#REF!,9,FALSE),\"\")","v":""},{"$f":"C214&COUNTIF($C$2:C214,C214)","v":"FCN08901"},"FCN0890",null,null,4,36192.83,"2023-03-28",129,"2023-05-08",36192,0.56999999999970896,0,0,0,0,36192.83,null,null,null,null,null,null,null,null,null,null,null,null,null,null,null,null,null,null,null,null,null,null,null,null,null,null,null,null,null,null,null,36192.26,"FCN0890-28-03-2023"]
[{"$f":"IFERROR(VLOOKUP(C215,#REF!,9,FALSE),\"\")","v":""},{"$f":"C215&COUNTIF($C$2:C215,C215)","v":"FCD30541"},"FCD3054",null,null,9,47961,"2023-03-28",129,"2023-05-03",44514,1,3446,0,"CORRECTED AMOUNT ACCORDING PHYSICAL CLAIMS",0,47961,null,null,null,null,null,null,null,null,null,null,null,null,null,null,null,null,null,null,null,null,null,null,null,null,null,null,null,null,null,null,null,47960,"FCD3054-28-03-2023"]
[{"$f":"IFERROR(VLOOKUP(C216,#REF!,9,FALSE),\"\")","v":""},{"$f":"C216&COUNTIF($C$2:C216,C216)","v":"FCC03901"},"FCC0390",null,null,1,3763.95,"2023-03-28",129,"2023-05-07",3763.95,0,0,0,0,0,3763.95,null,null,null,null,null,null,null,null,null,null,null,null,null,null,null,null,null,null,null,null,null,null,null,null,null,null,null,null,null,null,null,3763.95,"FCC0390-28-03-2023"]
[{"$f":"IFERROR(VLOOKUP(C217,#REF!,9,FALSE),\"\")","v":""},{"$f":"C217&COUNTIF($C$2:C217,C217)","v":"FCC91882"},"FCC9188",null,null,1,8077.5,"2023-03-28",129,"2023-04-12",5850,2227.5,0,0,0,0,8077.5,null,null,null,null,null,null,null,null,null,null,null,null,null,null,null,null,null,null,null,null,null,null,null,null,null,null,null,null,null,null,null,5850,"FCC9188-28-03-2023"]
[{"$f":"IFERROR(VLOOKUP(C218,#REF!,9,FALSE),\"\")","v":""},{"$f":"C218&COUNTIF($C$2:C218,C218)","v":"FCC91961"},"FCC9196",null,null,3,21027.14,"2023-03-29",128,"2023-04-11",17472.03,3465.0099999999984,0,0,0,90.100000000002183,21027.14,null,null,null,null,null,null,null,null,null,null,null,null,null,null,null,null,null,null,null,null,null,null,null,null,null,null,null,null,null,null,null,17562.13,"FCC9196-29-03-2023"]
[{"$f":"IFERROR(VLOOKUP(C219,#REF!,9,FALSE),\"\")","v":""},{"$f":"C219&COUNTIF($C$2:C219,C219)","v":"FCC25802"},"FCC2580",null,null,4,19513,"2023-03-29",128,"2023-04-11",19513,0,0,0,0,0,19513,null,null,null,null,null,null,null,null,null,null,null,null,null,null,null,null,null,null,null,null,null,null,null,null,null,null,null,null,null,null,null,19513,"FCC2580-29-03-2023"]
[{"$f":"IFERROR(VLOOKUP(C220,#REF!,9,FALSE),\"\")","v":""},{"$f":"C220&COUNTIF($C$2:C220,C220)","v":"FCX12001"},"FCX1200",null,null,17,165243.04,"2023-03-29",128,"2023-05-03",164050.6,1192.4100000000035,0,0,0,0,165243.04,null,null,null,null,null,null,null,null,null,null,null,null,null,null,null,null,null,null,null,null,null,null,null,null,null,null,null,null,null,null,null,164050.63,"FCX1200-29-03-2023"]
[{"$f":"IFERROR(VLOOKUP(C221,#REF!,9,FALSE),\"\")","v":""},{"$f":"C221&COUNTIF($C$2:C221,C221)","v":"FCZ27291"},"FCZ2729",null,null,10,62362.51,"2023-03-29",128,"2023-04-27",55931.51,6431,0,0,0,0,62362.51,null,null,null,null,null,null,null,null,null,null,null,null,null,null,null,null,null,null,null,null,null,null,null,null,null,null,null,null,null,null,null,55931.51,"FCZ2729-29-03-2023"]
[{"$f":"IFERROR(VLOOKUP(C222,#REF!,9,FALSE),\"\")","v":""},{"$f":"C222&COUNTIF($C$2:C222,C222)","v":"FCX13101"},"FCX1310",null,null,1,3090,"2023-03-29",128,"2023-04-11",3090,0,0,0,0,0,3090,null,null,null,null,null,null,null,null,null,null,null,null,null,null,null,null,null,null,null,null,null,null,null,null,null,null,null,null,null,null,null,3090,"FCX1310-29-03-2023"]
[{"$f":"IFERROR(VLOOKUP(C223,#REF!,9,FALSE),\"\")","v":""},{"$f":"C223&COUNTIF($C$2:C223,C223)","v":"FCC05802"},"FCC0580",null,"advance",85,1338428,"2023-03-29",128,"2023-05-01",1233791,28225.689999999944,76411,0,"discount diff at claim (10/33/37) + rejection sheet",0,1338428,null,null,null,null,null,null,null,null,null,null,null,null,null,null,null,null,null,null,null,null,null,null,null,null,null,null,null,null,null,null,null,1310202.31,"FCC0580-29-03-2023"]
[{"$f":"IFERROR(VLOOKUP(C224,#REF!,9,FALSE),\"\")","v":""},{"$f":"C224&COUNTIF($C$2:C224,C224)","v":"FCC04101"},"FCC0410",null,null,7,30077,"2023-03-30",127,"2023-05-02",27957,1850,270,0,0,0,30077,null,null,null,null,null,null,null,null,null,null,null,null,null,null,null,null,null,null,null,null,null,null,null,null,null,null,null,null,null,null,null,28227,"FCC0410-30-03-2023"]
[{"$f":"IFERROR(VLOOKUP(C225,#REF!,9,FALSE),\"\")","v":""},{"$f":"C225&COUNTIF($C$2:C225,C225)","v":"FCF23103"},"FCF2310",null,null,2,5279.43,"2023-03-30",127,"2023-05-07",5279.43,0,0,0,0,0,5279.43,null,null,null,null,null,null,null,null,null,null,null,null,null,null,null,null,null,null,null,null,null,null,null,null,null,null,null,null,null,null,null,5279.43,"FCF2310-30-03-2023"]
[{"$f":"IFERROR(VLOOKUP(C226,#REF!,9,FALSE),\"\")","v":""},{"$f":"C226&COUNTIF($C$2:C226,C226)","v":"FCF26171"},"FCF2617",null,null,10,139891.21,"2023-03-30",127,"2023-04-11",139891.21,0,0,0,0,0,139891.21,null,null,null,null,null,null,null,null,null,null,null,null,null,null,null,null,null,null,null,null,null,null,null,null,null,null,null,null,null,null,null,139891.21,"FCF2617-30-03-2023"]
[{"$f":"IFERROR(VLOOKUP(C227,#REF!,9,FALSE),\"\")","v":""},{"$f":"C227&COUNTIF($C$2:C227,C227)","v":"FCX12601"},"FCX1260",null,null,2,12772,"2023-03-30",127,"2023-04-27",12772,0,0,0,0,0,12772,null,null,null,null,null,null,null,null,null,null,null,null,null,null,null,null,null,null,null,null,null,null,null,null,null,null,null,null,null,null,null,12772,"FCX1260-30-03-2023"]
[{"$f":"IFERROR(VLOOKUP(C228,#REF!,9,FALSE),\"\")","v":""},{"$f":"C228&COUNTIF($C$2:C228,C228)","v":"FCZ17801"},"FCZ1780",null,null,8,7411.6,"2023-03-30",127,"2023-05-16",7312.61,98.990000000000691,0,0,0,0,7411.6,null,null,null,null,null,null,null,null,null,null,null,null,null,null,null,null,null,null,null,null,null,null,null,null,null,null,null,null,null,null,null,7312.61,"FCZ1780-30-03-2023"]
[{"$f":"IFERROR(VLOOKUP(C229,#REF!,9,FALSE),\"\")","v":""},{"$f":"C229&COUNTIF($C$2:C229,C229)","v":"FCC91381"},"FCC9138",null,null,6,23979,"2023-03-30",127,"2023-05-16",23979.3,-0.2999999999992724,0,0,0,0,23979,null,null,null,null,null,null,null,null,null,null,null,null,null,null,null,null,null,null,null,null,null,null,null,null,null,null,null,null,null,null,null,23979.3,"FCC9138-30-03-2023"]
[null,null,null,null,null,null,{"$f":"SUM(G2:G229)","v":63365116.229999989},null,null,null,null,{"$f":"SUM(L2:L229)","v":1314361.9221605656},null,null,null,null,null,{"$f":"SUM(R2:R229)","v":0},null,{"$f":"SUM(T2:T229)","v":0},null,{"$f":"SUM(V2:V229)","v":0},null,{"$f":"SUM(X2:X229)","v":0},null,{"$f":"SUM(Z2:Z229)","v":0},null,{"$f":"SUM(AB2:AB229)","v":0},null,{"$f":"SUM(AD2:AD229)","v":0},null,{"$f":"SUM(AF2:AF229)","v":0},null,{"$f":"SUM(AH2:AH229)","v":0},null,{"$f":"SUM(AJ2:AJ229)","v":0},null,{"$f":"SUM(AL2:AL229)","v":0},null,{"$f":"SUM(AN2:AN229)","v":0},null,{"$f":"SUM(AP2:AP229)","v":0},null,{"$f":"SUM(AR2:AR229)","v":0},null,{"$f":"SUM(AT2:AT229)","v":0},null,{"$f":"SUM(AV2:AV229)","v":0},null,"-00-01-1900"]
[]
[]
[]
[]
[]
[null,null,"Totalsumb",null,null,null,{"$f":"D236-D240","v":0}]
[null,null,"TotalPaid"]
[null,null,"TotalRejected",null,null,null,{"$f":"D237+G236","v":0}]
[null,null,"TotalTax"]
[null,null,"TotalPaid-Rejecteed-Tax"]

{"sheet":"Month 05-2023","index":1,"n_rows":299,"n_cols":50,"rows_kept":299,"cut":false,"hidden":false,"merged":[]}
["Status","Helper","Provider Code",null,"BATCH NO:","Number of claims","AMOUNT","Date Received ","TAT","Date posting","Paid","Rejected","H.H","Pending","Comment","Rev Diff","Pay Diff","Taxes","Checks no.","Amount checks","Checks no.","Amount checks","Checks no.","Amount checks","Checks no.","Amount checks","Checks no.","Amount checks","Checks no.","Amount checks","Checks no.","Amount checks","Checks no.","Amount checks","Checks no.","Amount checks","Checks no.","Amount checks","Checks no.","Amount checks","Checks no.","Amount checks","Checks no.","Amount checks","Checks no.","Amount checks","Checks no.","Amount checks","TAT",{"$f":"CONCATENATE(C1,\"-\",TEXT(H1,\"DD-MM-YYYY\"))","v":"Provider Code-Date Received "}]
[{"$f":"IFERROR(VLOOKUP(C2,#REF!,9,FALSE),\"\")","v":""},{"$f":"C2&COUNTIF($C$2:C2,C2)","v":"FCC91731"},"FCC9173",null,null,1,6000,"2023-05-01",{"$f":"+TODAY()-H2","v":95},"2023-05-29",6000,0,0,0,0,{"$f":"+G2-K2-L2-M2-N2","v":0},{"$f":"+G2-R2-T2-V2-X2-Z2-AB2-AD2-AF2-AH2-AJ2-AL2-AN2-AP2-AT2-AV2","v":6000},null,null,null,null,null,null,null,null,null,null,null,null,null,null,null,null,null,null,null,null,null,null,null,null,null,null,null,null,null,null,null,{"$f":"G2-(L2++R2+T2+V2+X2+Z2+AB2+AD2+AF2+AH2+AJ2+AL2+AN2+AP2+AR2)","v":6000},"FCC9173-01-05-2023"]
[{"$f":"IFERROR(VLOOKUP(C3,#REF!,9,FALSE),\"\")","v":""},{"$f":"C3&COUNTIF($C$2:C3,C3)","v":"fcc21501"},"fcc2150",null,null,9,125132.8,"2023-05-01",95,"2023-05-29",119151,5981.7400000000052,0,0,0,0,125132.8,null,null,null,null,null,null,null,null,null,null,null,null,null,null,null,null,null,null,null,null,null,null,null,null,null,null,null,null,null,null,null,{"$f":"G3-(L3++R3+T3+V3+X3+Z3+AB3+AD3+AF3+AH3+AJ3+AL3+AN3+AP3+AR3)","v":119151.06},{"$f":"CONCATENATE(C3,\"-\",TEXT(H3,\"DD-MM-YYYY\"))","v":"fcc2150-01-05-2023"}]
[{"$f":"IFERROR(VLOOKUP(C4,#REF!,9,FALSE),\"\")","v":""},{"$f":"C4&COUNTIF($C$2:C4,C4)","v":"FCC30601"},"FCC3060",null,null,2,19500,"2023-05-01",95,"2023-05-29",19500,0,0,0,0,0,19500,null,null,null,null,null,null,null,null,null,null,null,null,null,null,null,null,null,null,null,null,null,null,null,null,null,null,null,null,null,null,null,19500,"FCC3060-01-05-2023"]
[{"$f":"IFERROR(VLOOKUP(C5,#REF!,9,FALSE),\"\")","v":""},{"$f":"C5&COUNTIF($C$2:C5,C5)","v":"FCF23101"},"FCF2310",null,null,2,4979.29,"2023-05-01",95,"2023-05-29",4979.29,0,0,0,0,0,4979.29,null,null,null,null,null,null,null,null,null,null,null,null,null,null,null,null,null,null,null,null,null,null,null,null,null,null,null,null,null,null,null,4979.29,"FCF2310-01-05-2023"]
[{"$f":"IFERROR(VLOOKUP(C6,#REF!,9,FALSE),\"\")","v":""},{"$f":"C6&COUNTIF($C$2:C6,C6)","v":"FCN31421"},"FCN3142",null,null,4,18401.900000000001,"2023-05-01",95,"2023-05-29",16545.7,1856.1800000000003,0,0,0,0,18401.900000000001,null,null,null,null,null,null,null,null,null,null,null,null,null,null,null,null,null,null,null,null,null,null,null,null,null,null,null,null,null,null,null,16545.72,"FCN3142-01-05-2023"]
[{"$f":"IFERROR(VLOOKUP(C7,#REF!,9,FALSE),\"\")","v":""},{"$f":"C7&COUNTIF($C$2:C7,C7)","v":"FCC21801"},"FCC2180",null,"advance",81,2422946.71,"2023-05-01",95,"2023-06-08",2305974.83,90359.789999999892,26612.09,0,"NEW",-3.637978807091713E-12,2422946.71,null,null,null,null,null,null,null,null,null,null,null,null,null,null,null,null,null,null,null,null,null,null,null,null,null,null,null,null,null,null,null,2332586.92,"FCC2180-01-05-2023"]
[{"$f":"IFERROR(VLOOKUP(C8,#REF!,9,FALSE),\"\")","v":""},{"$f":"C8&COUNTIF($C$2:C8,C8)","v":"FCC91661"},"FCC9166",null,null,1,10400,"2023-05-02",94,"2023-05-31",10400,0,0,0,0,{"$f":"+G8-K8-L8-M8-N8","v":0},{"$f":"+G8-R8-T8-V8-X8-Z8-AB8-AD8-AF8-AH8-AJ8-AL8-AN8-AP8-AT8-AV8","v":10400},null,null,null,null,null,null,null,null,null,null,null,null,null,null,null,null,null,null,null,null,null,null,null,null,null,null,null,null,null,null,null,10400,"FCC9166-02-05-2023"]
[{"$f":"IFERROR(VLOOKUP(C9,#REF!,9,FALSE),\"\")","v":""},{"$f":"C9&COUNTIF($C$2:C9,C9)","v":"FCX28001"},"FCX2800",null,null,3,9323,"2023-05-02",94,"2023-05-29",9322.6,0.3999999999996362,0,0,0,0,9323,null,null,null,null,null,null,null,null,null,null,null,null,null,null,null,null,null,null,null,null,null,null,null,null,null,null,null,null,null,null,null,9322.6,"FCX2800-02-05-2023"]
[{"$f":"IFERROR(VLOOKUP(C10,#REF!,9,FALSE),\"\")","v":""},{"$f":"C10&COUNTIF($C$2:C10,C10)","v":"FCC91821"},"FCC9182",null,null,1,4121.25,"2023-05-02",94,"2023-05-29",4121.25,0,0,0,0,0,4121.25,null,null,null,null,null,null,null,null,null,null,null,null,null,null,null,null,null,null,null,null,null,null,null,null,null,null,null,null,null,null,null,4121.25,"FCC9182-02-05-2023"]
[{"$f":"IFERROR(VLOOKUP(C11,#REF!,9,FALSE),\"\")","v":""},{"$f":"C11&COUNTIF($C$2:C11,C11)","v":"FCC15901"},"FCC1590",null,null,4,15490,"2023-05-03",93,"2023-05-29",15490,0,0,0,0,0,15490,null,null,null,null,null,null,null,null,null,null,null,null,null,null,null,null,null,null,null,null,null,null,null,null,null,null,null,null,null,null,null,15490,"FCC1590-03-05-2023"]
[{"$f":"IFERROR(VLOOKUP(C12,#REF!,9,FALSE),\"\")","v":""},{"$f":"C12&COUNTIF($C$2:C12,C12)","v":"FCC02001"},"FCC0200",null,"advance",22,244735,"2023-05-03",93,"2023-05-29",201789.6,12504.099999999995,30441.3,0,0,0,244735,null,null,null,null,null,null,null,null,null,null,null,null,null,null,null,null,null,null,null,null,null,null,null,null,null,null,null,null,null,null,null,232230.9,"FCC0200-03-05-2023"]
[{"$f":"IFERROR(VLOOKUP(C13,#REF!,9,FALSE),\"\")","v":""},{"$f":"C13&COUNTIF($C$2:C13,C13)","v":"FCB28001"},"FCB2800",null,null,2,20000,"2023-05-03",93,"2023-06-21",19935.3,64.600000000002183,0,0,0,0,20000,null,null,null,null,null,null,null,null,null,null,null,null,null,null,null,null,null,null,null,null,null,null,null,null,null,null,null,null,null,null,null,19935.399999999998,"FCB2800-03-05-2023"]
[{"$f":"IFERROR(VLOOKUP(C14,#REF!,9,FALSE),\"\")","v":""},{"$f":"C14&COUNTIF($C$2:C14,C14)","v":"FCC91451"},"FCC9145",null,null,3,13835,"2023-05-03",93,"2023-06-11",13535.8,299.13999999999942,0,0,0,0,13835,null,null,null,null,null,null,null,null,null,null,null,null,null,null,null,null,null,null,null,null,null,null,null,null,null,null,null,null,null,null,null,13535.86,"FCC9145-03-05-2023"]
[{"$f":"IFERROR(VLOOKUP(C15,#REF!,9,FALSE),\"\")","v":""},{"$f":"C15&COUNTIF($C$2:C15,C15)","v":"FCK34201"},"FCK3420",null,"advance",24,228844.46,"2023-05-07",89,"2023-05-28",227449.3,2395.0799999999945,0,0,0,-999.91999999999098,228844.46,null,null,null,null,null,null,null,null,null,null,null,null,null,null,null,null,null,null,null,null,null,null,null,null,null,null,null,null,null,null,null,226449.38,"FCK3420-07-05-2023"]
[{"$f":"IFERROR(VLOOKUP(C16,#REF!,9,FALSE),\"\")","v":""},{"$f":"C16&COUNTIF($C$2:C16,C16)","v":"FCF26101"},"FCF2610",null,null,5,26138.7,"2023-05-07",89,"2023-06-11",25338.49,800.20999999999913,0,0,0,0,26138.7,null,null,null,null,null,null,null,null,null,null,null,null,null,null,null,null,null,null,null,null,null,null,null,null,null,null,null,null,null,null,null,25338.49,"FCF2610-07-05-2023"]
[{"$f":"IFERROR(VLOOKUP(C17,#REF!,9,FALSE),\"\")","v":""},{"$f":"C17&COUNTIF($C$2:C17,C17)","v":"FCC91551"},"FCC9155",null,null,3,117658.63,"2023-05-07",89,"2023-06-06",117658.63,0,0,0,0,0,117658.63,null,null,null,null,null,null,null,null,null,null,null,null,null,null,null,null,null,null,null,null,null,null,null,null,null,null,null,null,null,null,null,117658.63,"FCC9155-07-05-2023"]
[{"$f":"IFERROR(VLOOKUP(C18,#REF!,9,FALSE),\"\")","v":""},{"$f":"C18&COUNTIF($C$2:C18,C18)","v":"FCC04001"},"FCC0400",null,"advance",136,3461908.57,"2023-05-07",89,"2023-06-19",3403396.42,9866.4100000000908,48647.15,0,"Discount diff (S.F)",0,3461908.57,null,null,null,null,null,null,null,null,null,null,null,null,null,null,null,null,null,null,null,null,null,null,null,null,null,null,null,null,null,null,null,3452042.1599999997,"FCC0400-07-05-2023"]
[{"$f":"IFERROR(VLOOKUP(C19,#REF!,9,FALSE),\"\")","v":""},{"$f":"C19&COUNTIF($C$2:C19,C19)","v":"FCX12301"},"FCX1230",null,null,1,2254.88,"2023-05-07",89,"2023-06-11",2253.98,0.90000000000009095,0,0,0,0,2254.88,null,null,null,null,null,null,null,null,null,null,null,null,null,null,null,null,null,null,null,null,null,null,null,null,null,null,null,null,null,null,null,2253.98,"FCX1230-07-05-2023"]
[{"$f":"IFERROR(VLOOKUP(C20,#REF!,9,FALSE),\"\")","v":""},{"$f":"C20&COUNTIF($C$2:C20,C20)","v":"FCC03001"},"FCC0300",null,"advance",133,4472526.47,"2023-05-07",89,"2023-06-12",3995608.92,20553.4099999998,133994.9,322369.24,0,0,4472526.47,null,null,null,null,null,null,null,null,null,null,null,null,null,null,null,null,null,null,null,null,null,null,null,null,null,null,null,null,null,null,null,4451973.0599999996,"FCC0300-07-05-2023"]
[{"$f":"IFERROR(VLOOKUP(C21,#REF!,9,FALSE),\"\")","v":""},{"$f":"C21&COUNTIF($C$2:C21,C21)","v":"FCS10601"},"FCS1060",null,null,6,20427.5,"2023-05-07",89,"2023-06-11",15451,135,0,4841.5,0,0,20427.5,null,null,null,null,null,null,null,null,null,null,null,null,null,null,null,null,null,null,null,null,null,null,null,null,null,null,null,null,null,null,null,20292.5,"FCS1060-07-05-2023"]
[{"$f":"IFERROR(VLOOKUP(C22,#REF!,9,FALSE),\"\")","v":""},{"$f":"C22&COUNTIF($C$2:C22,C22)","v":"FCC91981"},"FCC9198",null,"advance",17,509588.73,"2023-05-07",89,"2023-06-18",443239.9,4570.129999999961,0,61778.7,"new rejection report",0,509588.73,null,null,null,null,null,null,null,null,null,null,null,null,null,null,null,null,null,null,null,null,null,null,null,null,null,null,null,null,null,null,null,505018.60000000003,"FCC9198-07-05-2023"]
[{"$f":"IFERROR(VLOOKUP(C23,#REF!,9,FALSE),\"\")","v":""},{"$f":"C23&COUNTIF($C$2:C23,C23)","v":"FCD30501"},"FCD3050",null,null,5,28285,"2023-05-07",89,"2023-06-06",27764.1,520.90000000000146,0,0,0,0,28285,null,null,null,null,null,null,null,null,null,null,null,null,null,null,null,null,null,null,null,null,null,null,null,null,null,null,null,null,null,null,null,27764.1,"FCD3050-07-05-2023"]
[{"$f":"IFERROR(VLOOKUP(C24,#REF!,9,FALSE),\"\")","v":""},{"$f":"C24&COUNTIF($C$2:C24,C24)","v":"FCX34801"},"FCX3480",null,null,2,19710.189999999999,"2023-05-07",89,"2023-06-20",17263.59,2446.5999999999985,0,0,"new rr",0,19710.189999999999,null,null,null,null,null,null,null,null,null,null,null,null,null,null,null,null,null,null,null,null,null,null,null,null,null,null,null,null,null,null,null,17263.59,"FCX3480-07-05-2023"]
[{"$f":"IFERROR(VLOOKUP(C25,#REF!,9,FALSE),\"\")","v":""},{"$f":"C25&COUNTIF($C$2:C25,C25)","v":"FCY27061"},"FCY2706",null,null,6,45609,"2023-05-07",89,"2023-06-08",45409,200,0,0,0,0,45609,null,null,null,null,null,null,null,null,null,null,null,null,null,null,null,null,null,null,null,null,null,null,null,null,null,null,null,null,null,null,null,45409,"FCY2706-07-05-2023"]
[{"$f":"IFERROR(VLOOKUP(C26,#REF!,9,FALSE),\"\")","v":""},{"$f":"C26&COUNTIF($C$2:C26,C26)","v":"FCC33101"},"FCC3310",null,null,4,18586.509999999998,"2023-05-07",89,"2023-07-19",18576.5,20.290000000000873,0,0,0,-10.280000000002474,18586.509999999998,null,null,null,null,null,null,null,null,null,null,null,null,null,null,null,null,null,null,null,null,null,null,null,null,null,null,null,null,null,null,null,18566.219999999998,"FCC3310-07-05-2023"]
[{"$f":"IFERROR(VLOOKUP(C27,#REF!,9,FALSE),\"\")","v":""},{"$f":"C27&COUNTIF($C$2:C27,C27)","v":"FCC01101"},"FCC0110",null,"advance",183,4135253.06,"2023-05-07",89,"2023-06-13",3988995.73,8.7311491370201111E-11,62994.52,83262.81,0,0,4135253.06,null,null,null,null,null,null,null,null,null,null,null,null,null,null,null,null,null,null,null,null,null,null,null,null,null,null,null,null,null,null,null,4135253.06,"FCC0110-07-05-2023"]
[{"$f":"IFERROR(VLOOKUP(C28,#REF!,9,FALSE),\"\")","v":""},{"$f":"C28&COUNTIF($C$2:C28,C28)","v":"FCC01501"},"FCC0150",null,"advance",14,131733,"2023-05-07",89,"2023-05-29",131733,589.85200000000623,0,0,0,-589.85200000000623,131733,null,null,null,null,null,null,null,null,null,null,null,null,null,null,null,null,null,null,null,null,null,null,null,null,null,null,null,null,null,null,null,131143.14799999999,"FCC0150-07-05-2023"]
[{"$f":"IFERROR(VLOOKUP(C29,#REF!,9,FALSE),\"\")","v":""},{"$f":"C29&COUNTIF($C$2:C29,C29)","v":"FCC21802"},"FCC2180",null,"advance",39,925121.19,"2023-05-07",89,"2023-05-31",922081.6,4028.6099999999715,0,0,0,-989.02000000000407,925121.19,null,null,null,null,null,null,null,null,null,null,null,null,null,null,null,null,null,null,null,null,null,null,null,null,null,null,null,null,null,null,null,921092.58,"FCC2180-07-05-2023"]
[{"$f":"IFERROR(VLOOKUP(C30,#REF!,9,FALSE),\"\")","v":""},{"$f":"C30&COUNTIF($C$2:C30,C30)","v":"FCC14101"},"FCC1410",null,"advance",22,378039.59,"2023-05-07",89,"2023-06-14",371373.35,7489.2389300000577,0,0,0,-822.99893000000884,378039.59,null,null,null,null,null,null,null,null,null,null,null,null,null,null,null,null,null,null,null,null,null,null,null,null,null,null,null,null,null,null,null,370550.35106999998,"FCC1410-07-05-2023"]
[{"$f":"IFERROR(VLOOKUP(C31,#REF!,9,FALSE),\"\")","v":""},{"$f":"C31&COUNTIF($C$2:C31,C31)","v":"FCR10131"},"FCR1013",null,null,1,3825,"2023-05-08",88,"2023-07-17",3825,0,0,0,0,0,3825,null,null,null,null,null,null,null,null,null,null,null,null,null,null,null,null,null,null,null,null,null,null,null,null,null,null,null,null,null,null,null,3825,"FCR1013-08-05-2023"]
[{"$f":"IFERROR(VLOOKUP(C32,#REF!,9,FALSE),\"\")","v":""},{"$f":"C32&COUNTIF($C$2:C32,C32)","v":"FCC91931"},"FCC9193",null,null,6,98019.94,"2023-05-08",88,"2023-06-08",98019.94,-2.9999999993378879E-2,0,0,"updated",0,98019.94,null,null,null,null,null,null,null,null,null,null,null,null,null,null,null,null,null,null,null,null,null,null,null,null,null,null,null,null,null,null,null,98019.97,"FCC9193-08-05-2023"]
[{"$f":"IFERROR(VLOOKUP(C33,#REF!,9,FALSE),\"\")","v":""},{"$f":"C33&COUNTIF($C$2:C33,C33)","v":"FCZ18301"},"FCZ1830",null,null,2,8527,"2023-05-08",88,"2023-06-14",8527,0,0,0,0,0,8527,null,null,null,null,null,null,null,null,null,null,null,null,null,null,null,null,null,null,null,null,null,null,null,null,null,null,null,null,null,null,null,8527,"FCZ1830-08-05-2023"]
[{"$f":"IFERROR(VLOOKUP(C34,#REF!,9,FALSE),\"\")","v":""},{"$f":"C34&COUNTIF($C$2:C34,C34)","v":"FCE33901"},"FCE3390",null,null,6,13651,"2023-05-08",88,"2023-06-08",10321,3330,0,0,0,0,13651,null,null,null,null,null,null,null,null,null,null,null,null,null,null,null,null,null,null,null,null,null,null,null,null,null,null,null,null,null,null,null,10321,"FCE3390-08-05-2023"]
[{"$f":"IFERROR(VLOOKUP(C35,#REF!,9,FALSE),\"\")","v":""},{"$f":"C35&COUNTIF($C$2:C35,C35)","v":"FCX26901"},"FCX2690",null,null,6,107065.84,"2023-05-08",88,"2023-07-16",93574.3,13491.539999999994,0,0,0,0,107065.84,null,null,null,null,null,null,null,null,null,null,null,null,null,null,null,null,null,null,null,null,null,null,null,null,null,null,null,null,null,null,null,93574.3,"FCX2690-08-05-2023"]
[{"$f":"IFERROR(VLOOKUP(C36,#REF!,9,FALSE),\"\")","v":""},{"$f":"C36&COUNTIF($C$2:C36,C36)","v":"FCH17901"},"FCH1790",null,"advance",7,151147,"2023-05-08",88,"2023-06-14",127489.02,149.98999999999432,0,23507.99,0,0,151147,null,null,null,null,null,null,null,null,null,null,null,null,null,null,null,null,null,null,null,null,null,null,null,null,null,null,null,null,null,null,null,150997.01,"FCH1790-08-05-2023"]
[{"$f":"IFERROR(VLOOKUP(C37,#REF!,9,FALSE),\"\")","v":""},{"$f":"C37&COUNTIF($C$2:C37,C37)","v":"FCC91691"},"FCC9169",null,null,11,164847.6,"2023-05-08",88,"2023-06-11",156177.20000000001,7403.0499999999956,1267.3,0,0,0,164847.6,null,null,null,null,null,null,null,null,null,null,null,null,null,null,null,null,null,null,null,null,null,null,null,null,null,null,null,null,null,null,null,157444.55000000002,"FCC9169-08-05-2023"]
[{"$f":"IFERROR(VLOOKUP(C38,#REF!,9,FALSE),\"\")","v":""},{"$f":"C38&COUNTIF($C$2:C38,C38)","v":"FCU11501"},"FCU1150",null,null,3,8624.5,"2023-05-08",88,"2023-07-16",8624.5,0,0,0,0,0,8624.5,null,null,null,null,null,null,null,null,null,null,null,null,null,null,null,null,null,null,null,null,null,null,null,null,null,null,null,null,null,null,null,8624.5,"FCU1150-08-05-2023"]
[{"$f":"IFERROR(VLOOKUP(C39,#REF!,9,FALSE),\"\")","v":""},{"$f":"C39&COUNTIF($C$2:C39,C39)","v":"FCC30401"},"FCC3040",null,"advance",30,324933.69,"2023-05-08",88,"2023-05-29",310181,2334.8196299999981,12418.45,0,"new",0,324933.69,null,null,null,null,null,null,null,null,null,null,null,null,null,null,null,null,null,null,null,null,null,null,null,null,null,null,null,null,null,null,null,322598.87037000002,"FCC3040-08-05-2023"]
[{"$f":"IFERROR(VLOOKUP(C40,#REF!,9,FALSE),\"\")","v":""},{"$f":"C40&COUNTIF($C$2:C40,C40)","v":"FCB26301"},"FCB2630",null,null,4,16091.78,"2023-05-08",88,"2023-06-14",16092,-0.37000000000080036,0,0,0,0,16091.78,null,null,null,null,null,null,null,null,null,null,null,null,null,null,null,null,null,null,null,null,null,null,null,null,null,null,null,null,null,null,null,16092.150000000001,"FCB2630-08-05-2023"]
[{"$f":"IFERROR(VLOOKUP(C41,#REF!,9,FALSE),\"\")","v":""},{"$f":"C41&COUNTIF($C$2:C41,C41)","v":"FCC91641"},"FCC9164",null,null,23,156407.24,"2023-05-08",88,"2023-06-13",129840.1,20424.330000000002,6142.81,0,0,-1.7280399333685637E-11,156407.24,null,null,null,null,null,null,null,null,null,null,null,null,null,null,null,null,null,null,null,null,null,null,null,null,null,null,null,null,null,null,null,135982.90999999997,"FCC9164-08-05-2023"]
[{"$f":"IFERROR(VLOOKUP(C42,#REF!,9,FALSE),\"\")","v":""},{"$f":"C42&COUNTIF($C$2:C42,C42)","v":"FCC31101"},"FCC3110",null,"advance+VD",5,64825,"2023-05-08",88,"2023-06-25",58900,5925,0,0,0,0,64825,null,null,null,null,null,null,null,null,null,null,null,null,null,null,null,null,null,null,null,null,null,null,null,null,null,null,null,null,null,null,null,58900,"FCC3110-08-05-2023"]
[{"$f":"IFERROR(VLOOKUP(C43,#REF!,9,FALSE),\"\")","v":""},{"$f":"C43&COUNTIF($C$2:C43,C43)","v":"FCS23401"},"FCS2340",null,null,11,47600,"2023-05-08",88,"2023-05-23",46829,771,0,0,"price differnce",0,47600,null,null,null,null,null,null,null,null,null,null,null,null,null,null,null,null,null,null,null,null,null,null,null,null,null,null,null,null,null,null,null,46829,"FCS2340-08-05-2023"]
[{"$f":"IFERROR(VLOOKUP(C44,#REF!,9,FALSE),\"\")","v":""},{"$f":"C44&COUNTIF($C$2:C44,C44)","v":"FCX27951"},"FCX2795",null,null,2,3857.37,"2023-05-08",88,"2023-06-14",3574.67,282.69999999999982,0,0,0,0,3857.37,null,null,null,null,null,null,null,null,null,null,null,null,null,null,null,null,null,null,null,null,null,null,null,null,null,null,null,null,null,null,null,3574.67,"FCX2795-08-05-2023"]
[{"$f":"IFERROR(VLOOKUP(C45,#REF!,9,FALSE),\"\")","v":""},{"$f":"C45&COUNTIF($C$2:C45,C45)","v":"FCC27301"},"FCC2730",null,"advance",13,221571.5,"2023-05-08",88,"2023-06-25",221571.5,-0.15400000001682201,0,0,0,0,221571.5,null,null,null,null,null,null,null,null,null,null,null,null,null,null,null,null,null,null,null,null,null,null,null,null,null,null,null,null,null,null,null,221571.65400000001,"FCC2730-08-05-2023"]
[{"$f":"IFERROR(VLOOKUP(C46,#REF!,9,FALSE),\"\")","v":""},{"$f":"C46&COUNTIF($C$2:C46,C46)","v":"FCC91621"},"FCC9162",null,"advance",30,580151,"2023-05-08",88,"2023-06-05",579303.37,847.63400000004913,0,0,"new",{"$f":"+G46-K46-L46-M46-N46","v":-4.0000000444706529E-3},580151,null,null,null,null,null,null,null,null,null,null,null,null,null,null,null,null,null,null,null,null,null,null,null,null,null,null,null,null,null,null,null,579303.36599999992,"FCC9162-08-05-2023"]
[{"$f":"IFERROR(VLOOKUP(C47,#REF!,9,FALSE),\"\")","v":""},{"$f":"C47&COUNTIF($C$2:C47,C47)","v":"FCN33701"},"FCN3370",null,null,4,16582,"2023-05-09",87,"2023-06-14",15236.2,1345.7999999999993,0,0,0,0,16582,null,null,null,null,null,null,null,null,null,null,null,null,null,null,null,null,null,null,null,null,null,null,null,null,null,null,null,null,null,null,null,15236.2,"FCN3370-09-05-2023"]
[{"$f":"IFERROR(VLOOKUP(C48,#REF!,9,FALSE),\"\")","v":""},{"$f":"C48&COUNTIF($C$2:C48,C48)","v":"fcx26701"},"fcx2670",null,null,4,11110,"2023-05-09",87,"2023-06-14",11110,0,0,0,0,0,11110,null,null,null,null,null,null,null,null,null,null,null,null,null,null,null,null,null,null,null,null,null,null,null,null,null,null,null,null,null,null,null,11110,"fcx2670-09-05-2023"]
[{"$f":"IFERROR(VLOOKUP(C49,#REF!,9,FALSE),\"\")","v":""},{"$f":"C49&COUNTIF($C$2:C49,C49)","v":"FCB31941"},"FCB3194",null,null,4,43340,"2023-05-09",87,"2023-06-21",42472.1,867.90000000000146,0,0,0,0,43340,null,null,null,null,null,null,null,null,null,null,null,null,null,null,null,null,null,null,null,null,null,null,null,null,null,null,null,null,null,null,null,42472.1,"FCB3194-09-05-2023"]
[{"$f":"IFERROR(VLOOKUP(C50,#REF!,9,FALSE),\"\")","v":""},{"$f":"C50&COUNTIF($C$2:C50,C50)","v":"FCX27931"},"FCX2793",null,null,5,21861.86,"2023-05-09",87,"2023-06-13",21861.86,803,0,0,0,-803,21861.86,null,null,null,null,null,null,null,null,null,null,null,null,null,null,null,null,null,null,null,null,null,null,null,null,null,null,null,null,null,null,null,21058.86,"FCX2793-09-05-2023"]
[{"$f":"IFERROR(VLOOKUP(C51,#REF!,9,FALSE),\"\")","v":""},{"$f":"C51&COUNTIF($C$2:C51,C51)","v":"FCF24701"},"FCF2470",null,null,1,2607.69,"2023-05-09",87,"2023-06-13",2604.77,3.5799999999999272,0,0,0,0,2607.69,null,null,null,null,null,null,null,null,null,null,null,null,null,null,null,null,null,null,null,null,null,null,null,null,null,null,null,null,null,null,null,2604.11,"FCF2470-09-05-2023"]
[{"$f":"IFERROR(VLOOKUP(C52,#REF!,9,FALSE),\"\")","v":""},{"$f":"C52&COUNTIF($C$2:C52,C52)","v":"fcn31451"},"fcn3145",null,null,31,41819.550000000003,"2023-05-09",87,"2023-05-17",37287.31,4532.2400000000052,0,0,0,0,41819.550000000003,null,null,null,null,null,null,null,null,null,null,null,null,null,null,null,null,null,null,null,null,null,null,null,null,null,null,null,null,null,null,null,37287.31,"fcn3145-09-05-2023"]
[{"$f":"IFERROR(VLOOKUP(C53,#REF!,9,FALSE),\"\")","v":""},{"$f":"C53&COUNTIF($C$2:C53,C53)","v":"FCC06501"},"FCC0650",null,null,4,106798.66,"2023-05-09",87,"2023-07-26",106793.79,4.8700000000098953,0,0,"Denied Amount",0,106798.66,null,null,null,null,null,null,null,null,null,null,null,null,null,null,null,null,null,null,null,null,null,null,null,null,null,null,null,null,null,null,null,106793.79,"FCC0650-09-05-2023"]
[{"$f":"IFERROR(VLOOKUP(C54,#REF!,9,FALSE),\"\")","v":""},{"$f":"C54&COUNTIF($C$2:C54,C54)","v":"FCH17902"},"FCH1790",null,"advance",4,49072,"2023-05-09",87,"2023-07-13",49072,-1.9999999894935172E-3,0,0,0,1.9999999894935172E-3,49072,null,null,null,null,null,null,null,null,null,null,null,null,null,null,null,null,null,null,null,null,null,null,null,null,null,null,null,null,null,null,null,49072.001999999993,"FCH1790-09-05-2023"]
[{"$f":"IFERROR(VLOOKUP(C55,#REF!,9,FALSE),\"\")","v":""},{"$f":"C55&COUNTIF($C$2:C55,C55)","v":"FCX13001"},"FCX1300",null,null,1,3004.12,"2023-05-09",87,"2023-06-21",2791.13,212.98999999999978,0,0,"Discount diff in all services (doesn't apply discount at all)",0,3004.12,null,null,null,null,null,null,null,null,null,null,null,null,null,null,null,null,null,null,null,null,null,null,null,null,null,null,null,null,null,null,null,2791.13,"FCX1300-09-05-2023"]
[{"$f":"IFERROR(VLOOKUP(C56,#REF!,9,FALSE),\"\")","v":""},{"$f":"C56&COUNTIF($C$2:C56,C56)","v":"FCX18401"},"FCX1840",null,"advance",37,526582.59,"2023-05-09",87,"2023-06-13",492707.75,-2.9103830456733704E-11,0,33874.839999999997,0,0,526582.59,null,null,null,null,null,null,null,null,null,null,null,null,null,null,null,null,null,null,null,null,null,null,null,null,null,null,null,null,null,null,null,526582.59,"FCX1840-09-05-2023"]
[{"$f":"IFERROR(VLOOKUP(C57,#REF!,9,FALSE),\"\")","v":""},{"$f":"C57&COUNTIF($C$2:C57,C57)","v":"FCS28301"},"FCS2830",null,"advance",27,113649.49,"2023-05-09",87,"2023-06-13",112196.61,1452.88,0,0,0,4.5474735088646412E-12,113649.49,null,null,null,null,null,null,null,null,null,null,null,null,null,null,null,null,null,null,null,null,null,null,null,null,null,null,null,null,null,null,null,112196.61,"FCS2830-09-05-2023"]
[{"$f":"IFERROR(VLOOKUP(C58,#REF!,9,FALSE),\"\")","v":""},{"$f":"C58&COUNTIF($C$2:C58,C58)","v":"FCC15701"},"FCC1570",null,null,3,25851.5,"2023-05-09",87,"2023-06-21",25851.5,-1.0000000002037268E-2,0,0,0,0,25851.5,null,null,null,null,null,null,null,null,null,null,null,null,null,null,null,null,null,null,null,null,null,null,null,null,null,null,null,null,null,null,null,25851.510000000002,"FCC1570-09-05-2023"]
[{"$f":"IFERROR(VLOOKUP(C59,#REF!,9,FALSE),\"\")","v":""},{"$f":"C59&COUNTIF($C$2:C59,C59)","v":"FCE01001"},"FCE0100",null,null,4,40803,"2023-05-09",87,"2023-07-05",40803,0,0,0,0,{"$f":"+G59-K59-L59-M59-N59","v":0},40803,null,null,null,null,null,null,null,null,null,null,null,null,null,null,null,null,null,null,null,null,null,null,null,null,null,null,null,null,null,null,null,40803,"FCE0100-09-05-2023"]
[{"$f":"IFERROR(VLOOKUP(C60,#REF!,9,FALSE),\"\")","v":""},{"$f":"C60&COUNTIF($C$2:C60,C60)","v":"FCF26141"},"FCF2614",null,null,3,79089.399999999994,"2023-05-09",87,"2023-06-19",78859.399999999994,280,0,0,"Price diff",-50,79089.399999999994,null,null,null,null,null,null,null,null,null,null,null,null,null,null,null,null,null,null,null,null,null,null,null,null,null,null,null,null,null,null,null,78809.399999999994,"FCF2614-09-05-2023"]
[{"$f":"IFERROR(VLOOKUP(C61,#REF!,9,FALSE),\"\")","v":""},{"$f":"C61&COUNTIF($C$2:C61,C61)","v":"FCK30841"},"FCK3084",null,null,11,183568.6,"2023-05-09",87,"2023-06-19",177230.6,6338,0,0,"Price differnece & Denied Amount",0,183568.6,null,null,null,null,null,null,null,null,null,null,null,null,null,null,null,null,null,null,null,null,null,null,null,null,null,null,null,null,null,null,null,177230.6,"FCK3084-09-05-2023"]
[{"$f":"IFERROR(VLOOKUP(C62,#REF!,9,FALSE),\"\")","v":""},{"$f":"C62&COUNTIF($C$2:C62,C62)","v":"FCC00901"},"FCC0090",null,"advance",187,6611770.2400000002,"2023-05-09",87,"2023-06-14",6501810.96,39194.880000000587,74630.8,0,0,{"$f":"+G62-K62-L62-M62-N62","v":-3866.4000000003289},6611770.2400000002,null,null,null,null,null,null,null,null,null,null,null,null,null,null,null,null,null,null,null,null,null,null,null,null,null,null,null,null,null,null,null,6572575.3599999994,"FCC0090-09-05-2023"]
[{"$f":"IFERROR(VLOOKUP(C63,#REF!,9,FALSE),\"\")","v":""},{"$f":"C63&COUNTIF($C$2:C63,C63)","v":"FCC91681"},"FCC9168",null,null,3,83697.22,"2023-05-09",87,"2023-06-13",83697.22,0,0,0,0,0,83697.22,null,null,null,null,null,null,null,null,null,null,null,null,null,null,null,null,null,null,null,null,null,null,null,null,null,null,null,null,null,null,null,83697.22,"FCC9168-09-05-2023"]
[{"$f":"IFERROR(VLOOKUP(C64,#REF!,9,FALSE),\"\")","v":""},{"$f":"C64&COUNTIF($C$2:C64,C64)","v":"FCC91791"},"FCC9179",null,null,2,50113.49,"2023-05-09",87,"2023-06-20",50073.49,40,0,0,0,0,50113.49,null,null,null,null,null,null,null,null,null,null,null,null,null,null,null,null,null,null,null,null,null,null,null,null,null,null,null,null,null,null,null,50073.49,"FCC9179-09-05-2023"]
[{"$f":"IFERROR(VLOOKUP(C65,#REF!,9,FALSE),\"\")","v":""},{"$f":"C65&COUNTIF($C$2:C65,C65)","v":"FCX27401"},"FCX2740",null,"advance",64,952662.35,"2023-05-09",87,"2023-06-11",810570.07,692.28000000002794,3135,138265,0,0,952662.35,null,null,null,null,null,null,null,null,null,null,null,null,null,null,null,null,null,null,null,null,null,null,null,null,null,null,null,null,null,null,null,951970.07,"FCX2740-09-05-2023"]
[{"$f":"IFERROR(VLOOKUP(C66,#REF!,9,FALSE),\"\")","v":""},{"$f":"C66&COUNTIF($C$2:C66,C66)","v":"FCC91851"},"FCC9185",null,null,3,124181.2,"2023-05-10",{"$f":"+TODAY()-H66","v":86},"2023-07-17",123539.16,642.0399999999936,0,0,0,0,124181.2,null,null,null,null,null,null,null,null,null,null,null,null,null,null,null,null,null,null,null,null,null,null,null,null,null,null,null,null,null,null,null,123539.16,"FCC9185-10-05-2023"]
[{"$f":"IFERROR(VLOOKUP(C67,#REF!,9,FALSE),\"\")","v":""},{"$f":"C67&COUNTIF($C$2:C67,C67)","v":"FCC91561"},"FCC9156",null,"advance",6,94110.24,"2023-05-10",86,"2023-06-13",80729.97,3.637978807091713E-12,13380.27,-5.4239999992205412E-2,0,0,94110.24,null,null,null,null,null,null,null,null,null,null,null,null,null,null,null,null,null,null,null,null,null,null,null,null,null,null,null,null,null,null,null,{"$f":"G67-(L67++R67+T67+V67+X67+Z67+AB67+AD67+AF67+AH67+AJ67+AL67+AN67+AP67+AR67)","v":94110.24},{"$f":"CONCATENATE(C67,\"-\",TEXT(H67,\"DD-MM-YYYY\"))","v":"FCC9156-10-05-2023"}]
[{"$f":"IFERROR(VLOOKUP(C68,#REF!,9,FALSE),\"\")","v":""},{"$f":"C68&COUNTIF($C$2:C68,C68)","v":"FCC06401"},"FCC0640",null,null,7,51752.35,"2023-05-10",86,"2023-06-14",49584.85,2167.5,0,0,0,0,51752.35,null,null,null,null,null,null,null,null,null,null,null,null,null,null,null,null,null,null,null,null,null,null,null,null,null,null,null,null,null,null,null,49584.85,"FCC0640-10-05-2023"]
[{"$f":"IFERROR(VLOOKUP(C69,#REF!,9,FALSE),\"\")","v":""},{"$f":"C69&COUNTIF($C$2:C69,C69)","v":"FCP17201"},"FCP1720",null,null,6,36157.449999999997,"2023-05-10",86,"2023-06-21",36157.449999999997,0.58999999999650754,0,0,0,0,36157.449999999997,null,null,null,null,null,null,null,null,null,null,null,null,null,null,null,null,null,null,null,null,null,null,null,null,null,null,null,null,null,null,null,36156.86,"FCP1720-10-05-2023"]
[{"$f":"IFERROR(VLOOKUP(C70,#REF!,9,FALSE),\"\")","v":""},{"$f":"C70&COUNTIF($C$2:C70,C70)","v":"FCH28941"},"FCH2894",null,null,1,7892,"2023-05-10",86,"2023-06-08",7892,-1.0000000000218279E-2,0,0,0,0,7892,null,null,null,null,null,null,null,null,null,null,null,null,null,null,null,null,null,null,null,null,null,null,null,null,null,null,null,null,null,null,null,7892.01,"FCH2894-10-05-2023"]
[{"$f":"IFERROR(VLOOKUP(C71,#REF!,9,FALSE),\"\")","v":""},{"$f":"C71&COUNTIF($C$2:C71,C71)","v":"FCC27801"},"FCC2780",null,null,22,119218,"2023-05-10",86,"2023-05-21",114716,4502,0,0,"duplicate claim",0,119218,null,null,null,null,null,null,null,null,null,null,null,null,null,null,null,null,null,null,null,null,null,null,null,null,null,null,null,null,null,null,null,114716,"FCC2780-10-05-2023"]
[{"$f":"IFERROR(VLOOKUP(C72,#REF!,9,FALSE),\"\")","v":""},{"$f":"C72&COUNTIF($C$2:C72,C72)","v":"FCC91651"},"FCC9165",null,null,12,93740.800000000003,"2023-05-10",86,"2023-06-20",66081.16,620.98999999999796,0,27038.65,0,{"$f":"+G72-K72-L72-M72-N72","v":0},{"$f":"+G72-R72-T72-V72-X72-Z72-AB72-AD72-AF72-AH72-AJ72-AL72-AN72-AP72-AT72-AV72","v":93740.800000000003},null,null,null,null,null,null,null,null,null,null,null,null,null,null,null,null,null,null,null,null,null,null,null,null,null,null,null,null,null,null,null,93119.81,"FCC9165-10-05-2023"]
[{"$f":"IFERROR(VLOOKUP(C73,#REF!,9,FALSE),\"\")","v":""},{"$f":"C73&COUNTIF($C$2:C73,C73)","v":"FCC00401"},"FCC0040",null,null,5,10845,"2023-05-10",86,"2023-07-17",8670,2175,0,0,0,0,10845,null,null,null,null,null,null,null,null,null,null,null,null,null,null,null,null,null,null,null,null,null,null,null,null,null,null,null,null,null,null,null,8670,"FCC0040-10-05-2023"]
[{"$f":"IFERROR(VLOOKUP(C74,#REF!,9,FALSE),\"\")","v":""},{"$f":"C74&COUNTIF($C$2:C74,C74)","v":"FCC91461"},"FCC9146",null,null,3,62694.5,"2023-05-10",86,"2023-07-17",62694.5,0,0,0,0,0,62694.5,null,null,null,null,null,null,null,null,null,null,null,null,null,null,null,null,null,null,null,null,null,null,null,null,null,null,null,null,null,null,null,62694.5,"FCC9146-10-05-2023"]
[{"$f":"IFERROR(VLOOKUP(C75,#REF!,9,FALSE),\"\")","v":""},{"$f":"C75&COUNTIF($C$2:C75,C75)","v":"FCC00801"},"FCC0080",null,null,23,90528.01,"2023-05-10",86,"2023-06-05",90528,-0.41000000000349246,0,0,0,0,90528.01,null,null,null,null,null,null,null,null,null,null,null,null,null,null,null,null,null,null,null,null,null,null,null,null,null,null,null,null,null,null,null,90528.42,"FCC0080-10-05-2023"]
[{"$f":"IFERROR(VLOOKUP(C76,#REF!,9,FALSE),\"\")","v":""},{"$f":"C76&COUNTIF($C$2:C76,C76)","v":"FCC91801"},"FCC9180",null,null,10,159514.32,"2023-05-10",86,"2023-06-11",158689.5,824.7500000000291,0,0,0,0,159514.32,null,null,null,null,null,null,null,null,null,null,null,null,null,null,null,null,null,null,null,null,null,null,null,null,null,null,null,null,null,null,null,158689.56999999998,"FCC9180-10-05-2023"]
[{"$f":"IFERROR(VLOOKUP(C77,#REF!,9,FALSE),\"\")","v":""},{"$f":"C77&COUNTIF($C$2:C77,C77)","v":"FCC00701"},"FCC0070",null,null,1,3032,"2023-05-10",86,"2023-06-21",0,0,3032,0,0,0,3032,null,null,null,null,null,null,null,null,null,null,null,null,null,null,null,null,null,null,null,null,null,null,null,null,null,null,null,null,null,null,null,3032,"FCC0070-10-05-2023"]
[{"$f":"IFERROR(VLOOKUP(C78,#REF!,9,FALSE),\"\")","v":""},{"$f":"C78&COUNTIF($C$2:C78,C78)","v":"FCC91541"},"FCC9154",null,null,2,171245.51,"2023-05-10",86,"2023-07-19",171245.51,0,0,0,0,0,171245.51,null,null,null,null,null,null,null,null,null,null,null,null,null,null,null,null,null,null,null,null,null,null,null,null,null,null,null,null,null,null,null,171245.51,"FCC9154-10-05-2023"]
[{"$f":"IFERROR(VLOOKUP(C79,#REF!,9,FALSE),\"\")","v":""},{"$f":"C79&COUNTIF($C$2:C79,C79)","v":"FCC15801"},"FCC1580",null,"advance",74,930686.6,"2023-05-10",86,"2023-06-14",930168.6,517.94999999988067,0,0,0,0,930686.6,null,null,null,null,null,null,null,null,null,null,null,null,null,null,null,null,null,null,null,null,null,null,null,null,null,null,null,null,null,null,null,930168.65000000014,"FCC1580-10-05-2023"]
[{"$f":"IFERROR(VLOOKUP(C80,#REF!,9,FALSE),\"\")","v":""},{"$f":"C80&COUNTIF($C$2:C80,C80)","v":"FCS10201"},"FCS1020",null,null,52,422157.1,"2023-05-10",86,"2023-06-05",408103.3,396.16999999998916,0,13657.63,0,0,422157.1,null,null,null,null,null,null,null,null,null,null,null,null,null,null,null,null,null,null,null,null,null,null,null,null,null,null,null,null,null,null,null,421760.93,"FCS1020-10-05-2023"]
[{"$f":"IFERROR(VLOOKUP(C81,#REF!,9,FALSE),\"\")","v":""},{"$f":"C81&COUNTIF($C$2:C81,C81)","v":"FCS17001"},"FCS1700",null,null,34,330701.3,"2023-05-10",86,"2023-06-05",326957.03999999998,649.91999999998325,3094.34,0,"new",2.5920599000528455E-11,330701.3,null,null,null,null,null,null,null,null,null,null,null,null,null,null,null,null,null,null,null,null,null,null,null,null,null,null,null,null,null,null,null,330051.38,"FCS1700-10-05-2023"]
[{"$f":"IFERROR(VLOOKUP(C82,#REF!,9,FALSE),\"\")","v":""},{"$f":"C82&COUNTIF($C$2:C82,C82)","v":"FCK30781"},"FCK3078",null,null,20,47836.25,"2023-05-10",86,"2023-06-05",47766.25,70,0,0,0,0,47836.25,null,null,null,null,null,null,null,null,null,null,null,null,null,null,null,null,null,null,null,null,null,null,null,null,null,null,null,null,null,null,null,47766.25,"FCK3078-10-05-2023"]
[{"$f":"IFERROR(VLOOKUP(C83,#REF!,9,FALSE),\"\")","v":""},{"$f":"C83&COUNTIF($C$2:C83,C83)","v":"FCC18301"},"FCC1830",null,null,1,20000,"2023-05-10",86,"2023-05-29",20000,0,0,0,0,0,20000,null,null,null,null,null,null,null,null,null,null,null,null,null,null,null,null,null,null,null,null,null,null,null,null,null,null,null,null,null,null,null,20000,"FCC1830-10-05-2023"]
[{"$f":"IFERROR(VLOOKUP(C84,#REF!,9,FALSE),\"\")","v":""},{"$f":"C84&COUNTIF($C$2:C84,C84)","v":"FCC91901"},"FCC9190",null,null,1,4905,"2023-05-10",86,"2023-06-18",4905,0,0,0,0,0,4905,null,null,null,null,null,null,null,null,null,null,null,null,null,null,null,null,null,null,null,null,null,null,null,null,null,null,null,null,null,null,null,4905,"FCC9190-10-05-2023"]
[{"$f":"IFERROR(VLOOKUP(C85,#REF!,9,FALSE),\"\")","v":""},{"$f":"C85&COUNTIF($C$2:C85,C85)","v":"FCC26601"},"FCC2660",null,null,8,39269,"2023-05-10",86,"2023-05-28",39194.06,74.940000000002328,0,0,0,0,39269,null,null,null,null,null,null,null,null,null,null,null,null,null,null,null,null,null,null,null,null,null,null,null,null,null,null,null,null,null,null,null,39194.06,"FCC2660-10-05-2023"]
[{"$f":"IFERROR(VLOOKUP(C86,#REF!,9,FALSE),\"\")","v":""},{"$f":"C86&COUNTIF($C$2:C86,C86)","v":"FCC91751"},"FCC9175",null,null,4,57360.24,"2023-05-10",86,"2023-07-17",54591.02,2769.2200000000012,0,0,0,0,57360.24,null,null,null,null,null,null,null,null,null,null,null,null,null,null,null,null,null,null,null,null,null,null,null,null,null,null,null,null,null,null,null,54591.02,"FCC9175-10-05-2023"]
[{"$f":"IFERROR(VLOOKUP(C87,#REF!,9,FALSE),\"\")","v":""},{"$f":"C87&COUNTIF($C$2:C87,C87)","v":"FCK29901"},"FCK2990",null,null,1,7550,"2023-05-10",86,null,null,null,null,null,null,7550,7550,null,null,null,null,null,null,null,null,null,null,null,null,null,null,null,null,null,null,null,null,null,null,null,null,null,null,null,null,null,null,null,7550,"FCK2990-10-05-2023"]
[{"$f":"IFERROR(VLOOKUP(C88,#REF!,9,FALSE),\"\")","v":""},{"$f":"C88&COUNTIF($C$2:C88,C88)","v":"FCC91831"},"FCC9183",null,null,3,9652.57,"2023-05-10",86,null,null,null,null,null,null,9652.57,9652.57,null,null,null,null,null,null,null,null,null,null,null,null,null,null,null,null,null,null,null,null,null,null,null,null,null,null,null,null,null,null,null,9652.57,"FCC9183-10-05-2023"]
[{"$f":"IFERROR(VLOOKUP(C89,#REF!,9,FALSE),\"\")","v":""},{"$f":"C89&COUNTIF($C$2:C89,C89)","v":"FCC03401"},"FCC0340",null,null,2,7024.4,"2023-05-10",86,"2023-06-14",6746.48,277.92000000000007,0,0,"discount diff 400 /420 (15%)",0,7024.4,null,null,null,null,null,null,null,null,null,null,null,null,null,null,null,null,null,null,null,null,null,null,null,null,null,null,null,null,null,null,null,6746.48,"FCC0340-10-05-2023"]
[{"$f":"IFERROR(VLOOKUP(C90,#REF!,9,FALSE),\"\")","v":""},{"$f":"C90&COUNTIF($C$2:C90,C90)","v":"FCC26501"},"FCC2650",null,null,5,143217,"2023-05-10",86,"2023-07-05",79796.990000000005,9.9999999947613105E-3,0,63420,0,{"$f":"+G90-K90-L90-M90-N90","v":0},143217,null,null,null,null,null,null,null,null,null,null,null,null,null,null,null,null,null,null,null,null,null,null,null,null,null,null,null,null,null,null,null,143216.99,"FCC2650-10-05-2023"]
[{"$f":"IFERROR(VLOOKUP(C91,#REF!,9,FALSE),\"\")","v":""},{"$f":"C91&COUNTIF($C$2:C91,C91)","v":"FCX12901"},"FCX1290",null,"advance",98,1703398.75,"2023-05-10",86,"2023-06-04",1639696.73,2057.0800000001182,61644.800000000003,0,0,0,1703398.75,null,null,null,null,null,null,null,null,null,null,null,null,null,null,null,null,null,null,null,null,null,null,null,null,null,null,null,null,null,null,null,1701341.67,"FCX1290-10-05-2023"]
[{"$f":"IFERROR(VLOOKUP(C92,#REF!,9,FALSE),\"\")","v":""},{"$f":"C92&COUNTIF($C$2:C92,C92)","v":"FCL32101"},"FCL3210",null,null,3,43954,"2023-05-11",85,"2023-07-05",13571.32,20438.68,0,9944,0,{"$f":"+G92-K92-L92-M92-N92","v":0},43954,null,null,null,null,null,null,null,null,null,null,null,null,null,null,null,null,null,null,null,null,null,null,null,null,null,null,null,null,null,null,null,23515.32,"FCL3210-11-05-2023"]
[{"$f":"IFERROR(VLOOKUP(C93,#REF!,9,FALSE),\"\")","v":""},{"$f":"C93&COUNTIF($C$2:C93,C93)","v":"FCB30001"},"FCB3000",null,null,2,19561,"2023-05-11",85,null,null,null,null,null,null,19561,19561,null,null,null,null,null,null,null,null,null,null,null,null,null,null,null,null,null,null,null,null,null,null,null,null,null,null,null,null,null,null,null,19561,"FCB3000-11-05-2023"]
[{"$f":"IFERROR(VLOOKUP(C94,#REF!,9,FALSE),\"\")","v":""},{"$f":"C94&COUNTIF($C$2:C94,C94)","v":"FCF26181"},"FCF2618",null,null,1,13965.7,"2023-05-11",85,"2023-07-06",13965.7,0,0,0,0,0,13965.7,null,null,null,null,null,null,null,null,null,null,null,null,null,null,null,null,null,null,null,null,null,null,null,null,null,null,null,null,null,null,null,13965.7,"FCF2618-11-05-2023"]
[{"$f":"IFERROR(VLOOKUP(C95,#REF!,9,FALSE),\"\")","v":""},{"$f":"C95&COUNTIF($C$2:C95,C95)","v":"FCS31501"},"FCS3150",null,null,2,28669,"2023-05-11",85,"2023-06-18",28071.5,597.5,0,0,"missed",{"$f":"+G95-K95-L95-M95-N95","v":0},28669,null,null,null,null,null,null,null,null,null,null,null,null,null,null,null,null,null,null,null,null,null,null,null,null,null,null,null,null,null,null,null,28071.5,"FCS3150-11-05-2023"]
[{"$f":"IFERROR(VLOOKUP(C96,#REF!,9,FALSE),\"\")","v":""},{"$f":"C96&COUNTIF($C$2:C96,C96)","v":"FCC28801"},"FCC2880",null,null,29,377065.74,"2023-05-11",85,"2023-06-19",377024.87,20.870000000002165,0,0,"updated ",{"$f":"+G96-K96-L96-M96-N96","v":19.999999999993179},377065.74,null,null,null,null,null,null,null,null,null,null,null,null,null,null,null,null,null,null,null,null,null,null,null,null,null,null,null,null,null,null,null,377044.87,"FCC2880-11-05-2023"]
[{"$f":"IFERROR(VLOOKUP(C97,#REF!,9,FALSE),\"\")","v":""},{"$f":"C97&COUNTIF($C$2:C97,C97)","v":"FCC91721"},"FCC9172",null,null,12,456936.54,"2023-05-11",85,"2023-07-10",357022.13,3076.8699999999808,96837.54,0,"Price diff & Discount diff",0,456936.54,null,null,null,null,null,null,null,null,null,null,null,null,null,null,null,null,null,null,null,null,null,null,null,null,null,null,null,null,null,null,null,453859.67,"FCC9172-11-05-2023"]
[{"$f":"IFERROR(VLOOKUP(C98,#REF!,9,FALSE),\"\")","v":""},{"$f":"C98&COUNTIF($C$2:C98,C98)","v":"FCC91941"},"FCC9194",null,null,2,6567,"2023-05-11",85,"2023-06-18",6567,0,0,0,0,0,6567,null,null,null,null,null,null,null,null,null,null,null,null,null,null,null,null,null,null,null,null,null,null,null,null,null,null,null,null,null,null,null,6567,"FCC9194-11-05-2023"]
[{"$f":"IFERROR(VLOOKUP(C99,#REF!,9,FALSE),\"\")","v":""},{"$f":"C99&COUNTIF($C$2:C99,C99)","v":"FCM27601"},"FCM2760",null,null,6,49331.77,"2023-05-11",85,"2023-06-18",49042.99,288.77999999999884,0,0,0,0,49331.77,null,null,null,null,null,null,null,null,null,null,null,null,null,null,null,null,null,null,null,null,null,null,null,null,null,null,null,null,null,null,null,49042.99,"FCM2760-11-05-2023"]
[{"$f":"IFERROR(VLOOKUP(C100,#REF!,9,FALSE),\"\")","v":""},{"$f":"C100&COUNTIF($C$2:C100,C100)","v":"FCX27981"},"FCX2798",null,null,17,144386.54999999999,"2023-05-11",85,"2023-06-21",140350.06,1324.4899999999757,2712,0,"Discount diff in cardiac cath & 201 operation fees",1.5006662579253316E-11,144386.54999999999,null,null,null,null,null,null,null,null,null,null,null,null,null,null,null,null,null,null,null,null,null,null,null,null,null,null,null,null,null,null,null,143062.06000000003,"FCX2798-11-05-2023"]
[{"$f":"IFERROR(VLOOKUP(C101,#REF!,9,FALSE),\"\")","v":""},{"$f":"C101&COUNTIF($C$2:C101,C101)","v":"FCI22101"},"FCI2210",null,null,1,13496,"2023-05-11",85,"2023-07-13",10901.75,2594.25,0,0,0,0,13496,null,null,null,null,null,null,null,null,null,null,null,null,null,null,null,null,null,null,null,null,null,null,null,null,null,null,null,null,null,null,null,10901.75,"FCI2210-11-05-2023"]
[{"$f":"IFERROR(VLOOKUP(C102,#REF!,9,FALSE),\"\")","v":""},{"$f":"C102&COUNTIF($C$2:C102,C102)","v":"FCL07701"},"FCL0770",null,null,2,48400,"2023-05-11",85,"2023-06-20",48400,0,0,0,0,0,48400,null,null,null,null,null,null,null,null,null,null,null,null,null,null,null,null,null,null,null,null,null,null,null,null,null,null,null,null,null,null,null,48400,"FCL0770-11-05-2023"]
[{"$f":"IFERROR(VLOOKUP(C103,#REF!,9,FALSE),\"\")","v":""},{"$f":"C103&COUNTIF($C$2:C103,C103)","v":"FCS10301"},"FCS1030",null,"advance",67,954182.33,"2023-05-11",85,"2023-06-14",926727.24,9587.7459199999284,17867.34,0,0,4.0800000388117041E-3,954182.33,null,null,null,null,null,null,null,null,null,null,null,null,null,null,null,null,null,null,null,null,null,null,null,null,null,null,null,null,null,null,null,944594.58408000006,"FCS1030-11-05-2023"]
[{"$f":"IFERROR(VLOOKUP(C104,#REF!,9,FALSE),\"\")","v":""},{"$f":"C104&COUNTIF($C$2:C104,C104)","v":"FCC17101"},"FCC1710",null,"advance",5,40493,"2023-05-11",85,"2023-06-20",40493,0,0,0,0,0,40493,null,null,null,null,null,null,null,null,null,null,null,null,null,null,null,null,null,null,null,null,null,null,null,null,null,null,null,null,null,null,null,40493,"FCC1710-11-05-2023"]
[{"$f":"IFERROR(VLOOKUP(C105,#REF!,9,FALSE),\"\")","v":""},{"$f":"C105&COUNTIF($C$2:C105,C105)","v":"FCC04801"},"FCC0480",null,null,10,97204,"2023-05-11",85,"2023-06-05",97204,0,0,0,0,0,97204,null,null,null,null,null,null,null,null,null,null,null,null,null,null,null,null,null,null,null,null,null,null,null,null,null,null,null,null,null,null,null,97204,"FCC0480-11-05-2023"]
[{"$f":"IFERROR(VLOOKUP(C106,#REF!,9,FALSE),\"\")","v":""},{"$f":"C106&COUNTIF($C$2:C106,C106)","v":"fcc32501"},"fcc3250",null,null,4,82983,"2023-05-11",85,"2023-06-18",43206,1776.4999999999927,38000,0,0,0.50000000000727596,82983,null,null,null,null,null,null,null,null,null,null,null,null,null,null,null,null,null,null,null,null,null,null,null,null,null,null,null,null,null,null,null,81206.5,"fcc3250-11-05-2023"]
[{"$f":"IFERROR(VLOOKUP(C107,#REF!,9,FALSE),\"\")","v":""},{"$f":"C107&COUNTIF($C$2:C107,C107)","v":"FCX16201"},"FCX1620",null,null,4,88026,"2023-05-14",82,"2023-06-19",76026,12000,0,0,0,0,88026,null,null,null,null,null,null,null,null,null,null,null,null,null,null,null,null,null,null,null,null,null,null,null,null,null,null,null,null,null,null,null,76026,"FCX1620-14-05-2023"]
[{"$f":"IFERROR(VLOOKUP(C108,#REF!,9,FALSE),\"\")","v":""},{"$f":"C108&COUNTIF($C$2:C108,C108)","v":"FCC20601"},"FCC2060",null,null,2,78500,"2023-05-14",82,"2023-06-19",78500,-1.0000000002037268E-2,0,0,0,0,78500,null,null,null,null,null,null,null,null,null,null,null,null,null,null,null,null,null,null,null,null,null,null,null,null,null,null,null,null,null,null,null,78500.010000000009,"FCC2060-14-05-2023"]
[{"$f":"IFERROR(VLOOKUP(C109,#REF!,9,FALSE),\"\")","v":""},{"$f":"C109&COUNTIF($C$2:C109,C109)","v":"FCS29261"},"FCS2926",null,null,2,8832,"2023-05-14",82,"2023-06-20",8147.51,684.48999999999978,0,0,0,0,8832,null,null,null,null,null,null,null,null,null,null,null,null,null,null,null,null,null,null,null,null,null,null,null,null,null,null,null,null,null,null,null,8147.51,"FCS2926-14-05-2023"]
[{"$f":"IFERROR(VLOOKUP(C110,#REF!,9,FALSE),\"\")","v":""},{"$f":"C110&COUNTIF($C$2:C110,C110)","v":"FCT10801"},"FCT1080",null,null,3,23005,"2023-05-14",82,"2023-06-20",23005,0,0,0,0,0,23005,null,null,null,null,null,null,null,null,null,null,null,null,null,null,null,null,null,null,null,null,null,null,null,null,null,null,null,null,null,null,null,23005,"FCT1080-14-05-2023"]
[{"$f":"IFERROR(VLOOKUP(C111,#REF!,9,FALSE),\"\")","v":""},{"$f":"C111&COUNTIF($C$2:C111,C111)","v":"FCC91961"},"FCC9196",null,null,2,24335.79,"2023-05-14",82,"2023-07-05",24273.29,62.5,0,0,0,{"$f":"+G111-K111-L111-M111-N111","v":0},24335.79,null,null,null,null,null,null,null,null,null,null,null,null,null,null,null,null,null,null,null,null,null,null,null,null,null,null,null,null,null,null,null,24273.29,"FCC9196-14-05-2023"]
[{"$f":"IFERROR(VLOOKUP(C112,#REF!,9,FALSE),\"\")","v":""},{"$f":"C112&COUNTIF($C$2:C112,C112)","v":"FCC01201"},"FCC0120",null,null,28,631087.18999999994,"2023-05-14",82,"2023-07-05",375021.11,0,0,256066.08,0,{"$f":"+G112-K112-L112-M112-N112","v":0},631087.18999999994,null,null,null,null,null,null,null,null,null,null,null,null,null,null,null,null,null,null,null,null,null,null,null,null,null,null,null,null,null,null,null,631087.18999999994,"FCC0120-14-05-2023"]
[{"$f":"IFERROR(VLOOKUP(C113,#REF!,9,FALSE),\"\")","v":""},{"$f":"C113&COUNTIF($C$2:C113,C113)","v":"FCC91841"},"FCC9184",null,null,1,3230,"2023-05-14",82,null,null,null,null,null,null,3230,3230,null,null,null,null,null,null,null,null,null,null,null,null,null,null,null,null,null,null,null,null,null,null,null,null,null,null,null,null,null,null,null,3230,"FCC9184-14-05-2023"]
[{"$f":"IFERROR(VLOOKUP(C114,#REF!,9,FALSE),\"\")","v":""},{"$f":"C114&COUNTIF($C$2:C114,C114)","v":"FCC21301"},"FCC2130",null,null,6,36388.83,"2023-05-14",82,"2023-05-21",35547.370000000003,841.45999999999913,0,0,"discount not applied",0,36388.83,null,null,null,null,null,null,null,null,null,null,null,null,null,null,null,null,null,null,null,null,null,null,null,null,null,null,null,null,null,null,null,35547.370000000003,"FCC2130-14-05-2023"]
[{"$f":"IFERROR(VLOOKUP(C115,#REF!,9,FALSE),\"\")","v":""},{"$f":"C115&COUNTIF($C$2:C115,C115)","v":"FCC91611"},"FCC9161",null,null,1,2000,"2023-05-14",82,null,null,null,null,null,null,2000,2000,null,null,null,null,null,null,null,null,null,null,null,null,null,null,null,null,null,null,null,null,null,null,null,null,null,null,null,null,null,null,null,2000,"FCC9161-14-05-2023"]
[{"$f":"IFERROR(VLOOKUP(C116,#REF!,9,FALSE),\"\")","v":""},{"$f":"C116&COUNTIF($C$2:C116,C116)","v":"FCB22201"},"FCB2220",null,null,5,11027.65,"2023-05-14",82,"2023-07-17",11027.65,0,0,0,0,0,11027.65,null,null,null,null,null,null,null,null,null,null,null,null,null,null,null,null,null,null,null,null,null,null,null,null,null,null,null,null,null,null,null,11027.65,"FCB2220-14-05-2023"]
[{"$f":"IFERROR(VLOOKUP(C117,#REF!,9,FALSE),\"\")","v":""},{"$f":"C117&COUNTIF($C$2:C117,C117)","v":"FCQ34401"},"FCQ3440",null,null,1,1522,"2023-05-14",82,"2023-07-19",1522,0,0,0,0,0,1522,null,null,null,null,null,null,null,null,null,null,null,null,null,null,null,null,null,null,null,null,null,null,null,null,null,null,null,null,null,null,null,1522,"FCQ3440-14-05-2023"]
[{"$f":"IFERROR(VLOOKUP(C118,#REF!,9,FALSE),\"\")","v":""},{"$f":"C118&COUNTIF($C$2:C118,C118)","v":"FCF26131"},"FCF2613",null,null,1,4295.7,"2023-05-14",82,"2023-07-16",4295.7,0,0,0,0,0,4295.7,null,null,null,null,null,null,null,null,null,null,null,null,null,null,null,null,null,null,null,null,null,null,null,null,null,null,null,null,null,null,null,4295.7,"FCF2613-14-05-2023"]
[{"$f":"IFERROR(VLOOKUP(C119,#REF!,9,FALSE),\"\")","v":""},{"$f":"C119&COUNTIF($C$2:C119,C119)","v":"FCP22801"},"FCP2280",null,null,1,17278.849999999999,"2023-05-14",82,"2023-07-18",0,0,17278.849999999999,0,0,0,17278.849999999999,null,null,null,null,null,null,null,null,null,null,null,null,null,null,null,null,null,null,null,null,null,null,null,null,null,null,null,null,null,null,null,17278.849999999999,"FCP2280-14-05-2023"]
[{"$f":"IFERROR(VLOOKUP(C120,#REF!,9,FALSE),\"\")","v":""},{"$f":"C120&COUNTIF($C$2:C120,C120)","v":"FCC01301"},"FCC0130",null,"advance",23,437427.75,"2023-05-14",82,"2023-06-20",434374.27,3053.4799999999814,0,0,0,0,437427.75,null,null,null,null,null,null,null,null,null,null,null,null,null,null,null,null,null,null,null,null,null,null,null,null,null,null,null,null,null,null,null,434374.27,"FCC0130-14-05-2023"]
[{"$f":"IFERROR(VLOOKUP(C121,#REF!,9,FALSE),\"\")","v":""},{"$f":"C121&COUNTIF($C$2:C121,C121)","v":"FCC31201"},"FCC3120",null,null,54,0,"2023-05-14",82,null,null,null,null,null,null,0,0,null,null,null,null,null,null,null,null,null,null,null,null,null,null,null,null,null,null,null,null,null,null,null,null,null,null,null,null,null,null,null,0,"FCC3120-14-05-2023"]
[{"$f":"IFERROR(VLOOKUP(C122,#REF!,9,FALSE),\"\")","v":""},{"$f":"C122&COUNTIF($C$2:C122,C122)","v":"FCJ31721"},"FCJ3172",null,null,1,8420,"2023-05-14",82,"2023-06-14",8420,0,0,0,0,0,8420,null,null,null,null,null,null,null,null,null,null,null,null,null,null,null,null,null,null,null,null,null,null,null,null,null,null,null,null,null,null,null,8420,"FCJ3172-14-05-2023"]
[{"$f":"IFERROR(VLOOKUP(C123,#REF!,9,FALSE),\"\")","v":""},{"$f":"C123&COUNTIF($C$2:C123,C123)","v":"FCC18201"},"FCC1820",null,null,1,4800,"2023-05-14",82,"2023-06-14",4800,0,0,0,0,0,4800,null,null,null,null,null,null,null,null,null,null,null,null,null,null,null,null,null,null,null,null,null,null,null,null,null,null,null,null,null,null,null,4800,"FCC1820-14-05-2023"]
[{"$f":"IFERROR(VLOOKUP(C124,#REF!,9,FALSE),\"\")","v":""},{"$f":"C124&COUNTIF($C$2:C124,C124)","v":"FCN31441"},"FCN3144",null,null,10,163052,"2023-05-14",82,"2023-06-21",152711.34,545.50000000000182,9795.16,0,0,1.8189894035458565E-12,163052,null,null,null,null,null,null,null,null,null,null,null,null,null,null,null,null,null,null,null,null,null,null,null,null,null,null,null,null,null,null,null,162506.5,"FCN3144-14-05-2023"]
[{"$f":"IFERROR(VLOOKUP(C125,#REF!,9,FALSE),\"\")","v":""},{"$f":"C125&COUNTIF($C$2:C125,C125)","v":"FCC91761"},"FCC9176",null,"advance",57,817373.05,"2023-05-14",82,"2023-06-12",787513.84,22494.640000000079,7364.57,0,"Discount diff in 530 no dis applied",0,817373.05,null,null,null,null,null,null,null,null,null,null,null,null,null,null,null,null,null,null,null,null,null,null,null,null,null,null,null,null,null,null,null,794878.40999999992,"FCC9176-14-05-2023"]
[{"$f":"IFERROR(VLOOKUP(C126,#REF!,9,FALSE),\"\")","v":""},{"$f":"C126&COUNTIF($C$2:C126,C126)","v":"Fck24101"},"Fck2410",null,null,7,22022.76,"2023-05-14",82,"2023-06-21",21925.34,97.419999999998254,0,0,0,0,22022.76,null,null,null,null,null,null,null,null,null,null,null,null,null,null,null,null,null,null,null,null,null,null,null,null,null,null,null,null,null,null,null,21925.34,"Fck2410-14-05-2023"]
[{"$f":"IFERROR(VLOOKUP(C127,#REF!,9,FALSE),\"\")","v":""},{"$f":"C127&COUNTIF($C$2:C127,C127)","v":"FCS29241"},"FCS2924",null,null,1,10134,"2023-05-14",{"$f":"+TODAY()-H127","v":82},"2023-07-11",6453.5,3680.5,0,0,0,0,{"$f":"+G127-R127-T127-V127-X127-Z127-AB127-AD127-AF127-AH127-AJ127-AL127-AN127-AP127-AT127-AV127","v":10134},null,null,null,null,null,null,null,null,null,null,null,null,null,null,null,null,null,null,null,null,null,null,null,null,null,null,null,null,null,null,null,6453.5,"FCS2924-14-05-2023"]
[{"$f":"IFERROR(VLOOKUP(C128,#REF!,9,FALSE),\"\")","v":""},{"$f":"C128&COUNTIF($C$2:C128,C128)","v":"FCC91521"},"FCC9152",null,"VD",5,110190,"2023-05-15",81,"2023-07-05",110190,0,0,0,0,{"$f":"+G128-K128-L128-M128-N128","v":0},110190,null,null,null,null,null,null,null,null,null,null,null,null,null,null,null,null,null,null,null,null,null,null,null,null,null,null,null,null,null,null,null,110190,"FCC9152-15-05-2023"]
[{"$f":"IFERROR(VLOOKUP(C129,#REF!,9,FALSE),\"\")","v":""},{"$f":"C129&COUNTIF($C$2:C129,C129)","v":"FCB35401"},"FCB3540",null,null,3,19047,"2023-05-15",81,"2023-07-06",15540,0,0,3507,0,0,19047,null,null,null,null,null,null,null,null,null,null,null,null,null,null,null,null,null,null,null,null,null,null,null,null,null,null,null,null,null,null,null,19047,"FCB3540-15-05-2023"]
[{"$f":"IFERROR(VLOOKUP(C130,#REF!,9,FALSE),\"\")","v":""},{"$f":"C130&COUNTIF($C$2:C130,C130)","v":"FCN21701"},"FCN2170",null,null,3,5795,"2023-05-15",81,"2023-07-06",5795,0,0,0,0,0,5795,null,null,null,null,null,null,null,null,null,null,null,null,null,null,null,null,null,null,null,null,null,null,null,null,null,null,null,null,null,null,null,5795,"FCN2170-15-05-2023"]
[{"$f":"IFERROR(VLOOKUP(C131,#REF!,9,FALSE),\"\")","v":""},{"$f":"C131&COUNTIF($C$2:C131,C131)","v":"FCC06001"},"FCC0600",null,null,22,300476,"2023-05-15",{"$f":"+TODAY()-H131","v":81},"2023-06-08",293476,0,0,7000,0,0,300476,null,null,null,null,null,null,null,null,null,null,null,null,null,null,null,null,null,null,null,null,null,null,null,null,null,null,null,null,null,null,null,{"$f":"G131-(L131++R131+T131+V131+X131+Z131+AB131+AD131+AF131+AH131+AJ131+AL131+AN131+AP131+AR131)","v":300476},{"$f":"CONCATENATE(C131,\"-\",TEXT(H131,\"DD-MM-YYYY\"))","v":"FCC0600-15-05-2023"}]
[{"$f":"IFERROR(VLOOKUP(C132,#REF!,9,FALSE),\"\")","v":""},{"$f":"C132&COUNTIF($C$2:C132,C132)","v":"FCC91711"},"FCC9171",null,null,12,497857.6,"2023-05-15",81,"2023-06-19",491447.19,6410.4099999999744,0,0,"updated",{"$f":"+G132-K132-L132-M132-N132","v":0},497857.6,null,null,null,null,null,null,null,null,null,null,null,null,null,null,null,null,null,null,null,null,null,null,null,null,null,null,null,null,null,null,null,491447.19,"FCC9171-15-05-2023"]
[{"$f":"IFERROR(VLOOKUP(C133,#REF!,9,FALSE),\"\")","v":""},{"$f":"C133&COUNTIF($C$2:C133,C133)","v":"FCC04501"},"FCC0450",null,null,4,9872.2800000000007,"2023-05-15",81,"2023-07-17",9141.5,731.13000000000102,0,0,0,0,9872.2800000000007,null,null,null,null,null,null,null,null,null,null,null,null,null,null,null,null,null,null,null,null,null,null,null,null,null,null,null,null,null,null,null,9141.15,"FCC0450-15-05-2023"]
[{"$f":"IFERROR(VLOOKUP(C134,#REF!,9,FALSE),\"\")","v":""},{"$f":"C134&COUNTIF($C$2:C134,C134)","v":"FCT22301"},"FCT2230",null,null,4,83227.67,"2023-05-15",81,"2023-07-17",38737.65,86.25,1608.89,42794.879999999997,"discount diff in room charge 10%",0,83227.67,null,null,null,null,null,null,null,null,null,null,null,null,null,null,null,null,null,null,null,null,null,null,null,null,null,null,null,null,null,null,null,83141.42,"FCT2230-15-05-2023"]
[{"$f":"IFERROR(VLOOKUP(C135,#REF!,9,FALSE),\"\")","v":""},{"$f":"C135&COUNTIF($C$2:C135,C135)","v":"FCC02801"},"FCC0280",null,"advance",41,1559090.5,"2023-05-15",81,"2023-06-21",951946.02,1667.4499999999534,55181.53,550295.5,0,{"$f":"+G135-K135-L135-M135-N135","v":0},1559090.5,null,null,null,null,null,null,null,null,null,null,null,null,null,null,null,null,null,null,null,null,null,null,null,null,null,null,null,null,null,null,null,1557423.05,"FCC0280-15-05-2023"]
[{"$f":"IFERROR(VLOOKUP(C136,#REF!,9,FALSE),\"\")","v":""},{"$f":"C136&COUNTIF($C$2:C136,C136)","v":"FCC91662"},"FCC9166",null,null,1,10400,"2023-05-15",81,"2023-07-17",10400,0,0,0,0,0,10400,null,null,null,null,null,null,null,null,null,null,null,null,null,null,null,null,null,null,null,null,null,null,null,null,null,null,null,null,null,null,null,10400,"FCC9166-15-05-2023"]
[{"$f":"IFERROR(VLOOKUP(C137,#REF!,9,FALSE),\"\")","v":""},{"$f":"C137&COUNTIF($C$2:C137,C137)","v":"FCF06901"},"FCF0690",null,null,23,113042,"2023-05-15",81,"2023-06-12",106310.51,6731.4900000000052,0,0,"price differnce",{"$f":"+G137-K137-L137-M137-N137","v":0},{"$f":"+G137-R137-T137-V137-X137-Z137-AB137-AD137-AF137-AH137-AJ137-AL137-AN137-AP137-AT137-AV137","v":113042},null,null,null,null,null,null,null,null,null,null,null,null,null,null,null,null,null,null,null,null,null,null,null,null,null,null,null,null,null,null,null,106310.51,"FCF0690-15-05-2023"]
[{"$f":"IFERROR(VLOOKUP(C138,#REF!,9,FALSE),\"\")","v":""},{"$f":"C138&COUNTIF($C$2:C138,C138)","v":"FCC33001"},"FCC3300",null,"advance",142,4489821.71,"2023-05-15",81,"2023-06-19",4217101.18,165831.12,106889.8,0,0,0,4489821.71,null,null,null,null,null,null,null,null,null,null,null,null,null,null,null,null,null,null,null,null,null,null,null,null,null,null,null,null,null,null,null,4323990.59,"FCC3300-15-05-2023"]
[{"$f":"IFERROR(VLOOKUP(C139,#REF!,9,FALSE),\"\")","v":""},{"$f":"C139&COUNTIF($C$2:C140,C139)","v":"FCC33002"},"FCC3300",null,"advance",1,17969.91,"2023-05-15",{"$f":"+TODAY()-H139","v":81},"2023-05-21",17970,0,0,0,0,0,{"$f":"+G139-R139-T139-V139-X139-Z139-AB139-AD139-AF139-AH139-AJ139-AL139-AN139-AP139-AT139-AV139","v":17969.91},null,null,null,null,null,null,null,null,null,null,null,null,null,null,null,null,null,null,null,null,null,null,null,null,null,null,null,null,null,null,null,17969.91,"FCC3300-15-05-2023"]
[{"$f":"IFERROR(VLOOKUP(C140,#REF!,9,FALSE),\"\")","v":""},{"$f":"C140&COUNTIF($C$2:C140,C140)","v":"FCC91501"},"FCC9150",null,null,3,35939.519999999997,"2023-05-15",81,"2023-07-31",33810.269999999997,2129.25,0,0,"Classification Difference in claim 3",0,35939.519999999997,null,null,null,null,null,null,null,null,null,null,null,null,null,null,null,null,null,null,null,null,null,null,null,null,null,null,null,null,null,null,null,33810.269999999997,"FCC9150-15-05-2023"]
[{"$f":"IFERROR(VLOOKUP(C141,#REF!,9,FALSE),\"\")","v":""},{"$f":"C141&COUNTIF($C$2:C141,C141)","v":"FCC91822"},"FCC9182",null,null,7,60350,"2023-05-15",81,"2023-05-22",60349.8,0.19999999999708962,0,0,0,0,60350,null,null,null,null,null,null,null,null,null,null,null,null,null,null,null,null,null,null,null,null,null,null,null,null,null,null,null,null,null,null,null,60349.8,"FCC9182-15-05-2023"]
[{"$f":"IFERROR(VLOOKUP(C142,#REF!,9,FALSE),\"\")","v":""},{"$f":"C142&COUNTIF($C$2:C142,C142)","v":"FCV11721"},"FCV1172",null,null,4,16179.45,"2023-05-16",80,"2023-06-18",16179.45,0,0,0,0,0,16179.45,null,null,null,null,null,null,null,null,null,null,null,null,null,null,null,null,null,null,null,null,null,null,null,null,null,null,null,null,null,null,null,16179.45,"FCV1172-16-05-2023"]
[{"$f":"IFERROR(VLOOKUP(C143,#REF!,9,FALSE),\"\")","v":""},{"$f":"C143&COUNTIF($C$2:C143,C143)","v":"FCS29201"},"FCS2920",null,null,2,3429,"2023-05-16",80,"2023-06-18",3219,210,0,0,0,0,3429,null,null,null,null,null,null,null,null,null,null,null,null,null,null,null,null,null,null,null,null,null,null,null,null,null,null,null,null,null,null,null,3219,"FCS2920-16-05-2023"]
[{"$f":"IFERROR(VLOOKUP(C144,#REF!,9,FALSE),\"\")","v":""},{"$f":"C144&COUNTIF($C$2:C144,C144)","v":"FCS29781"},"FCS2978",null,null,8,22443,"2023-05-16",80,"2023-07-19",13448,700,0,8295,0,0,22443,null,null,null,null,null,null,null,null,null,null,null,null,null,null,null,null,null,null,null,null,null,null,null,null,null,null,null,null,null,null,null,21743,"FCS2978-16-05-2023"]
[{"$f":"IFERROR(VLOOKUP(C145,#REF!,9,FALSE),\"\")","v":""},{"$f":"C145&COUNTIF($C$2:C145,C145)","v":"FCC91311"},"FCC9131",null,null,5,41307,"2023-05-16",80,"2023-07-16",41307,0,0,0,0,0,41307,null,null,null,null,null,null,null,null,null,null,null,null,null,null,null,null,null,null,null,null,null,null,null,null,null,null,null,null,null,null,null,41307,"FCC9131-16-05-2023"]
[{"$f":"IFERROR(VLOOKUP(C146,#REF!,9,FALSE),\"\")","v":""},{"$f":"C146&COUNTIF($C$2:C146,C146)","v":"FCS29231"},"FCS2923",null,null,2,20265,"2023-05-16",80,"2023-07-11",18951.400000000001,1313.5999999999985,0,0,0,0,20265,null,null,null,null,null,null,null,null,null,null,null,null,null,null,null,null,null,null,null,null,null,null,null,null,null,null,null,null,null,null,null,18951.400000000001,"FCS2923-16-05-2023"]
[{"$f":"IFERROR(VLOOKUP(C147,#REF!,9,FALSE),\"\")","v":""},{"$f":"C147&COUNTIF($C$2:C147,C147)","v":"FCX12601"},"FCX1260",null,null,8,11838,"2023-05-16",80,"2023-06-12",11837.9,0.1000000000003638,0,0,0,0,11838,null,null,null,null,null,null,null,null,null,null,null,null,null,null,null,null,null,null,null,null,null,null,null,null,null,null,null,null,null,null,null,11837.9,"FCX1260-16-05-2023"]
[{"$f":"IFERROR(VLOOKUP(C148,#REF!,9,FALSE),\"\")","v":""},{"$f":"C148&COUNTIF($C$2:C148,C148)","v":"FCU19901"},"FCU1990",null,null,2,5478.25,"2023-05-16",80,"2023-06-18",5478.25,0,0,0,0,0,5478.25,null,null,null,null,null,null,null,null,null,null,null,null,null,null,null,null,null,null,null,null,null,null,null,null,null,null,null,null,null,null,null,5478.25,"FCU1990-16-05-2023"]
[{"$f":"IFERROR(VLOOKUP(C149,#REF!,9,FALSE),\"\")","v":""},{"$f":"C149&COUNTIF($C$2:C149,C149)","v":"fcc27501"},"fcc2750",null,null,6,122324,"2023-05-16",80,"2023-07-11",119317.03,3006.9700000000012,0,0,0,0,122324,null,null,null,null,null,null,null,null,null,null,null,null,null,null,null,null,null,null,null,null,null,null,null,null,null,null,null,null,null,null,null,119317.03,"fcc2750-16-05-2023"]
[{"$f":"IFERROR(VLOOKUP(C150,#REF!,9,FALSE),\"\")","v":""},{"$f":"C150&COUNTIF($C$2:C150,C150)","v":"FCS29181"},"FCS2918",null,null,1,18209,"2023-05-16",80,"2023-06-20",17974.25,234.75,0,0,0,0,18209,null,null,null,null,null,null,null,null,null,null,null,null,null,null,null,null,null,null,null,null,null,null,null,null,null,null,null,null,null,null,null,17974.25,"FCS2918-16-05-2023"]
[{"$f":"IFERROR(VLOOKUP(C151,#REF!,9,FALSE),\"\")","v":""},{"$f":"C151&COUNTIF($C$2:C151,C151)","v":"FCC16601"},"FCC1660",null,"advance",36,434844.44,"2023-05-16",80,"2023-07-19",429569.87,5274.570000000007,0,0,"Price diff (S.F)",0,434844.44,null,null,null,null,null,null,null,null,null,null,null,null,null,null,null,null,null,null,null,null,null,null,null,null,null,null,null,null,null,null,null,429569.87,"FCC1660-16-05-2023"]
[{"$f":"IFERROR(VLOOKUP(C152,#REF!,9,FALSE),\"\")","v":""},{"$f":"C152&COUNTIF($C$2:C152,C152)","v":"FCM27621"},"FCM2762",null,null,1,10789,"2023-05-16",80,"2023-06-20",10789,1999.0299999999988,0,0,0,-1999.0299999999988,10789,null,null,null,null,null,null,null,null,null,null,null,null,null,null,null,null,null,null,null,null,null,null,null,null,null,null,null,null,null,null,null,8789.9700000000012,"FCM2762-16-05-2023"]
[{"$f":"IFERROR(VLOOKUP(C153,#REF!,9,FALSE),\"\")","v":""},{"$f":"C153&COUNTIF($C$2:C153,C153)","v":"FCC91471"},"FCC9147",null,null,2,5660,"2023-05-17",79,"2023-07-12",5660,0,0,0,0,0,5660,null,null,null,null,null,null,null,null,null,null,null,null,null,null,null,null,null,null,null,null,null,null,null,null,null,null,null,null,null,null,null,5660,"FCC9147-17-05-2023"]
[{"$f":"IFERROR(VLOOKUP(C154,#REF!,9,FALSE),\"\")","v":""},{"$f":"C154&COUNTIF($C$2:C154,C154)","v":"FCC01901"},"FCC0190",null,null,5,14140,"2023-05-17",79,"2023-06-20",14140,0,0,0,0,0,14140,null,null,null,null,null,null,null,null,null,null,null,null,null,null,null,null,null,null,null,null,null,null,null,null,null,null,null,null,null,null,null,14140,"FCC0190-17-05-2023"]
[{"$f":"IFERROR(VLOOKUP(C155,#REF!,9,FALSE),\"\")","v":""},{"$f":"C155&COUNTIF($C$2:C155,C155)","v":"FCS10501"},"FCS1050",null,null,7,27126.799999999999,"2023-05-17",79,"2023-06-14",26945.5,181.29999999999927,0,0,"updated amount as per statement ",0,27126.799999999999,null,null,null,null,null,null,null,null,null,null,null,null,null,null,null,null,null,null,null,null,null,null,null,null,null,null,null,null,null,null,null,26945.5,"FCS1050-17-05-2023"]
[{"$f":"IFERROR(VLOOKUP(C156,#REF!,9,FALSE),\"\")","v":""},{"$f":"C156&COUNTIF($C$2:C156,C156)","v":"FCC90901"},"FCC9090",null,null,14,757328.87,"2023-05-17",79,"2023-06-19",591948.31999999995,54.05,104818.93,60507.57,0,6.5483618527650833E-11,757328.87,null,null,null,null,null,null,null,null,null,null,null,null,null,null,null,null,null,null,null,null,null,null,null,null,null,null,null,null,null,null,null,757274.82,"FCC9090-17-05-2023"]
[{"$f":"IFERROR(VLOOKUP(C157,#REF!,9,FALSE),\"\")","v":""},{"$f":"C157&COUNTIF($C$2:C157,C157)","v":"FCC28701"},"FCC2870",null,null,2,59721,"2023-05-17",79,"2023-07-10",56027.360000000001,3693.6399999999994,0,0,0,0,59721,null,null,null,null,null,null,null,null,null,null,null,null,null,null,null,null,null,null,null,null,null,null,null,null,null,null,null,null,null,null,null,56027.360000000001,"FCC2870-17-05-2023"]
[{"$f":"IFERROR(VLOOKUP(C158,#REF!,9,FALSE),\"\")","v":""},{"$f":"C158&COUNTIF($C$2:C158,C158)","v":"FCH17903"},"FCH1790",null,"advance",5,98173,"2023-05-17",79,"2023-06-20",97623.6,549.39999999999418,0,0,"old&new rr",0,98173,null,null,null,null,null,null,null,null,null,null,null,null,null,null,null,null,null,null,null,null,null,null,null,null,null,null,null,null,null,null,null,97623.6,"FCH1790-17-05-2023"]
[{"$f":"IFERROR(VLOOKUP(C159,#REF!,9,FALSE),\"\")","v":""},{"$f":"C159&COUNTIF($C$2:C159,C159)","v":"FCC33801"},"FCC3380",null,null,7,45417,"2023-05-17",79,"2023-06-20",45416.7,0.30000000000291038,0,0,0,0,45417,null,null,null,null,null,null,null,null,null,null,null,null,null,null,null,null,null,null,null,null,null,null,null,null,null,null,null,null,null,null,null,45416.7,"FCC3380-17-05-2023"]
[{"$f":"IFERROR(VLOOKUP(C160,#REF!,9,FALSE),\"\")","v":""},{"$f":"C160&COUNTIF($C$2:C160,C160)","v":"fcc91951"},"fcc9195",null,null,11,56540.05,"2023-05-17",79,"2023-06-12",56540.04,1.0000000002037268E-2,0,0,0,0,56540.05,null,null,null,null,null,null,null,null,null,null,null,null,null,null,null,null,null,null,null,null,null,null,null,null,null,null,null,null,null,null,null,56540.04,"fcc9195-17-05-2023"]
[{"$f":"IFERROR(VLOOKUP(C161,#REF!,9,FALSE),\"\")","v":""},{"$f":"C161&COUNTIF($C$2:C161,C161)","v":"FCC21101"},"FCC2110",null,null,4,3528,"2023-05-17",79,"2023-06-21",3528,0,0,0,0,0,3528,null,null,null,null,null,null,null,null,null,null,null,null,null,null,null,null,null,null,null,null,null,null,null,null,null,null,null,null,null,null,null,3528,"FCC2110-17-05-2023"]
[{"$f":"IFERROR(VLOOKUP(C162,#REF!,9,FALSE),\"\")","v":""},{"$f":"C162&COUNTIF($C$2:C162,C162)","v":"FCC16501"},"FCC1650",null,"advance",2,23961.1,"2023-05-17",79,"2023-06-20",20920.599999999999,3040.2863999999981,0,0,0,0,23961.1,null,null,null,null,null,null,null,null,null,null,null,null,null,null,null,null,null,null,null,null,null,null,null,null,null,null,null,null,null,null,null,20920.813600000001,"FCC1650-17-05-2023"]
[{"$f":"IFERROR(VLOOKUP(C163,#REF!,9,FALSE),\"\")","v":""},{"$f":"C163&COUNTIF($C$2:C163,C163)","v":"FCE01011"},"FCE0101",null,null,2,7744.16,"2023-05-17",79,"2023-06-21",7254.15,490.01000000000022,0,0,0,0,7744.16,null,null,null,null,null,null,null,null,null,null,null,null,null,null,null,null,null,null,null,null,null,null,null,null,null,null,null,null,null,null,null,7254.15,"FCE0101-17-05-2023"]
[{"$f":"IFERROR(VLOOKUP(C164,#REF!,9,FALSE),\"\")","v":""},{"$f":"C164&COUNTIF($C$2:C164,C164)","v":"FCF26171"},"FCF2617",null,null,2,7761.24,"2023-05-17",79,"2023-06-14",7761.24,0,0,0,0,0,7761.24,null,null,null,null,null,null,null,null,null,null,null,null,null,null,null,null,null,null,null,null,null,null,null,null,null,null,null,null,null,null,null,7761.24,"FCF2617-17-05-2023"]
[{"$f":"IFERROR(VLOOKUP(C165,#REF!,9,FALSE),\"\")","v":""},{"$f":"C165&COUNTIF($C$2:C165,C165)","v":"FCC28401"},"FCC2840",null,"advance",31,124593.7,"2023-05-17",79,"2023-06-08",118177.7,6416,0,0,0,0,124593.7,null,null,null,null,null,null,null,null,null,null,null,null,null,null,null,null,null,null,null,null,null,null,null,null,null,null,null,null,null,null,null,118177.7,"FCC2840-17-05-2023"]
[{"$f":"IFERROR(VLOOKUP(C166,#REF!,9,FALSE),\"\")","v":""},{"$f":"C166&COUNTIF($C$2:C166,C166)","v":"FCC14901"},"FCC1490",null,null,1,35028,"2023-05-17",79,"2023-07-17",35028,0,0,0,0,0,35028,null,null,null,null,null,null,null,null,null,null,null,null,null,null,null,null,null,null,null,null,null,null,null,null,null,null,null,null,null,null,null,35028,"FCC1490-17-05-2023"]
[{"$f":"IFERROR(VLOOKUP(C167,#REF!,9,FALSE),\"\")","v":""},{"$f":"C167&COUNTIF($C$2:C167,C167)","v":"FCC32001"},"FCC3200",null,"advance",14,310275.78999999998,"2023-05-18",78,"2023-07-25",298331.84000000003,11943.949999999953,0,0,0,0,310275.78999999998,null,null,null,null,null,null,null,null,null,null,null,null,null,null,null,null,null,null,null,null,null,null,null,null,null,null,null,null,null,null,null,298331.84000000003,"FCC3200-18-05-2023"]
[{"$f":"IFERROR(VLOOKUP(C168,#REF!,9,FALSE),\"\")","v":""},{"$f":"C168&COUNTIF($C$2:C168,C168)","v":"FCH30301"},"FCH3030",null,null,1,7252.83,"2023-05-18",78,"2023-07-12",7252.83,-2.0000000000436557E-2,0,0,0,0,7252.83,null,null,null,null,null,null,null,null,null,null,null,null,null,null,null,null,null,null,null,null,null,null,null,null,null,null,null,null,null,null,null,7252.85,"FCH3030-18-05-2023"]
[{"$f":"IFERROR(VLOOKUP(C169,#REF!,9,FALSE),\"\")","v":""},{"$f":"C169&COUNTIF($C$2:C169,C169)","v":"FCU19921"},"FCU1992",null,null,3,14902.02,"2023-05-18",78,"2023-06-21",14582.02,320,0,0,0,0,14902.02,null,null,null,null,null,null,null,null,null,null,null,null,null,null,null,null,null,null,null,null,null,null,null,null,null,null,null,null,null,null,null,14582.02,"FCU1992-18-05-2023"]
[{"$f":"IFERROR(VLOOKUP(C170,#REF!,9,FALSE),\"\")","v":""},{"$f":"C170&COUNTIF($C$2:C170,C170)","v":"FCX27991"},"FCX2799",null,null,12,226681.99,"2023-05-18",78,"2023-07-19",82076.539999999994,4979.4100000000035,139626.04,0,"NEW",0,226681.99,null,null,null,null,null,null,null,null,null,null,null,null,null,null,null,null,null,null,null,null,null,null,null,null,null,null,null,null,null,null,null,221702.58,"FCX2799-18-05-2023"]
[{"$f":"IFERROR(VLOOKUP(C171,#REF!,9,FALSE),\"\")","v":""},{"$f":"C171&COUNTIF($C$2:C171,C171)","v":"FCF23301"},"FCF2330",null,null,4,12460.9,"2023-05-18",78,"2023-07-10",8444.16,595.04,3421.7,0,0,0,12460.9,null,null,null,null,null,null,null,null,null,null,null,null,null,null,null,null,null,null,null,null,null,null,null,null,null,null,null,null,null,null,null,11865.86,"FCF2330-18-05-2023"]
[{"$f":"IFERROR(VLOOKUP(C172,#REF!,9,FALSE),\"\")","v":""},{"$f":"C172&COUNTIF($C$2:C172,C172)","v":"FCX32201"},"FCX3220",null,null,5,76373.19,"2023-05-18",78,"2023-07-10",76007.289999999994,365.90000000000873,0,0,0,0,76373.19,null,null,null,null,null,null,null,null,null,null,null,null,null,null,null,null,null,null,null,null,null,null,null,null,null,null,null,null,null,null,null,76007.289999999994,"FCX3220-18-05-2023"]
[{"$f":"IFERROR(VLOOKUP(C173,#REF!,9,FALSE),\"\")","v":""},{"$f":"C173&COUNTIF($C$2:C173,C173)","v":"FCP31601"},"FCP3160",null,null,1,8460,"2023-05-18",78,"2023-07-12",8460,0,0,0,0,0,8460,null,null,null,null,null,null,null,null,null,null,null,null,null,null,null,null,null,null,null,null,null,null,null,null,null,null,null,null,null,null,null,8460,"FCP3160-18-05-2023"]
[{"$f":"IFERROR(VLOOKUP(C174,#REF!,9,FALSE),\"\")","v":""},{"$f":"C174&COUNTIF($C$2:C174,C174)","v":"FCC00601"},"FCC0060",null,"advance",5,64224.72,"2023-05-18",78,"2023-07-10",64074.7,149.95327999999608,0,0,0,0,64224.72,null,null,null,null,null,null,null,null,null,null,null,null,null,null,null,null,null,null,null,null,null,null,null,null,null,null,null,null,null,null,null,64074.766720000007,"FCC0060-18-05-2023"]
[{"$f":"IFERROR(VLOOKUP(C175,#REF!,9,FALSE),\"\")","v":""},{"$f":"C175&COUNTIF($C$2:C175,C175)","v":"FCC91671"},"FCC9167",null,"advance",52,1028115.89,"2023-05-18",78,"2023-07-17",866484.83,20472.96000000005,141158.1,0,"Discount diff , price diff , classifiaction diff",0,1028115.89,null,null,null,null,null,null,null,null,null,null,null,null,null,null,null,null,null,null,null,null,null,null,null,null,null,null,null,null,null,null,null,1007642.9299999999,"FCC9167-18-05-2023"]
[{"$f":"IFERROR(VLOOKUP(C176,#REF!,9,FALSE),\"\")","v":""},{"$f":"C176&COUNTIF($C$2:C176,C176)","v":"FCC00902"},"FCC0090",null,"advance",114,4230771.0999999996,"2023-05-18",78,"2023-06-19",4108613.53,1031.4299999998329,121126.14,0,"Price difference (S.F)",0,4230771.0999999996,null,null,null,null,null,null,null,null,null,null,null,null,null,null,null,null,null,null,null,null,null,null,null,null,null,null,null,null,null,null,null,4229739.67,"FCC0090-18-05-2023"]
[{"$f":"IFERROR(VLOOKUP(C177,#REF!,9,FALSE),\"\")","v":""},{"$f":"C177&COUNTIF($C$2:C177,C177)","v":"FCC26201"},"FCC2620",null,"advance",39,405949.95,"2023-05-18",78,"2023-06-11",401878.7,3851.1,220.15,0,"exceeding approvals limits",8.5265128291212022E-14,405949.95,null,null,null,null,null,null,null,null,null,null,null,null,null,null,null,null,null,null,null,null,null,null,null,null,null,null,null,null,null,null,null,402098.85000000003,"FCC2620-18-05-2023"]
[{"$f":"IFERROR(VLOOKUP(C178,#REF!,9,FALSE),\"\")","v":""},{"$f":"C178&COUNTIF($C$2:C178,C178)","v":"FCC17401"},"FCC1740",null,null,9,61486,"2023-05-18",78,"2023-06-14",61483.63,2.3700000000026193,0,0,0,0,61486,null,null,null,null,null,null,null,null,null,null,null,null,null,null,null,null,null,null,null,null,null,null,null,null,null,null,null,null,null,null,null,61483.63,"FCC1740-18-05-2023"]
[{"$f":"IFERROR(VLOOKUP(C179,#REF!,9,FALSE),\"\")","v":""},{"$f":"C179&COUNTIF($C$2:C179,C179)","v":"FCS29171"},"FCS2917",null,null,19,71883,"2023-05-18",78,"2023-06-11",71879.899999999994,3.1000000000058208,0,0,0,0,71883,null,null,null,null,null,null,null,null,null,null,null,null,null,null,null,null,null,null,null,null,null,null,null,null,null,null,null,null,null,null,null,71879.899999999994,"FCS2917-18-05-2023"]
[{"$f":"IFERROR(VLOOKUP(C180,#REF!,9,FALSE),\"\")","v":""},{"$f":"C180&COUNTIF($C$2:C180,C180)","v":"FCC91971"},"FCC9197",null,null,1,6674.95,"2023-05-18",78,"2023-07-12",6448.59,226.35999999999967,0,0,0,0,6674.95,null,null,null,null,null,null,null,null,null,null,null,null,null,null,null,null,null,null,null,null,null,null,null,null,null,null,null,null,null,null,null,6448.59,"FCC9197-18-05-2023"]
[{"$f":"IFERROR(VLOOKUP(C181,#REF!,9,FALSE),\"\")","v":""},{"$f":"C181&COUNTIF($C$2:C181,C181)","v":"FCC25801"},"FCC2580",null,null,1,416,"2023-05-21",75,"2023-07-10",416,0,0,0,0,0,416,null,null,null,null,null,null,null,null,null,null,null,null,null,null,null,null,null,null,null,null,null,null,null,null,null,null,null,null,null,null,null,416,"FCC2580-21-05-2023"]
[{"$f":"IFERROR(VLOOKUP(C182,#REF!,9,FALSE),\"\")","v":""},{"$f":"C182&COUNTIF($C$2:C182,C182)","v":"FCH07101"},"FCH0710",null,null,2,2162.6799999999998,"2023-05-21",75,"2023-07-10",2162.67,9.9999999997635314E-3,0,0,0,0,2162.6799999999998,null,null,null,null,null,null,null,null,null,null,null,null,null,null,null,null,null,null,null,null,null,null,null,null,null,null,null,null,null,null,null,2162.67,"FCH0710-21-05-2023"]
[{"$f":"IFERROR(VLOOKUP(C183,#REF!,9,FALSE),\"\")","v":""},{"$f":"C183&COUNTIF($C$2:C183,C183)","v":"FCV11701"},"FCV1170",null,null,5,23288.87,"2023-05-21",75,"2023-06-08",20559.05,2729.8199999999997,0,0,"price-classification differnce-second class",0,23288.87,null,null,null,null,null,null,null,null,null,null,null,null,null,null,null,null,null,null,null,null,null,null,null,null,null,null,null,null,null,null,null,20559.05,"FCV1170-21-05-2023"]
[{"$f":"IFERROR(VLOOKUP(C184,#REF!,9,FALSE),\"\")","v":""},{"$f":"C184&COUNTIF($C$2:C184,C184)","v":"FCS29271"},"FCS2927",null,null,10,95426.12,"2023-05-21",75,"2023-07-30",95426.11,9.9999999947613105E-3,0,0,0,0,95426.12,null,null,null,null,null,null,null,null,null,null,null,null,null,null,null,null,null,null,null,null,null,null,null,null,null,null,null,null,null,null,null,95426.11,"FCS2927-21-05-2023"]
[{"$f":"IFERROR(VLOOKUP(C185,#REF!,9,FALSE),\"\")","v":""},{"$f":"C185&COUNTIF($C$2:C185,C185)","v":"FCV11711"},"FCV1171",null,null,2,7498.4,"2023-05-21",75,null,null,null,null,null,null,7498.4,7498.4,null,null,null,null,null,null,null,null,null,null,null,null,null,null,null,null,null,null,null,null,null,null,null,null,null,null,null,null,null,null,null,7498.4,"FCV1171-21-05-2023"]
[{"$f":"IFERROR(VLOOKUP(C186,#REF!,9,FALSE),\"\")","v":""},{"$f":"C186&COUNTIF($C$2:C186,C186)","v":"FCS29141"},"FCS2914",null,null,6,36433.79,"2023-05-21",75,"2023-06-20",34958.79,1475,0,0,0,0,36433.79,null,null,null,null,null,null,null,null,null,null,null,null,null,null,null,null,null,null,null,null,null,null,null,null,null,null,null,null,null,null,null,34958.79,"FCS2914-21-05-2023"]
[{"$f":"IFERROR(VLOOKUP(C187,#REF!,9,FALSE),\"\")","v":""},{"$f":"C187&COUNTIF($C$2:C187,C187)","v":"FCC91811"},"FCC9181",null,null,3,91940.5,"2023-05-21",75,"2023-07-25",91940.5,0,0,0,0,0,91940.5,null,null,null,null,null,null,null,null,null,null,null,null,null,null,null,null,null,null,null,null,null,null,null,null,null,null,null,null,null,null,null,91940.5,"FCC9181-21-05-2023"]
[{"$f":"IFERROR(VLOOKUP(C188,#REF!,9,FALSE),\"\")","v":""},{"$f":"C188&COUNTIF($C$2:C188,C188)","v":"FCA19101"},"FCA1910",null,null,2,1911.27,"2023-05-21",75,"2023-07-19",1911.27,0,0,0,0,0,1911.27,null,null,null,null,null,null,null,null,null,null,null,null,null,null,null,null,null,null,null,null,null,null,null,null,null,null,null,null,null,null,null,1911.27,"FCA1910-21-05-2023"]
[{"$f":"IFERROR(VLOOKUP(C189,#REF!,9,FALSE),\"\")","v":""},{"$f":"C189&COUNTIF($C$2:C189,C189)","v":"FCC29501"},"FCC2950",null,null,12,43337,"2023-05-21",75,"2023-06-20",43336.93,6.9999999999708962E-2,0,0,0,0,43337,null,null,null,null,null,null,null,null,null,null,null,null,null,null,null,null,null,null,null,null,null,null,null,null,null,null,null,null,null,null,null,43336.93,"FCC2950-21-05-2023"]
[{"$f":"IFERROR(VLOOKUP(C190,#REF!,9,FALSE),\"\")","v":""},{"$f":"C190&COUNTIF($C$2:C190,C190)","v":"FCX18301"},"FCX1830",null,null,9,305704.14,"2023-05-21",75,"2023-07-05",231268.03,0,27458.18,46977.93,"UPDATED",{"$f":"+G190-K190-L190-M190-N190","v":0},305704.14,null,null,null,null,null,null,null,null,null,null,null,null,null,null,null,null,null,null,null,null,null,null,null,null,null,null,null,null,null,null,null,305704.14,"FCX1830-21-05-2023"]
[{"$f":"IFERROR(VLOOKUP(C191,#REF!,9,FALSE),\"\")","v":""},{"$f":"C191&COUNTIF($C$2:C191,C191)","v":"FCC91911"},"FCC9191",null,null,2,7553.7,"2023-05-21",75,"2023-07-25",7553.7,0,0,0,0,0,7553.7,null,null,null,null,null,null,null,null,null,null,null,null,null,null,null,null,null,null,null,null,null,null,null,null,null,null,null,null,null,null,null,7553.7,"FCC9191-21-05-2023"]
[{"$f":"IFERROR(VLOOKUP(C192,#REF!,9,FALSE),\"\")","v":""},{"$f":"C192&COUNTIF($C$2:C192,C192)","v":"FCS22601"},"FCS2260",null,null,19,91921.5,"2023-05-21",75,"2023-06-21",71272.2,20649.300000000003,0,0,"corrected amount according to physical claims",0,91921.5,null,null,null,null,null,null,null,null,null,null,null,null,null,null,null,null,null,null,null,null,null,null,null,null,null,null,null,null,null,null,null,71272.2,"FCS2260-21-05-2023"]
[{"$f":"IFERROR(VLOOKUP(C193,#REF!,9,FALSE),\"\")","v":""},{"$f":"C193&COUNTIF($C$2:C193,C193)","v":"FCC91581"},"FCC9158",null,"advance",36,847207.26,"2023-05-21",75,"2023-06-20",761979.79,43693.289999999972,41534.18,0,"NEW",0,847207.26,null,null,null,null,null,null,null,null,null,null,null,null,null,null,null,null,null,null,null,null,null,null,null,null,null,null,null,null,null,null,null,803513.97000000009,"FCC9158-21-05-2023"]
[{"$f":"IFERROR(VLOOKUP(C194,#REF!,9,FALSE),\"\")","v":""},{"$f":"C194&COUNTIF($C$2:C194,C194)","v":"FCC05901"},"FCC0590",null,"advance",83,2979195.28,"2023-05-21",75,"2023-06-19",2742451.03,62845.440000000002,173898.81,0,"NEW",0,2979195.28,null,null,null,null,null,null,null,null,null,null,null,null,null,null,null,null,null,null,null,null,null,null,null,null,null,null,null,null,null,null,null,2916349.84,"FCC0590-21-05-2023"]
[{"$f":"IFERROR(VLOOKUP(C195,#REF!,9,FALSE),\"\")","v":""},{"$f":"C195&COUNTIF($C$2:C195,C195)","v":"FCC91391"},"FCC9139",null,null,3,9642,"2023-05-21",{"$f":"+TODAY()-H195","v":75},"2023-07-25",9642,0,0,0,0,0,9642,null,null,null,null,null,null,null,null,null,null,null,null,null,null,null,null,null,null,null,null,null,null,null,null,null,null,null,null,null,null,null,{"$f":"G195-(L195++R195+T195+V195+X195+Z195+AB195+AD195+AF195+AH195+AJ195+AL195+AN195+AP195+AR195)","v":9642},{"$f":"CONCATENATE(C195,\"-\",TEXT(H195,\"DD-MM-YYYY\"))","v":"FCC9139-21-05-2023"}]
[{"$f":"IFERROR(VLOOKUP(C196,#REF!,9,FALSE),\"\")","v":""},{"$f":"C196&COUNTIF($C$2:C196,C196)","v":"FCG30921"},"FCG3092",null,null,4,10787.4,"2023-05-22",74,"2023-06-11",10687.3,100.10000000000036,0,0,0,0,10787.4,null,null,null,null,null,null,null,null,null,null,null,null,null,null,null,null,null,null,null,null,null,null,null,null,null,null,null,null,null,null,null,10687.3,"FCG3092-22-05-2023"]
[{"$f":"IFERROR(VLOOKUP(C197,#REF!,9,FALSE),\"\")","v":""},{"$f":"C197&COUNTIF($C$2:C197,C197)","v":"FCC33501"},"FCC3350",null,null,22,160224.5,"2023-05-22",74,"2023-06-08",140603.35,49.999999999992724,19571.150000000001,0,0,0,160224.5,null,null,null,null,null,null,null,null,null,null,null,null,null,null,null,null,null,null,null,null,null,null,null,null,null,null,null,null,null,null,null,160174.5,"FCC3350-22-05-2023"]
[{"$f":"IFERROR(VLOOKUP(C198,#REF!,9,FALSE),\"\")","v":""},{"$f":"C198&COUNTIF($C$2:C198,C198)","v":"FCC01401"},"FCC0140",null,null,5,89477.81,"2023-05-22",74,"2023-06-11",89477.2,0.61000000000058208,0,0,0,0,89477.81,null,null,null,null,null,null,null,null,null,null,null,null,null,null,null,null,null,null,null,null,null,null,null,null,null,null,null,null,null,null,null,89477.2,"FCC0140-22-05-2023"]
[{"$f":"IFERROR(VLOOKUP(C199,#REF!,9,FALSE),\"\")","v":""},{"$f":"C199&COUNTIF($C$2:C199,C199)","v":"FCD30531"},"FCD3053",null,null,1,3000,"2023-05-22",74,"2023-06-11",3000,0,0,0,0,0,3000,null,null,null,null,null,null,null,null,null,null,null,null,null,null,null,null,null,null,null,null,null,null,null,null,null,null,null,null,null,null,null,3000,"FCD3053-22-05-2023"]
[{"$f":"IFERROR(VLOOKUP(C200,#REF!,9,FALSE),\"\")","v":""},{"$f":"C200&COUNTIF($C$2:C200,C200)","v":"FCK35501"},"FCK3550",null,null,1,10331.4,"2023-05-23",73,"2023-07-26",10177.4,154,0,0,"Discount diff in operation room and anethesia fees (no disc. Applied )",0,10331.4,null,null,null,null,null,null,null,null,null,null,null,null,null,null,null,null,null,null,null,null,null,null,null,null,null,null,null,null,null,null,null,10177.4,"FCK3550-23-05-2023"]
[{"$f":"IFERROR(VLOOKUP(C201,#REF!,9,FALSE),\"\")","v":""},{"$f":"C201&COUNTIF($C$2:C201,C201)","v":"FCK30821"},"FCK3082",null,null,9,63961.9,"2023-05-23",73,"2023-06-20",61742.44,2282.4600000000028,0,0,0,{"$f":"+G201-K201-L201-M201-N201","v":-63.000000000003638},{"$f":"+G201-R201-T201-V201-X201-Z201-AB201-AD201-AF201-AH201-AJ201-AL201-AN201-AP201-AT201-AV201","v":63961.9},null,null,null,null,null,null,null,null,null,null,null,null,null,null,null,null,null,null,null,null,null,null,null,null,null,null,null,null,null,null,null,61679.44,"FCK3082-23-05-2023"]
[{"$f":"IFERROR(VLOOKUP(C202,#REF!,9,FALSE),\"\")","v":""},{"$f":"C202&COUNTIF($C$2:C202,C202)","v":"FCX27911"},"FCX2791",null,null,1,2000,"2023-05-23",73,"2023-07-16",2000,0,0,0,0,0,2000,null,null,null,null,null,null,null,null,null,null,null,null,null,null,null,null,null,null,null,null,null,null,null,null,null,null,null,null,null,null,null,2000,"FCX2791-23-05-2023"]
[{"$f":"IFERROR(VLOOKUP(C203,#REF!,9,FALSE),\"\")","v":""},{"$f":"C203&COUNTIF($C$2:C203,C203)","v":"FCZ18101"},"FCZ1810",null,null,26,45996.3,"2023-05-23",73,"2023-06-21",45995.519999999997,0.7800000000061118,0,0,0,0,45996.3,null,null,null,null,null,null,null,null,null,null,null,null,null,null,null,null,null,null,null,null,null,null,null,null,null,null,null,null,null,null,null,45995.519999999997,"FCZ1810-23-05-2023"]
[{"$f":"IFERROR(VLOOKUP(C204,#REF!,9,FALSE),\"\")","v":""},{"$f":"C204&COUNTIF($C$2:C204,C204)","v":"FCG30911"},"FCG3091",null,null,63,83887.35,"2023-05-23",73,"2023-06-19",78397.95,5335.9000000000087,153.5,0,0,0,83887.35,null,null,null,null,null,null,null,null,null,null,null,null,null,null,null,null,null,null,null,null,null,null,null,null,null,null,null,null,null,null,null,78551.45,"FCG3091-23-05-2023"]
[{"$f":"IFERROR(VLOOKUP(C205,#REF!,9,FALSE),\"\")","v":""},{"$f":"C205&COUNTIF($C$2:C205,C205)","v":"FCC04002"},"FCC0400",null,"advance",105,4121769.19,"2023-05-23",73,"2023-06-12",3310361,5342.9599999999045,806065.42,0,0,0,4121769.19,null,null,null,null,null,null,null,null,null,null,null,null,null,null,null,null,null,null,null,null,null,null,null,null,null,null,null,null,null,null,null,4116426.23,"FCC0400-23-05-2023"]
[{"$f":"IFERROR(VLOOKUP(C206,#REF!,9,FALSE),\"\")","v":""},{"$f":"C206&COUNTIF($C$2:C206,C206)","v":"FCU11301"},"FCU1130",null,null,4,28839.85,"2023-05-23",73,"2023-07-25",28839.85,0,0,0,0,0,28839.85,null,null,null,null,null,null,null,null,null,null,null,null,null,null,null,null,null,null,null,null,null,null,null,null,null,null,null,null,null,null,null,28839.85,"FCU1130-23-05-2023"]
[{"$f":"IFERROR(VLOOKUP(C207,#REF!,9,FALSE),\"\")","v":""},{"$f":"C207&COUNTIF($C$2:C207,C207)","v":"FCC91881"},"FCC9188",null,null,18,397506.05,"2023-05-23",73,"2023-07-27",314599.95,102.05999999998312,0,82804.039999999994,0,0,397506.05,null,null,null,null,null,null,null,null,null,null,null,null,null,null,null,null,null,null,null,null,null,null,null,null,null,null,null,null,null,null,null,397403.99,"FCC9188-23-05-2023"]
[{"$f":"IFERROR(VLOOKUP(C208,#REF!,9,FALSE),\"\")","v":""},{"$f":"C208&COUNTIF($C$2:C208,C208)","v":"FCX27921"},"FCX2792",null,null,7,24327.4,"2023-05-24",72,"2023-07-25",24327.03,0.37000000000261934,0,0,0,0,24327.4,null,null,null,null,null,null,null,null,null,null,null,null,null,null,null,null,null,null,null,null,null,null,null,null,null,null,null,null,null,null,null,24327.03,"FCX2792-24-05-2023"]
[{"$f":"IFERROR(VLOOKUP(C209,#REF!,9,FALSE),\"\")","v":""},{"$f":"C209&COUNTIF($C$2:C209,C209)","v":"FCC17801"},"FCC1780",null,null,3,93042.5,"2023-05-24",72,"2023-07-12",93042.5,0,0,0,0,0,93042.5,null,null,null,null,null,null,null,null,null,null,null,null,null,null,null,null,null,null,null,null,null,null,null,null,null,null,null,null,null,null,null,93042.5,"FCC1780-24-05-2023"]
[{"$f":"IFERROR(VLOOKUP(C210,#REF!,9,FALSE),\"\")","v":""},{"$f":"C210&COUNTIF($C$2:C210,C210)","v":"FCZ18302"},"FCZ1830",null,null,2,25005,"2023-05-24",72,"2023-07-16",25000,5,0,0,0,0,25005,null,null,null,null,null,null,null,null,null,null,null,null,null,null,null,null,null,null,null,null,null,null,null,null,null,null,null,null,null,null,null,25000,"FCZ1830-24-05-2023"]
[{"$f":"IFERROR(VLOOKUP(C211,#REF!,9,FALSE),\"\")","v":""},{"$f":"C211&COUNTIF($C$2:C211,C211)","v":"FCX18501"},"FCX1850",null,null,4,49842,"2023-05-24",72,"2023-07-13",48338.5,1503.5,0,0,0,0,49842,null,null,null,null,null,null,null,null,null,null,null,null,null,null,null,null,null,null,null,null,null,null,null,null,null,null,null,null,null,null,null,48338.5,"FCX1850-24-05-2023"]
[{"$f":"IFERROR(VLOOKUP(C212,#REF!,9,FALSE),\"\")","v":""},{"$f":"C212&COUNTIF($C$2:C212,C212)","v":"FCC29801"},"FCC2980",null,null,16,207068.09,"2023-05-24",72,"2023-06-19",207068,-0.55999999999767169,0,0,0,0,207068.09,null,null,null,null,null,null,null,null,null,null,null,null,null,null,null,null,null,null,null,null,null,null,null,null,null,null,null,null,null,null,null,207068.65,"FCC2980-24-05-2023"]
[{"$f":"IFERROR(VLOOKUP(C213,#REF!,9,FALSE),\"\")","v":""},{"$f":"C213&COUNTIF($C$2:C213,C213)","v":"FCN31431"},"FCN3143",null,null,3,13611.5,"2023-05-24",72,"2023-07-12",13611.5,0,0,0,0,0,13611.5,null,null,null,null,null,null,null,null,null,null,null,null,null,null,null,null,null,null,null,null,null,null,null,null,null,null,null,null,null,null,null,13611.5,"FCN3143-24-05-2023"]
[{"$f":"IFERROR(VLOOKUP(C214,#REF!,9,FALSE),\"\")","v":""},{"$f":"C214&COUNTIF($C$2:C214,C214)","v":"FCC20901"},"FCC2090",null,"advance",2,19914.98,"2023-05-24",72,"2023-07-05",19914.88,9.9999999998544808E-2,0,0,0,{"$f":"+G214-K214-L214-M214-N214","v":0},19914.98,null,null,null,null,null,null,null,null,null,null,null,null,null,null,null,null,null,null,null,null,null,null,null,null,null,null,null,null,null,null,null,19914.88,"FCC2090-24-05-2023"]
[{"$f":"IFERROR(VLOOKUP(C215,#REF!,9,FALSE),\"\")","v":""},{"$f":"C215&COUNTIF($C$2:C215,C215)","v":"FCC91921"},"FCC9192",null,null,8,95431.15,"2023-05-25",71,"2023-06-20",90579.7,4851.3800000000047,0,0,0,0,95431.15,null,null,null,null,null,null,null,null,null,null,null,null,null,null,null,null,null,null,null,null,null,null,null,null,null,null,null,null,null,null,null,90579.76999999999,"FCC9192-25-05-2023"]
[{"$f":"IFERROR(VLOOKUP(C216,#REF!,9,FALSE),\"\")","v":""},{"$f":"C216&COUNTIF($C$2:C216,C216)","v":"FCC91861"},"FCC9186",null,null,1,4000,"2023-05-25",71,"2023-07-12",4000,0,0,0,0,0,4000,null,null,null,null,null,null,null,null,null,null,null,null,null,null,null,null,null,null,null,null,null,null,null,null,null,null,null,null,null,null,null,4000,"FCC9186-25-05-2023"]
[{"$f":"IFERROR(VLOOKUP(C217,#REF!,9,FALSE),\"\")","v":""},{"$f":"C217&COUNTIF($C$2:C217,C217)","v":"FCC02701"},"FCC0270",null,"advance",9,81365,"2023-05-25",71,"2023-06-20",80922.92,442.08000000000175,0,0,0,0,81365,null,null,null,null,null,null,null,null,null,null,null,null,null,null,null,null,null,null,null,null,null,null,null,null,null,null,null,null,null,null,null,80922.92,"FCC0270-25-05-2023"]
[{"$f":"IFERROR(VLOOKUP(C218,#REF!,9,FALSE),\"\")","v":""},{"$f":"C218&COUNTIF($C$2:C218,C218)","v":"FCC03901"},"FCC0390",null,null,6,38661.15,"2023-05-25",71,"2023-07-13",26501.15,140,12020,0,0,0,38661.15,null,null,null,null,null,null,null,null,null,null,null,null,null,null,null,null,null,null,null,null,null,null,null,null,null,null,null,null,null,null,null,38521.15,"FCC0390-25-05-2023"]
[{"$f":"IFERROR(VLOOKUP(C219,#REF!,9,FALSE),\"\")","v":""},{"$f":"C219&COUNTIF($C$2:C219,C219)","v":"FCZ27291"},"FCZ2729",null,null,6,23258.33,"2023-05-25",71,"2023-07-12",23258.33,0,0,0,0,0,23258.33,null,null,null,null,null,null,null,null,null,null,null,null,null,null,null,null,null,null,null,null,null,null,null,null,null,null,null,null,null,null,null,23258.33,"FCZ2729-25-05-2023"]
[{"$f":"IFERROR(VLOOKUP(C220,#REF!,9,FALSE),\"\")","v":""},{"$f":"C220&COUNTIF($C$2:C220,C220)","v":"FCS29101"},"FCS2910",null,null,4,11743,"2023-05-25",71,"2023-07-16",11093,650,0,0,0,0,11743,null,null,null,null,null,null,null,null,null,null,null,null,null,null,null,null,null,null,null,null,null,null,null,null,null,null,null,null,null,null,null,11093,"FCS2910-25-05-2023"]
[{"$f":"IFERROR(VLOOKUP(C221,#REF!,9,FALSE),\"\")","v":""},{"$f":"C221&COUNTIF($C$2:C221,C221)","v":"FCZ13601"},"FCZ1360",null,null,1,1135.5,"2023-05-25",71,"2023-06-14",1135.5,0,0,0,0,0,1135.5,null,null,null,null,null,null,null,null,null,null,null,null,null,null,null,null,null,null,null,null,null,null,null,null,null,null,null,null,null,null,null,1135.5,"FCZ1360-25-05-2023"]
[{"$f":"IFERROR(VLOOKUP(C222,#REF!,9,FALSE),\"\")","v":""},{"$f":"C222&COUNTIF($C$2:C222,C222)","v":"FCC33401"},"FCC3340",null,null,12,185682.91,"2023-05-25",71,"2023-07-17",177250.21,8684.7000000000116,0,0,"Discount Difference in all services",-252,185682.91,null,null,null,null,null,null,null,null,null,null,null,null,null,null,null,null,null,null,null,null,null,null,null,null,null,null,null,null,null,null,null,176998.21,"FCC3340-25-05-2023"]
[{"$f":"IFERROR(VLOOKUP(C223,#REF!,9,FALSE),\"\")","v":""},{"$f":"C223&COUNTIF($C$2:C223,C223)","v":"FCF33301"},"FCF3330",null,"advance",20,411229.14,"2023-05-25",71,null,null,null,null,null,null,411229.14,411229.14,null,null,null,null,null,null,null,null,null,null,null,null,null,null,null,null,null,null,null,null,null,null,null,null,null,null,null,null,null,null,null,411229.14,"FCF3330-25-05-2023"]
[{"$f":"IFERROR(VLOOKUP(C224,#REF!,9,FALSE),\"\")","v":""},{"$f":"C224&COUNTIF($C$2:C224,C224)","v":"FCC35201"},"FCC3520",null,"advance",15,216173.1,"2023-05-28",68,"2023-07-06",194638.07999999999,21160.17000000002,374.85,0,0,-1.4779288903810084E-12,216173.1,null,null,null,null,null,null,null,null,null,null,null,null,null,null,null,null,null,null,null,null,null,null,null,null,null,null,null,null,null,null,null,195012.93,"FCC3520-28-05-2023"]
[{"$f":"IFERROR(VLOOKUP(C225,#REF!,9,FALSE),\"\")","v":""},{"$f":"C225&COUNTIF($C$2:C225,C225)","v":"FCC22001"},"FCC2200",null,null,2,9200,"2023-05-28",68,"2023-06-14",9200,0,0,0,0,0,9200,null,null,null,null,null,null,null,null,null,null,null,null,null,null,null,null,null,null,null,null,null,null,null,null,null,null,null,null,null,null,null,9200,"FCC2200-28-05-2023"]
[{"$f":"IFERROR(VLOOKUP(C226,#REF!,9,FALSE),\"\")","v":""},{"$f":"C226&COUNTIF($C$2:C226,C226)","v":"FCF23102"},"FCF2310",null,null,7,55854.48,"2023-05-28",68,"2023-07-13",55529.48,325,0,0,0,0,55854.48,null,null,null,null,null,null,null,null,null,null,null,null,null,null,null,null,null,null,null,null,null,null,null,null,null,null,null,null,null,null,null,55529.48,"FCF2310-28-05-2023"]
[{"$f":"IFERROR(VLOOKUP(C227,#REF!,9,FALSE),\"\")","v":""},{"$f":"C227&COUNTIF($C$2:C227,C227)","v":"FCX13101"},"FCX1310",null,null,2,6180,"2023-05-28",68,"2023-07-12",6180,0,0,0,0,0,6180,null,null,null,null,null,null,null,null,null,null,null,null,null,null,null,null,null,null,null,null,null,null,null,null,null,null,null,null,null,null,null,6180,"FCX1310-28-05-2023"]
[{"$f":"IFERROR(VLOOKUP(C228,#REF!,9,FALSE),\"\")","v":""},{"$f":"C228&COUNTIF($C$2:C228,C228)","v":"FCZ27281"},"FCZ2728",null,null,4,3315.8,"2023-05-28",68,"2023-07-12",3225.42,90.380000000000109,0,0,0,0,3315.8,null,null,null,null,null,null,null,null,null,null,null,null,null,null,null,null,null,null,null,null,null,null,null,null,null,null,null,null,null,null,null,3225.42,"FCZ2728-28-05-2023"]
[{"$f":"IFERROR(VLOOKUP(C229,#REF!,9,FALSE),\"\")","v":""},{"$f":"C229&COUNTIF($C$2:C229,C229)","v":"FCZ17801"},"FCZ1780",null,null,19,18554.740000000002,"2023-05-28",68,"2023-06-21",18406.509999999998,148.2300000000032,0,0,0,0,18554.740000000002,null,null,null,null,null,null,null,null,null,null,null,null,null,null,null,null,null,null,null,null,null,null,null,null,null,null,null,null,null,null,null,18406.509999999998,"FCZ1780-28-05-2023"]
[{"$f":"IFERROR(VLOOKUP(C230,#REF!,9,FALSE),\"\")","v":""},{"$f":"C230&COUNTIF($C$2:C230,C230)","v":"FCX12001"},"FCX1200",null,null,12,171415.57,"2023-05-28",68,"2023-07-05",169944.88,1470.6900000000023,0,0,0,{"$f":"+G230-K230-L230-M230-N230","v":0},171415.57,null,null,null,null,null,null,null,null,null,null,null,null,null,null,null,null,null,null,null,null,null,null,null,null,null,null,null,null,null,null,null,169944.88,"FCX1200-28-05-2023"]
[{"$f":"IFERROR(VLOOKUP(C231,#REF!,9,FALSE),\"\")","v":""},{"$f":"C231&COUNTIF($C$2:C231,C231)","v":"FCY13501"},"FCY1350",null,null,8,65683.100000000006,"2023-05-28",68,"2023-06-20",43613.7,22069.400000000009,0,0,0,0,65683.100000000006,null,null,null,null,null,null,null,null,null,null,null,null,null,null,null,null,null,null,null,null,null,null,null,null,null,null,null,null,null,null,null,43613.7,"FCY1350-28-05-2023"]
[{"$f":"IFERROR(VLOOKUP(C232,#REF!,9,FALSE),\"\")","v":""},{"$f":"C232&COUNTIF($C$2:C232,C232)","v":"FCC91381"},"FCC9138",null,null,1,934.5,"2023-05-28",68,"2023-07-12",934.5,0.20000000000004547,0,0,0,0,934.5,null,null,null,null,null,null,null,null,null,null,null,null,null,null,null,null,null,null,null,null,null,null,null,null,null,null,null,null,null,null,null,934.3,"FCC9138-28-05-2023"]
[{"$f":"IFERROR(VLOOKUP(C233,#REF!,9,FALSE),\"\")","v":""},{"$f":"C233&COUNTIF($C$2:C233,C233)","v":"FCC22501"},"FCC2250",null,null,2,18918,"2023-05-28",68,"2023-07-12",12943,5975,0,0,0,0,18918,null,null,null,null,null,null,null,null,null,null,null,null,null,null,null,null,null,null,null,null,null,null,null,null,null,null,null,null,null,null,null,12943,"FCC2250-28-05-2023"]
[{"$f":"IFERROR(VLOOKUP(C234,#REF!,9,FALSE),\"\")","v":""},{"$f":"C234&COUNTIF($C$2:C234,C234)","v":"FCR10132"},"FCR1013",null,null,1,3400,"2023-05-29",67,"2023-07-17",3400,0,0,0,0,0,3400,null,null,null,null,null,null,null,null,null,null,null,null,null,null,null,null,null,null,null,null,null,null,null,null,null,null,null,null,null,null,null,3400,"FCR1013-29-05-2023"]
[{"$f":"IFERROR(VLOOKUP(C235,#REF!,9,FALSE),\"\")","v":""},{"$f":"C235&COUNTIF($C$2:C235,C235)","v":"FCK30831"},"FCK3083",null,null,7,83430,"2023-05-29",67,"2023-07-12",75940,7490,0,0,"NEW",0,83430,null,null,null,null,null,null,null,null,null,null,null,null,null,null,null,null,null,null,null,null,null,null,null,null,null,null,null,null,null,null,null,75940,"FCK3083-29-05-2023"]
[{"$f":"IFERROR(VLOOKUP(C236,#REF!,9,FALSE),\"\")","v":""},{"$f":"C236&COUNTIF($C$2:C236,C236)","v":"FCB17601"},"FCB1760",null,null,5,22228.68,"2023-05-29",67,"2023-06-20",22173.63,55.049999999999272,0,0,0,0,22228.68,null,null,null,null,null,null,null,null,null,null,null,null,null,null,null,null,null,null,null,null,null,null,null,null,null,null,null,null,null,null,null,22173.63,"FCB1760-29-05-2023"]
[{"$f":"IFERROR(VLOOKUP(C237,#REF!,9,FALSE),\"\")","v":""},{"$f":"C237&COUNTIF($C$2:C237,C237)","v":"FCC91401"},"FCC9140",null,null,1,4307,"2023-05-30",66,"2023-07-19",3990.5,316.5,0,0,0,0,4307,null,null,null,null,null,null,null,null,null,null,null,null,null,null,null,null,null,null,null,null,null,null,null,null,null,null,null,null,null,null,null,3990.5,"FCC9140-30-05-2023"]
[{"$f":"IFERROR(VLOOKUP(C238,#REF!,9,FALSE),\"\")","v":""},{"$f":"C238&COUNTIF($C$2:C238,C238)","v":"FCN31422"},"FCN3142",null,null,3,9368.9500000000007,"2023-05-30",66,"2023-07-19",9293.9500000000007,75,0,0,0,0,9368.9500000000007,null,null,null,null,null,null,null,null,null,null,null,null,null,null,null,null,null,null,null,null,null,null,null,null,null,null,null,null,null,null,null,9293.9500000000007,"FCN3142-30-05-2023"]
[{"$f":"IFERROR(VLOOKUP(C239,#REF!,9,FALSE),\"\")","v":""},{"$f":"C239&COUNTIF($C$2:C239,C239)","v":"FCX25701"},"FCX2570",null,null,1,6967.41,"2023-05-30",66,"2023-07-19",6967.41,0,0,0,0,0,6967.41,null,null,null,null,null,null,null,null,null,null,null,null,null,null,null,null,null,null,null,null,null,null,null,null,null,null,null,null,null,null,null,6967.41,"FCX2570-30-05-2023"]
[{"$f":"IFERROR(VLOOKUP(C240,#REF!,9,FALSE),\"\")","v":""},{"$f":"C240&COUNTIF($C$2:C240,C240)","v":"FCU11302"},"FCU1130",null,null,1,1376.64,"2023-05-30",66,null,null,null,null,null,null,1376.64,1376.64,null,null,null,null,null,null,null,null,null,null,null,null,null,null,null,null,null,null,null,null,null,null,null,null,null,null,null,null,null,null,null,1376.64,"FCU1130-30-05-2023"]
[{"$f":"IFERROR(VLOOKUP(C241,#REF!,9,FALSE),\"\")","v":""},{"$f":"C241&COUNTIF($C$2:C241,C241)","v":"FCS10701"},"FCS1070",null,null,2,6475,"2023-05-30",66,"2023-07-19",6405,69.75,0,0,0,0,6475,null,null,null,null,null,null,null,null,null,null,null,null,null,null,null,null,null,null,null,null,null,null,null,null,null,null,null,null,null,null,null,6405.25,"FCS1070-30-05-2023"]
[{"$f":"IFERROR(VLOOKUP(C242,#REF!,9,FALSE),\"\")","v":""},{"$f":"C242&COUNTIF($C$2:C242,C242)","v":"FCF26221"},"FCF2622",null,null,7,48015.5,"2023-05-30",66,"2023-07-17",47455.5,560,0,0,0,0,48015.5,null,null,null,null,null,null,null,null,null,null,null,null,null,null,null,null,null,null,null,null,null,null,null,null,null,null,null,null,null,null,null,47455.5,"FCF2622-30-05-2023"]
[{"$f":"IFERROR(VLOOKUP(C243,#REF!,9,FALSE),\"\")","v":""},{"$f":"C243&COUNTIF($C$2:C243,C243)","v":"FCC02301"},"FCC0230",null,null,33,214303.03,"2023-05-30",66,"2023-07-27",214283,1769.9899999999907,0,0,0,-1749.9599999999919,214303.03,null,null,null,null,null,null,null,null,null,null,null,null,null,null,null,null,null,null,null,null,null,null,null,null,null,null,null,null,null,null,null,212533.04,"FCC0230-30-05-2023"]
[{"$f":"IFERROR(VLOOKUP(C244,#REF!,9,FALSE),\"\")","v":""},{"$f":"C244&COUNTIF($C$2:C244,C244)","v":"FCC04101"},"FCC0410",null,null,2,10708,"2023-05-31",65,"2023-07-19",10708,0,0,0,0,0,10708,null,null,null,null,null,null,null,null,null,null,null,null,null,null,null,null,null,null,null,null,null,null,null,null,null,null,null,null,null,null,null,10708,"FCC0410-31-05-2023"]
[{"$f":"IFERROR(VLOOKUP(C245,#REF!,9,FALSE),\"\")","v":""},{"$f":"C245&COUNTIF($C$2:C245,C245)","v":"0"},null,null,null,null,null,null,45142,null,null,null,null,null,null,0,0,null,null,null,null,null,null,null,null,null,null,null,null,null,null,null,null,null,null,null,null,null,null,null,null,null,null,null,null,null,null,null,0,"-00-01-1900"]
[{"$f":"IFERROR(VLOOKUP(C246,#REF!,9,FALSE),\"\")","v":""},{"$f":"C246&COUNTIF($C$2:C246,C246)","v":"0"},null,null,null,null,null,null,45142,null,null,null,null,null,null,0,0,null,null,null,null,null,null,null,null,null,null,null,null,null,null,null,null,null,null,null,null,null,null,null,null,null,null,null,null,null,null,null,0,"-00-01-1900"]
[{"$f":"IFERROR(VLOOKUP(C247,#REF!,9,FALSE),\"\")","v":""},{"$f":"C247&COUNTIF($C$2:C247,C247)","v":"0"},null,null,null,null,null,null,45142,null,null,null,null,null,null,0,0,null,null,null,null,null,null,null,null,null,null,null,null,null,null,null,null,null,null,null,null,null,null,null,null,null,null,null,null,null,null,null,0,"-00-01-1900"]
[{"$f":"IFERROR(VLOOKUP(C248,#REF!,9,FALSE),\"\")","v":""},{"$f":"C248&COUNTIF($C$2:C248,C248)","v":"0"},null,null,null,null,null,null,45142,null,null,null,null,null,null,0,0,null,null,null,null,null,null,null,null,null,null,null,null,null,null,null,null,null,null,null,null,null,null,null,null,null,null,null,null,null,null,null,0,"-00-01-1900"]
[{"$f":"IFERROR(VLOOKUP(C249,#REF!,9,FALSE),\"\")","v":""},{"$f":"C249&COUNTIF($C$2:C249,C249)","v":"0"},null,null,null,null,null,null,45142,null,null,null,null,null,null,0,0,null,null,null,null,null,null,null,null,null,null,null,null,null,null,null,null,null,null,null,null,null,null,null,null,null,null,null,null,null,null,null,0,"-00-01-1900"]
[{"$f":"IFERROR(VLOOKUP(C250,#REF!,9,FALSE),\"\")","v":""},{"$f":"C250&COUNTIF($C$2:C250,C250)","v":"0"},null,null,null,null,null,null,45142,null,null,null,null,null,null,0,0,null,null,null,null,null,null,null,null,null,null,null,null,null,null,null,null,null,null,null,null,null,null,null,null,null,null,null,null,null,null,null,0,"-00-01-1900"]
[{"$f":"IFERROR(VLOOKUP(C251,#REF!,9,FALSE),\"\")","v":""},{"$f":"C251&COUNTIF($C$2:C251,C251)","v":"0"},null,null,null,null,null,null,45142,null,null,null,null,null,null,0,0,null,null,null,null,null,null,null,null,null,null,null,null,null,null,null,null,null,null,null,null,null,null,null,null,null,null,null,null,null,null,null,0,"-00-01-1900"]
[{"$f":"IFERROR(VLOOKUP(C252,#REF!,9,FALSE),\"\")","v":""},{"$f":"C252&COUNTIF($C$2:C252,C252)","v":"0"},null,null,null,null,null,null,45142,null,null,null,null,null,null,0,0,null,null,null,null,null,null,null,null,null,null,null,null,null,null,null,null,null,null,null,null,null,null,null,null,null,null,null,null,null,null,null,0,"-00-01-1900"]
[{"$f":"IFERROR(VLOOKUP(C253,#REF!,9,FALSE),\"\")","v":""},{"$f":"C253&COUNTIF($C$2:C253,C253)","v":"0"},null,null,null,null,null,null,45142,null,null,null,null,null,null,0,0,null,null,null,null,null,null,null,null,null,null,null,null,null,null,null,null,null,null,null,null,null,null,null,null,null,null,null,null,null,null,null,0,"-00-01-1900"]
[{"$f":"IFERROR(VLOOKUP(C254,#REF!,9,FALSE),\"\")","v":""},{"$f":"C254&COUNTIF($C$2:C254,C254)","v":"0"},null,null,null,null,null,null,{"$f":"+TODAY()-H254","v":45142},null,null,null,null,null,null,0,0,null,null,null,null,null,null,null,null,null,null,null,null,null,null,null,null,null,null,null,null,null,null,null,null,null,null,null,null,null,null,null,0,"-00-01-1900"]
[{"$f":"IFERROR(VLOOKUP(C255,#REF!,9,FALSE),\"\")","v":""},{"$f":"C255&COUNTIF($C$2:C255,C255)","v":"0"},null,null,null,null,null,null,45142,null,null,null,null,null,null,0,0,null,null,null,null,null,null,null,null,null,null,null,null,null,null,null,null,null,null,null,null,null,null,null,null,null,null,null,null,null,null,null,0,"-00-01-1900"]
[{"$f":"IFERROR(VLOOKUP(C256,#REF!,9,FALSE),\"\")","v":""},{"$f":"C256&COUNTIF($C$2:C256,C256)","v":"0"},null,null,null,null,null,null,45142,null,null,null,null,null,null,0,0,null,null,null,null,null,null,null,null,null,null,null,null,null,null,null,null,null,null,null,null,null,null,null,null,null,null,null,null,null,null,null,0,"-00-01-1900"]
[{"$f":"IFERROR(VLOOKUP(C257,#REF!,9,FALSE),\"\")","v":""},{"$f":"C257&COUNTIF($C$2:C257,C257)","v":"0"},null,null,null,null,null,null,45142,null,null,null,null,null,null,0,0,null,null,null,null,null,null,null,null,null,null,null,null,null,null,null,null,null,null,null,null,null,null,null,null,null,null,null,null,null,null,null,0,"-00-01-1900"]
[{"$f":"IFERROR(VLOOKUP(C258,#REF!,9,FALSE),\"\")","v":""},{"$f":"C258&COUNTIF($C$2:C258,C258)","v":"0"},null,null,null,null,null,null,45142,null,null,null,null,null,null,0,0,null,null,null,null,null,null,null,null,null,null,null,null,null,null,null,null,null,null,null,null,null,null,null,null,null,null,null,null,null,null,null,0,"-00-01-1900"]
[{"$f":"IFERROR(VLOOKUP(C259,#REF!,9,FALSE),\"\")","v":""},{"$f":"C259&COUNTIF($C$2:C259,C259)","v":"0"},null,null,null,null,null,null,45142,null,null,null,null,null,null,0,0,null,null,null,null,null,null,null,null,null,null,null,null,null,null,null,null,null,null,null,null,null,null,null,null,null,null,null,null,null,null,null,{"$f":"G259-(L259++R259+T259+V259+X259+Z259+AB259+AD259+AF259+AH259+AJ259+AL259+AN259+AP259+AR259)","v":0},{"$f":"CONCATENATE(C259,\"-\",TEXT(H259,\"DD-MM-YYYY\"))","v":"-00-01-1900"}]
[{"$f":"IFERROR(VLOOKUP(C260,#REF!,9,FALSE),\"\")","v":""},{"$f":"C260&COUNTIF($C$2:C260,C260)","v":"0"},null,null,null,null,null,null,45142,null,null,null,null,null,null,0,0,null,null,null,null,null,null,null,null,null,null,null,null,null,null,null,null,null,null,null,null,null,null,null,null,null,null,null,null,null,null,null,0,"-00-01-1900"]
[{"$f":"IFERROR(VLOOKUP(C261,#REF!,9,FALSE),\"\")","v":""},{"$f":"C261&COUNTIF($C$2:C261,C261)","v":"0"},null,null,null,null,null,null,45142,null,null,null,null,null,null,0,0,null,null,null,null,null,null,null,null,null,null,null,null,null,null,null,null,null,null,null,null,null,null,null,null,null,null,null,null,null,null,null,0,"-00-01-1900"]
[{"$f":"IFERROR(VLOOKUP(C262,#REF!,9,FALSE),\"\")","v":""},{"$f":"C262&COUNTIF($C$2:C262,C262)","v":"0"},null,null,null,null,null,null,45142,null,null,null,null,null,null,0,0,null,null,null,null,null,null,null,null,null,null,null,null,null,null,null,null,null,null,null,null,null,null,null,null,null,null,null,null,null,null,null,0,"-00-01-1900"]
[{"$f":"IFERROR(VLOOKUP(C263,#REF!,9,FALSE),\"\")","v":""},{"$f":"C263&COUNTIF($C$2:C263,C263)","v":"0"},null,null,null,null,null,null,45142,null,null,null,null,null,null,0,0,null,null,null,null,null,null,null,null,null,null,null,null,null,null,null,null,null,null,null,null,null,null,null,null,null,null,null,null,null,null,null,0,"-00-01-1900"]
[{"$f":"IFERROR(VLOOKUP(C264,#REF!,9,FALSE),\"\")","v":""},{"$f":"C264&COUNTIF($C$2:C264,C264)","v":"0"},null,null,null,null,null,null,45142,null,null,null,null,null,null,0,0,null,null,null,null,null,null,null,null,null,null,null,null,null,null,null,null,null,null,null,null,null,null,null,null,null,null,null,null,null,null,null,0,"-00-01-1900"]
[{"$f":"IFERROR(VLOOKUP(C265,#REF!,9,FALSE),\"\")","v":""},{"$f":"C265&COUNTIF($C$2:C265,C265)","v":"0"},null,null,null,null,null,null,45142,null,null,null,null,null,null,{"$f":"+G265-K265-L265-M265-N265","v":0},{"$f":"+G265-R265-T265-V265-X265-Z265-AB265-AD265-AF265-AH265-AJ265-AL265-AN265-AP265-AT265-AV265","v":0},null,null,null,null,null,null,null,null,null,null,null,null,null,null,null,null,null,null,null,null,null,null,null,null,null,null,null,null,null,null,null,0,"-00-01-1900"]
[{"$f":"IFERROR(VLOOKUP(C266,#REF!,9,FALSE),\"\")","v":""},{"$f":"C266&COUNTIF($C$2:C266,C266)","v":"0"},null,null,null,null,null,null,45142,null,null,null,null,null,null,0,0,null,null,null,null,null,null,null,null,null,null,null,null,null,null,null,null,null,null,null,null,null,null,null,null,null,null,null,null,null,null,null,0,"-00-01-1900"]
[{"$f":"IFERROR(VLOOKUP(C267,#REF!,9,FALSE),\"\")","v":""},{"$f":"C267&COUNTIF($C$2:C267,C267)","v":"0"},null,null,null,null,null,null,45142,null,null,null,null,null,null,0,0,null,null,null,null,null,null,null,null,null,null,null,null,null,null,null,null,null,null,null,null,null,null,null,null,null,null,null,null,null,null,null,0,"-00-01-1900"]
[{"$f":"IFERROR(VLOOKUP(C268,#REF!,9,FALSE),\"\")","v":""},{"$f":"C268&COUNTIF($C$2:C268,C268)","v":"0"},null,null,null,null,null,null,45142,null,null,null,null,null,null,0,0,null,null,null,null,null,null,null,null,null,null,null,null,null,null,null,null,null,null,null,null,null,null,null,null,null,null,null,null,null,null,null,0,"-00-01-1900"]
[{"$f":"IFERROR(VLOOKUP(C269,#REF!,9,FALSE),\"\")","v":""},{"$f":"C269&COUNTIF($C$2:C269,C269)","v":"0"},null,null,null,null,null,null,45142,null,null,null,null,null,null,0,0,null,null,null,null,null,null,null,null,null,null,null,null,null,null,null,null,null,null,null,null,null,null,null,null,null,null,null,null,null,null,null,0,"-00-01-1900"]
[{"$f":"IFERROR(VLOOKUP(C270,#REF!,9,FALSE),\"\")","v":""},{"$f":"C270&COUNTIF($C$2:C270,C270)","v":"0"},null,null,null,null,null,null,45142,null,null,null,null,null,null,0,0,null,null,null,null,null,null,null,null,null,null,null,null,null,null,null,null,null,null,null,null,null,null,null,null,null,null,null,null,null,null,null,0,"-00-01-1900"]
[{"$f":"IFERROR(VLOOKUP(C271,#REF!,9,FALSE),\"\")","v":""},{"$f":"C271&COUNTIF($C$2:C271,C271)","v":"0"},null,null,null,null,null,null,45142,null,null,null,null,null,null,0,0,null,null,null,null,null,null,null,null,null,null,null,null,null,null,null,null,null,null,null,null,null,null,null,null,null,null,null,null,null,null,null,0,"-00-01-1900"]
[{"$f":"IFERROR(VLOOKUP(C272,#REF!,9,FALSE),\"\")","v":""},{"$f":"C272&COUNTIF($C$2:C272,C272)","v":"0"},null,null,null,null,null,null,45142,null,null,null,null,null,null,0,0,null,null,null,null,null,null,null,null,null,null,null,null,null,null,null,null,null,null,null,null,null,null,null,null,null,null,null,null,null,null,null,0,"-00-01-1900"]
[{"$f":"IFERROR(VLOOKUP(C273,#REF!,9,FALSE),\"\")","v":""},{"$f":"C273&COUNTIF($C$2:C273,C273)","v":"0"},null,null,null,null,null,null,45142,null,null,null,null,null,null,0,0,null,null,null,null,null,null,null,null,null,null,null,null,null,null,null,null,null,null,null,null,null,null,null,null,null,null,null,null,null,null,null,0,"-00-01-1900"]
[{"$f":"IFERROR(VLOOKUP(C274,#REF!,9,FALSE),\"\")","v":""},{"$f":"C274&COUNTIF($C$2:C274,C274)","v":"0"},null,null,null,null,null,null,45142,null,null,null,null,null,null,0,0,null,null,null,null,null,null,null,null,null,null,null,null,null,null,null,null,null,null,null,null,null,null,null,null,null,null,null,null,null,null,null,0,"-00-01-1900"]
[{"$f":"IFERROR(VLOOKUP(C275,#REF!,9,FALSE),\"\")","v":""},{"$f":"C275&COUNTIF($C$2:C275,C275)","v":"0"},null,null,null,null,null,null,45142,null,null,null,null,null,null,0,0,null,null,null,null,null,null,null,null,null,null,null,null,null,null,null,null,null,null,null,null,null,null,null,null,null,null,null,null,null,null,null,0,"-00-01-1900"]
[{"$f":"IFERROR(VLOOKUP(C276,#REF!,9,FALSE),\"\")","v":""},{"$f":"C276&COUNTIF($C$2:C276,C276)","v":"0"},null,null,null,null,null,null,45142,null,null,null,null,null,null,0,0,null,null,null,null,null,null,null,null,null,null,null,null,null,null,null,null,null,null,null,null,null,null,null,null,null,null,null,null,null,null,null,0,"-00-01-1900"]
[{"$f":"IFERROR(VLOOKUP(C277,#REF!,9,FALSE),\"\")","v":""},{"$f":"C277&COUNTIF($C$2:C277,C277)","v":"0"},null,null,null,null,null,null,45142,null,null,null,null,null,null,0,0,null,null,null,null,null,null,null,null,null,null,null,null,null,null,null,null,null,null,null,null,null,null,null,null,null,null,null,null,null,null,null,0,"-00-01-1900"]
[{"$f":"IFERROR(VLOOKUP(C278,#REF!,9,FALSE),\"\")","v":""},{"$f":"C278&COUNTIF($C$2:C278,C278)","v":"0"},null,null,null,null,null,null,45142,null,null,null,null,null,null,0,0,null,null,null,null,null,null,null,null,null,null,null,null,null,null,null,null,null,null,null,null,null,null,null,null,null,null,null,null,null,null,null,0,"-00-01-1900"]
[{"$f":"IFERROR(VLOOKUP(C279,#REF!,9,FALSE),\"\")","v":""},{"$f":"C279&COUNTIF($C$2:C279,C279)","v":"0"},null,null,null,null,null,null,45142,null,null,null,null,null,null,0,0,null,null,null,null,null,null,null,null,null,null,null,null,null,null,null,null,null,null,null,null,null,null,null,null,null,null,null,null,null,null,null,0,"-00-01-1900"]
[{"$f":"IFERROR(VLOOKUP(C280,#REF!,9,FALSE),\"\")","v":""},{"$f":"C280&COUNTIF($C$2:C280,C280)","v":"0"},null,null,null,null,null,null,45142,null,null,null,null,null,null,0,0,null,null,null,null,null,null,null,null,null,null,null,null,null,null,null,null,null,null,null,null,null,null,null,null,null,null,null,null,null,null,null,0,"-00-01-1900"]
[{"$f":"IFERROR(VLOOKUP(C281,#REF!,9,FALSE),\"\")","v":""},{"$f":"C281&COUNTIF($C$2:C281,C281)","v":"0"},null,null,null,null,null,null,45142,null,null,null,null,null,null,0,0,null,null,null,null,null,null,null,null,null,null,null,null,null,null,null,null,null,null,null,null,null,null,null,null,null,null,null,null,null,null,null,0,"-00-01-1900"]
[{"$f":"IFERROR(VLOOKUP(C282,#REF!,9,FALSE),\"\")","v":""},{"$f":"C282&COUNTIF($C$2:C282,C282)","v":"0"},null,null,null,null,null,null,45142,null,null,null,null,null,null,0,0,null,null,null,null,null,null,null,null,null,null,null,null,null,null,null,null,null,null,null,null,null,null,null,null,null,null,null,null,null,null,null,0,"-00-01-1900"]
[{"$f":"IFERROR(VLOOKUP(C283,#REF!,9,FALSE),\"\")","v":""},{"$f":"C283&COUNTIF($C$2:C283,C283)","v":"0"},null,null,null,null,null,null,45142,null,null,null,null,null,null,0,0,null,null,null,null,null,null,null,null,null,null,null,null,null,null,null,null,null,null,null,null,null,null,null,null,null,null,null,null,null,null,null,0,"-00-01-1900"]
[{"$f":"IFERROR(VLOOKUP(C284,#REF!,9,FALSE),\"\")","v":""},{"$f":"C284&COUNTIF($C$2:C284,C284)","v":"0"},null,null,null,null,null,null,45142,null,null,null,null,null,null,0,0,null,null,null,null,null,null,null,null,null,null,null,null,null,null,null,null,null,null,null,null,null,null,null,null,null,null,null,null,null,null,null,0,"-00-01-1900"]
[{"$f":"IFERROR(VLOOKUP(C285,#REF!,9,FALSE),\"\")","v":""},{"$f":"C285&COUNTIF($C$2:C285,C285)","v":"0"},null,null,null,null,null,null,45142,null,null,null,null,null,null,0,0,null,null,null,null,null,null,null,null,null,null,null,null,null,null,null,null,null,null,null,null,null,null,null,null,null,null,null,null,null,null,null,0,"-00-01-1900"]
[{"$f":"IFERROR(VLOOKUP(C286,#REF!,9,FALSE),\"\")","v":""},{"$f":"C286&COUNTIF($C$2:C286,C286)","v":"0"},null,null,null,null,null,null,45142,null,null,null,null,null,null,0,0,null,null,null,null,null,null,null,null,null,null,null,null,null,null,null,null,null,null,null,null,null,null,null,null,null,null,null,null,null,null,null,0,"-00-01-1900"]
[{"$f":"IFERROR(VLOOKUP(C287,#REF!,9,FALSE),\"\")","v":""},{"$f":"C287&COUNTIF($C$2:C287,C287)","v":"0"},null,null,null,null,null,null,45142,null,null,null,null,null,null,0,0,null,null,null,null,null,null,null,null,null,null,null,null,null,null,null,null,null,null,null,null,null,null,null,null,null,null,null,null,null,null,null,0,"-00-01-1900"]
[{"$f":"IFERROR(VLOOKUP(C288,#REF!,9,FALSE),\"\")","v":""},{"$f":"C288&COUNTIF($C$2:C288,C288)","v":"0"},null,null,null,null,null,null,45142,null,null,null,null,null,null,0,0,null,null,null,null,null,null,null,null,null,null,null,null,null,null,null,null,null,null,null,null,null,null,null,null,null,null,null,null,null,null,null,0,"-00-01-1900"]
[null,null,null,null,null,null,{"$f":"SUM(G2:G288)","v":65526271.429999985},null,null,null,null,{"$f":"SUM(L2:L288)","v":853628.4341599996},null,null,null,null,null,{"$f":"SUM(R2:R288)","v":0},null,{"$f":"SUM(T2:T288)","v":0},null,{"$f":"SUM(V2:V288)","v":0},null,{"$f":"SUM(X2:X288)","v":0},null,{"$f":"SUM(Z2:Z288)","v":0},null,{"$f":"SUM(AB2:AB288)","v":0},null,{"$f":"SUM(AD2:AD288)","v":0},null,{"$f":"SUM(AF2:AF288)","v":0},null,{"$f":"SUM(AH2:AH288)","v":0},null,{"$f":"SUM(AJ2:AJ288)","v":0},null,{"$f":"SUM(AL2:AL288)","v":0},null,{"$f":"SUM(AN2:AN288)","v":0},null,{"$f":"SUM(AP2:AP288)","v":0},null,{"$f":"SUM(AR2:AR288)","v":0},null,{"$f":"SUM(AT2:AT288)","v":0},null,{"$f":"SUM(AV2:AV288)","v":0},0,{"$f":"SUM(AX60:AX288)","v":0}]
[]
[]
[]
[]
[]
[null,null,"Totalsumb",null,null,null,{"$f":"D295-D299","v":0}]
[null,null,"TotalPaid"]
[null,null,"TotalRejected",null,null,null,{"$f":"D296+G295","v":0}]
[null,null,"TotalTax"]
[null,null,"TotalPaid-Rejecteed-Tax"]

{"sheet":"Month 06-2023","index":2,"n_rows":283,"n_cols":50,"rows_kept":283,"cut":false,"hidden":false,"merged":[]}
["Status","Helper","Provider Code",null,"BATCH NO:","Number of claims","AMOUNT","Date Received ","TAT","Date posting","Paid","Rejected","H.H","Pending","Comment","Rev Diff","Pay Diff","Taxes","Checks no.","Amount checks","Checks no.","Amount checks","Checks no.","Amount checks","Checks no.","Amount checks","Checks no.","Amount checks","Checks no.","Amount checks","Checks no.","Amount checks","Checks no.","Amount checks","Checks no.","Amount checks","Checks no.","Amount checks","Checks no.","Amount checks","Checks no.","Amount checks","Checks no.","Amount checks","Checks no.","Amount checks","Checks no.","Amount checks","TAT",{"$f":"CONCATENATE(C1,\"-\",TEXT(H1,\"DD-MM-YYYY\"))","v":"Provider Code-Date Received "}]
[{"$f":"IFERROR(VLOOKUP(C2,#REF!,9,FALSE),\"\")","v":""},{"$f":"C2&COUNTIF($C$2:C2,C2)","v":"FCC03801"},"FCC0380",null,null,30,300862,"2023-06-01",{"$f":"+TODAY()-H2","v":64},"2023-06-21",295796.83,1065.1700000000419,4000,0,0,{"$f":"+G2-K2-L2-M2-N2","v":-5.8207660913467407E-11},{"$f":"+G2-R2-T2-V2-X2-Z2-AB2-AD2-AF2-AH2-AJ2-AL2-AN2-AP2-AT2-AV2","v":300862},null,null,null,null,null,null,null,null,null,null,null,null,null,null,null,null,null,null,null,null,null,null,null,null,null,null,null,null,null,null,null,{"$f":"G2-(L2++R2+T2+V2+X2+Z2+AB2+AD2+AF2+AH2+AJ2+AL2+AN2+AP2+AR2)","v":299796.82999999996},{"$f":"CONCATENATE(C2,\"-\",TEXT(H2,\"DD-MM-YYYY\"))","v":"FCC0380-01-06-2023"}]
[{"$f":"IFERROR(VLOOKUP(C3,#REF!,9,FALSE),\"\")","v":""},{"$f":"C3&COUNTIF($C$2:C3,C3)","v":"FCC05801"},"FCC0580",null,"advance",63,1188652,"2023-06-01",64,"2023-06-20",1096373.7,92278.259999999893,0,0,0,0,1188652,null,null,null,null,null,null,null,null,null,null,null,null,null,null,null,null,null,null,null,null,null,null,null,null,null,null,null,null,null,null,null,{"$f":"G3-(L3++R3+T3+V3+X3+Z3+AB3+AD3+AF3+AH3+AJ3+AL3+AN3+AP3+AR3)","v":1096373.7400000002},{"$f":"CONCATENATE(C3,\"-\",TEXT(H3,\"DD-MM-YYYY\"))","v":"FCC0580-01-06-2023"}]
[{"$f":"IFERROR(VLOOKUP(C4,#REF!,9,FALSE),\"\")","v":""},{"$f":"C4&COUNTIF($C$2:C4,C4)","v":"FCX27981"},"FCX2798",null,null,24,262832.7,"2023-06-01",64,"2023-07-31",261142.11,1690.5900000000256,0,0,"new ",0,262832.7,null,null,null,null,null,null,null,null,null,null,null,null,null,null,null,null,null,null,null,null,null,null,null,null,null,null,null,null,null,null,null,261142.11,"FCX2798-01-06-2023"]
[{"$f":"IFERROR(VLOOKUP(C5,#REF!,9,FALSE),\"\")","v":""},{"$f":"C5&COUNTIF($C$2:C5,C5)","v":"FCC31201"},"FCC3120",null,null,54,1054309.94,"2023-06-01",64,"2023-06-20",1051730.8600000001,112.06999999984146,2467.0100000000002,0,"Discount Difference claims 10 and 13",0,1054309.94,null,null,null,null,null,null,null,null,null,null,null,null,null,null,null,null,null,null,null,null,null,null,null,null,null,null,null,null,null,null,null,1054197.8700000001,"FCC3120-01-06-2023"]
[{"$f":"IFERROR(VLOOKUP(C6,#REF!,9,FALSE),\"\")","v":""},{"$f":"C6&COUNTIF($C$2:C6,C6)","v":"FCJ20401"},"FCJ2040",null,null,2,11431,"2023-06-01",64,null,null,null,null,null,null,11431,11431,null,null,null,null,null,null,null,null,null,null,null,null,null,null,null,null,null,null,null,null,null,null,null,null,null,null,null,null,null,null,null,11431,"FCJ2040-01-06-2023"]
[{"$f":"IFERROR(VLOOKUP(C7,#REF!,9,FALSE),\"\")","v":""},{"$f":"C7&COUNTIF($C$2:C7,C7)","v":"FCN31001"},"FCN3100",null,null,2,6105,"2023-06-04",61,null,null,null,null,null,null,6105,6105,null,null,null,null,null,null,null,null,null,null,null,null,null,null,null,null,null,null,null,null,null,null,null,null,null,null,null,null,null,null,null,6105,"FCN3100-04-06-2023"]
[{"$f":"IFERROR(VLOOKUP(C8,#REF!,9,FALSE),\"\")","v":""},{"$f":"C8&COUNTIF($C$2:C8,C8)","v":"FCX12301"},"FCX1230",null,null,1,4731.7,"2023-06-04",61,null,null,null,null,null,null,4731.7,4731.7,null,null,null,null,null,null,null,null,null,null,null,null,null,null,null,null,null,null,null,null,null,null,null,null,null,null,null,null,null,null,null,4731.7,"FCX1230-04-06-2023"]
[{"$f":"IFERROR(VLOOKUP(C9,#REF!,9,FALSE),\"\")","v":""},{"$f":"C9&COUNTIF($C$2:C9,C9)","v":"FCB28001"},"FCB2800",null,null,7,71000,"2023-06-04",61,null,null,null,null,null,null,71000,71000,null,null,null,null,null,null,null,null,null,null,null,null,null,null,null,null,null,null,null,null,null,null,null,null,null,null,null,null,null,null,null,71000,"FCB2800-04-06-2023"]
[{"$f":"IFERROR(VLOOKUP(C10,#REF!,9,FALSE),\"\")","v":""},{"$f":"C10&COUNTIF($C$2:C10,C10)","v":"FCC15901"},"FCC1590",null,null,8,41650,"2023-06-05",60,"2023-07-13",38710,7284.1699999999983,0,0,"coinsurance",-4344.1699999999983,41650,null,null,null,null,null,null,null,null,null,null,null,null,null,null,null,null,null,null,null,null,null,null,null,null,null,null,null,null,null,null,null,34365.83,"FCC1590-05-06-2023"]
[{"$f":"IFERROR(VLOOKUP(C11,#REF!,9,FALSE),\"\")","v":""},{"$f":"C11&COUNTIF($C$2:C11,C11)","v":"FCC91621"},"FCC9162",null,"advance",20,325527,"2023-06-05",60,"2023-06-21",314393.03999999998,4443.9499999999971,6690,0,"NEW",0,325527,null,null,null,null,null,null,null,null,null,null,null,null,null,null,null,null,null,null,null,null,null,null,null,null,null,null,null,null,null,null,null,321083.05,"FCC9162-05-06-2023"]
[{"$f":"IFERROR(VLOOKUP(C12,#REF!,9,FALSE),\"\")","v":""},{"$f":"C12&COUNTIF($C$2:C12,C12)","v":"FCB31941"},"FCB3194",null,null,9,49440.06,"2023-06-05",60,null,null,null,null,null,null,49440.06,49440.06,null,null,null,null,null,null,null,null,null,null,null,null,null,null,null,null,null,null,null,null,null,null,null,null,null,null,null,null,null,null,null,49440.06,"FCB3194-05-06-2023"]
[{"$f":"IFERROR(VLOOKUP(C13,#REF!,9,FALSE),\"\")","v":""},{"$f":"C13&COUNTIF($C$2:C13,C13)","v":"FCC33101"},"FCC3310",null,null,3,17661.09,"2023-06-05",60,null,null,null,null,null,null,17661.09,17661.09,null,null,null,null,null,null,null,null,null,null,null,null,null,null,null,null,null,null,null,null,null,null,null,null,null,null,null,null,null,null,null,17661.09,"FCC3310-05-06-2023"]
[{"$f":"IFERROR(VLOOKUP(C14,#REF!,9,FALSE),\"\")","v":""},{"$f":"C14&COUNTIF($C$2:C14,C14)","v":"FCC01501"},"FCC0150",null,"advance",16,287761,"2023-06-05",60,"2023-06-21",286208.13,1552.8699999999953,0,0,0,0,287761,null,null,null,null,null,null,null,null,null,null,null,null,null,null,null,null,null,null,null,null,null,null,null,null,null,null,null,null,null,null,null,286208.13,"FCC0150-05-06-2023"]
[{"$f":"IFERROR(VLOOKUP(C15,#REF!,9,FALSE),\"\")","v":""},{"$f":"C15&COUNTIF($C$2:C15,C15)","v":"FCC91541"},"FCC9154",null,null,10,445860.48,"2023-06-05",60,"2023-07-19",277580,1.4799999999813735,44999,123280,0,0,445860.48,null,null,null,null,null,null,null,null,null,null,null,null,null,null,null,null,null,null,null,null,null,null,null,null,null,null,null,null,null,null,null,445859,"FCC9154-05-06-2023"]
[{"$f":"IFERROR(VLOOKUP(C16,#REF!,9,FALSE),\"\")","v":""},{"$f":"C16&COUNTIF($C$2:C16,C16)","v":"FCX27951"},"FCX2795",null,null,6,16471.650000000001,"2023-06-05",60,null,null,null,null,null,null,16471.650000000001,16471.650000000001,null,null,null,null,null,null,null,null,null,null,null,null,null,null,null,null,null,null,null,null,null,null,null,null,null,null,null,null,null,null,null,16471.650000000001,"FCX2795-05-06-2023"]
[{"$f":"IFERROR(VLOOKUP(C17,#REF!,9,FALSE),\"\")","v":""},{"$f":"C17&COUNTIF($C$2:C17,C17)","v":"FCC35701"},"FCC3570",null,"advance",4,53457.46,"2023-06-05",60,null,null,null,null,null,null,53457.46,53457.46,null,null,null,null,null,null,null,null,null,null,null,null,null,null,null,null,null,null,null,null,null,null,null,null,null,null,null,null,null,null,null,53457.46,"FCC3570-05-06-2023"]
[{"$f":"IFERROR(VLOOKUP(C18,#REF!,9,FALSE),\"\")","v":""},{"$f":"C18&COUNTIF($C$2:C18,C18)","v":"FCK34201"},"FCK3420",null,"advance",49,369835.87,"2023-06-06",59,"2023-06-19",369367.87,468,0,0,0,0,369835.87,null,null,null,null,null,null,null,null,null,null,null,null,null,null,null,null,null,null,null,null,null,null,null,null,null,null,null,null,null,null,null,369367.87,"FCK3420-06-06-2023"]
[{"$f":"IFERROR(VLOOKUP(C19,#REF!,9,FALSE),\"\")","v":""},{"$f":"C19&COUNTIF($C$2:C19,C19)","v":"FCC02001"},"FCC0200",null,"advance",27,494878.74,"2023-06-06",59,"2023-07-12",397810.21,42050.20999999997,0,55018.32,0,0,494878.74,null,null,null,null,null,null,null,null,null,null,null,null,null,null,null,null,null,null,null,null,null,null,null,null,null,null,null,null,null,null,null,452828.53,"FCC0200-06-06-2023"]
[{"$f":"IFERROR(VLOOKUP(C20,#REF!,9,FALSE),\"\")","v":""},{"$f":"C20&COUNTIF($C$2:C20,C20)","v":"FCS10601"},"FCS1060",null,null,7,31620.5,"2023-06-06",59,null,null,null,null,null,null,31620.5,31620.5,null,null,null,null,null,null,null,null,null,null,null,null,null,null,null,null,null,null,null,null,null,null,null,null,null,null,null,null,null,null,null,31620.5,"FCS1060-06-06-2023"]
[{"$f":"IFERROR(VLOOKUP(C21,#REF!,9,FALSE),\"\")","v":""},{"$f":"C21&COUNTIF($C$2:C21,C21)","v":"FCX27961"},"FCX2796",null,null,7,25867.9,"2023-06-06",59,null,null,null,null,null,null,25867.9,25867.9,null,null,null,null,null,null,null,null,null,null,null,null,null,null,null,null,null,null,null,null,null,null,null,null,null,null,null,null,null,null,null,25867.9,"FCX2796-06-06-2023"]
[{"$f":"IFERROR(VLOOKUP(C22,#REF!,9,FALSE),\"\")","v":""},{"$f":"C22&COUNTIF($C$2:C22,C22)","v":"FCC91611"},"FCC9161",null,null,1,14000,"2023-06-06",59,null,null,null,null,null,null,14000,14000,null,null,null,null,null,null,null,null,null,null,null,null,null,null,null,null,null,null,null,null,null,null,null,null,null,null,null,null,null,null,null,14000,"FCC9161-06-06-2023"]
[{"$f":"IFERROR(VLOOKUP(C23,#REF!,9,FALSE),\"\")","v":""},{"$f":"C23&COUNTIF($C$2:C23,C23)","v":"FCE01001"},"FCE0100",null,null,8,78110,"2023-06-06",59,null,null,null,null,null,null,78110,78110,null,null,null,null,null,null,null,null,null,null,null,null,null,null,null,null,null,null,null,null,null,null,null,null,null,null,null,null,null,null,null,78110,"FCE0100-06-06-2023"]
[{"$f":"IFERROR(VLOOKUP(C24,#REF!,9,FALSE),\"\")","v":""},{"$f":"C24&COUNTIF($C$2:C24,C24)","v":"FCC32001"},"FCC3200",null,"advance",17,391435.09,"2023-06-06",59,null,null,null,null,null,null,391435.09,391435.09,null,null,null,null,null,null,null,null,null,null,null,null,null,null,null,null,null,null,null,null,null,null,null,null,null,null,null,null,null,null,null,391435.09,"FCC3200-06-06-2023"]
[{"$f":"IFERROR(VLOOKUP(C25,#REF!,9,FALSE),\"\")","v":""},{"$f":"C25&COUNTIF($C$2:C25,C25)","v":"FCC91451"},"FCC9145",null,null,1,17156,"2023-06-06",59,null,null,null,null,null,null,17156,17156,null,null,null,null,null,null,null,null,null,null,null,null,null,null,null,null,null,null,null,null,null,null,null,null,null,null,null,null,null,null,null,17156,"FCC9145-06-06-2023"]
[{"$f":"IFERROR(VLOOKUP(C26,#REF!,9,FALSE),\"\")","v":""},{"$f":"C26&COUNTIF($C$2:C26,C26)","v":"FCP32811"},"FCP3281",null,null,1,7922.63,"2023-06-07",58,null,null,null,null,null,null,7922.63,7922.63,null,null,null,null,null,null,null,null,null,null,null,null,null,null,null,null,null,null,null,null,null,null,null,null,null,null,null,null,null,null,null,7922.63,"FCP3281-07-06-2023"]
[{"$f":"IFERROR(VLOOKUP(C27,#REF!,9,FALSE),\"\")","v":""},{"$f":"C27&COUNTIF($C$2:C27,C27)","v":"FCL32101"},"FCL3210",null,null,6,85291,"2023-06-07",58,null,null,null,null,null,null,85291,85291,null,null,null,null,null,null,null,null,null,null,null,null,null,null,null,null,null,null,null,null,null,null,null,null,null,null,null,null,null,null,null,85291,"FCL3210-07-06-2023"]
[{"$f":"IFERROR(VLOOKUP(C28,#REF!,9,FALSE),\"\")","v":""},{"$f":"C28&COUNTIF($C$2:C28,C28)","v":"FCX34801"},"FCX3480",null,null,2,14008.27,"2023-06-07",58,null,null,null,null,null,null,14008.27,14008.27,null,null,null,null,null,null,null,null,null,null,null,null,null,null,null,null,null,null,null,null,null,null,null,null,null,null,null,null,null,null,null,14008.27,"FCX3480-07-06-2023"]
[{"$f":"IFERROR(VLOOKUP(C29,#REF!,9,FALSE),\"\")","v":""},{"$f":"C29&COUNTIF($C$2:C29,C29)","v":"FCN31451"},"FCN3145",null,null,32,27953.9,"2023-06-07",58,"2023-07-12",27464.5,489.40000000000146,0,0,0,0,27953.9,null,null,null,null,null,null,null,null,null,null,null,null,null,null,null,null,null,null,null,null,null,null,null,null,null,null,null,null,null,null,null,27464.5,"FCN3145-07-06-2023"]
[{"$f":"IFERROR(VLOOKUP(C30,#REF!,9,FALSE),\"\")","v":""},{"$f":"C30&COUNTIF($C$2:C30,C30)","v":"FCX27931"},"FCX2793",null,null,4,32483.38,"2023-06-07",58,null,null,null,null,null,null,32483.38,32483.38,null,null,null,null,null,null,null,null,null,null,null,null,null,null,null,null,null,null,null,null,null,null,null,null,null,null,null,null,null,null,null,32483.38,"FCX2793-07-06-2023"]
[{"$f":"IFERROR(VLOOKUP(C31,#REF!,9,FALSE),\"\")","v":""},{"$f":"C31&COUNTIF($C$2:C31,C31)","v":"FCF26101"},"FCF2610",null,null,13,63553,"2023-06-07",58,"2023-07-12",60484.37,3068.6700000000019,0,0,0,0,63553,null,null,null,null,null,null,null,null,null,null,null,null,null,null,null,null,null,null,null,null,null,null,null,null,null,null,null,null,null,null,null,60484.33,"FCF2610-07-06-2023"]
[{"$f":"IFERROR(VLOOKUP(C32,#REF!,9,FALSE),\"\")","v":""},{"$f":"C32&COUNTIF($C$2:C32,C32)","v":"FCH17901"},"FCH1790",null,"advance",6,227086,"2023-06-07",58,null,null,null,null,null,null,227086,227086,null,null,null,null,null,null,null,null,null,null,null,null,null,null,null,null,null,null,null,null,null,null,null,null,null,null,null,null,null,null,null,227086,"FCH1790-07-06-2023"]
[{"$f":"IFERROR(VLOOKUP(C33,#REF!,9,FALSE),\"\")","v":""},{"$f":"C33&COUNTIF($C$2:C33,C33)","v":"FCF24701"},"FCF2470",null,null,1,5149.05,"2023-06-07",58,null,null,null,null,null,null,5149.05,5149.05,null,null,null,null,null,null,null,null,null,null,null,null,null,null,null,null,null,null,null,null,null,null,null,null,null,null,null,null,null,null,null,5149.05,"FCF2470-07-06-2023"]
[{"$f":"IFERROR(VLOOKUP(C34,#REF!,9,FALSE),\"\")","v":""},{"$f":"C34&COUNTIF($C$2:C34,C34)","v":"FCC91551"},"FCC9155",null,null,3,165940.75,"2023-06-07",58,null,null,null,null,null,null,165940.75,165940.75,null,null,null,null,null,null,null,null,null,null,null,null,null,null,null,null,null,null,null,null,null,null,null,null,null,null,null,null,null,null,null,165940.75,"FCC9155-07-06-2023"]
[{"$f":"IFERROR(VLOOKUP(C35,#REF!,9,FALSE),\"\")","v":""},{"$f":"C35&COUNTIF($C$2:C35,C35)","v":"FCF26141"},"FCF2614",null,null,5,61456.66,"2023-06-07",58,null,null,null,null,null,null,61456.66,61456.66,null,null,null,null,null,null,null,null,null,null,null,null,null,null,null,null,null,null,null,null,null,null,null,null,null,null,null,null,null,null,null,61456.66,"FCF2614-07-06-2023"]
[{"$f":"IFERROR(VLOOKUP(C36,#REF!,9,FALSE),\"\")","v":""},{"$f":"C36&COUNTIF($C$2:C36,C36)","v":"FCN33701"},"FCN3370",null,null,5,72840,"2023-06-07",58,null,null,null,null,null,null,72840,72840,null,null,null,null,null,null,null,null,null,null,null,null,null,null,null,null,null,null,null,null,null,null,null,null,null,null,null,null,null,null,null,72840,"FCN3370-07-06-2023"]
[{"$f":"IFERROR(VLOOKUP(C37,#REF!,9,FALSE),\"\")","v":""},{"$f":"C37&COUNTIF($C$2:C37,C37)","v":"FCC00801"},"FCC0080",null,null,23,105856.64,"2023-06-07",58,"2023-07-12",102557.39,0,3299.25,0,0,0,105856.64,null,null,null,null,null,null,null,null,null,null,null,null,null,null,null,null,null,null,null,null,null,null,null,null,null,null,null,null,null,null,null,105856.64,"FCC0080-07-06-2023"]
[{"$f":"IFERROR(VLOOKUP(C38,#REF!,9,FALSE),\"\")","v":""},{"$f":"C38&COUNTIF($C$2:C38,C38)","v":"FCC91801"},"FCC9180",null,null,21,374744.64,"2023-06-07",58,"2023-07-09",347452.99,20237.869999999992,7053.78,0,"new",3.1832314562052488E-11,374744.64,null,null,null,null,null,null,null,null,null,null,null,null,null,null,null,null,null,null,null,null,null,null,null,null,null,null,null,null,null,null,null,354506.77,"FCC9180-07-06-2023"]
[{"$f":"IFERROR(VLOOKUP(C39,#REF!,9,FALSE),\"\")","v":""},{"$f":"C39&COUNTIF($C$2:C39,C39)","v":"FCC35101"},"FCC3510",null,null,2,5609,"2023-06-07",58,null,null,null,null,null,null,5609,5609,null,null,null,null,null,null,null,null,null,null,null,null,null,null,null,null,null,null,null,null,null,null,null,null,null,null,null,null,null,null,null,5609,"FCC3510-07-06-2023"]
[{"$f":"IFERROR(VLOOKUP(C40,#REF!,9,FALSE),\"\")","v":""},{"$f":"C40&COUNTIF($C$2:C40,C40)","v":"FCC00701"},"FCC0070",null,null,5,10351,"2023-06-07",58,null,null,null,null,null,null,10351,10351,null,null,null,null,null,null,null,null,null,null,null,null,null,null,null,null,null,null,null,null,null,null,null,null,null,null,null,null,null,null,null,10351,"FCC0070-07-06-2023"]
[{"$f":"IFERROR(VLOOKUP(C41,#REF!,9,FALSE),\"\")","v":""},{"$f":"C41&COUNTIF($C$2:C41,C41)","v":"FCC27801"},"FCC2780",null,null,25,164540,"2023-06-07",58,null,null,null,null,null,null,164540,164540,null,null,null,null,null,null,null,null,null,null,null,null,null,null,null,null,null,null,null,null,null,null,null,null,null,null,null,null,null,null,null,164540,"FCC2780-07-06-2023"]
[{"$f":"IFERROR(VLOOKUP(C42,#REF!,9,FALSE),\"\")","v":""},{"$f":"C42&COUNTIF($C$2:C42,C42)","v":"FCX27401"},"FCX2740",null,"advance",97,1097716.6000000001,"2023-06-07",58,"2023-07-10",1067717.1499999999,17076.910000000185,12922.54,0,0,0,1097716.6000000001,null,null,null,null,null,null,null,null,null,null,null,null,null,null,null,null,null,null,null,null,null,null,null,null,null,null,null,null,null,null,null,1080639.69,"FCX2740-07-06-2023"]
[{"$f":"IFERROR(VLOOKUP(C43,#REF!,9,FALSE),\"\")","v":""},{"$f":"C43&COUNTIF($C$2:C43,C43)","v":"FCC27301"},"FCC2730",null,"advance",24,316356,"2023-06-07",58,null,null,null,null,null,null,316356,316356,null,null,null,null,null,null,null,null,null,null,null,null,null,null,null,null,null,null,null,null,null,null,null,null,null,null,null,null,null,null,null,316356,"FCC2730-07-06-2023"]
[{"$f":"IFERROR(VLOOKUP(C44,#REF!,9,FALSE),\"\")","v":""},{"$f":"C44&COUNTIF($C$2:C44,C44)","v":"FCC91851"},"FCC9185",null,null,11,149095.79999999999,"2023-06-07",58,"2023-07-18",139471.63,9624.1699999999837,0,0,0,0,149095.79999999999,null,null,null,null,null,null,null,null,null,null,null,null,null,null,null,null,null,null,null,null,null,null,null,null,null,null,null,null,null,null,null,139471.63,"FCC9185-07-06-2023"]
[{"$f":"IFERROR(VLOOKUP(C45,#REF!,9,FALSE),\"\")","v":""},{"$f":"C45&COUNTIF($C$2:C45,C45)","v":"FCC21801"},"FCC2180",null,"advance",69,3044017.36,"2023-06-07",58,"2023-06-20",2656165.5699999998,3877.1000000000349,175374.7,208599.99,"UPDATED",0,3044017.36,null,null,null,null,null,null,null,null,null,null,null,null,null,null,null,null,null,null,null,null,null,null,null,null,null,null,null,null,null,null,null,3040140.26,"FCC2180-07-06-2023"]
[{"$f":"IFERROR(VLOOKUP(C46,#REF!,9,FALSE),\"\")","v":""},{"$f":"C46&COUNTIF($C$2:C46,C46)","v":"FCM27611"},"FCM2761",null,null,1,3305,"2023-06-08",57,"2023-07-27",2735,570,0,0,0,0,3305,null,null,null,null,null,null,null,null,null,null,null,null,null,null,null,null,null,null,null,null,null,null,null,null,null,null,null,null,null,null,null,2735,"FCM2761-08-06-2023"]
[{"$f":"IFERROR(VLOOKUP(C47,#REF!,9,FALSE),\"\")","v":""},{"$f":"C47&COUNTIF($C$2:C47,C47)","v":"FCX16201"},"FCX1620",null,null,2,38625,"2023-06-08",57,"2023-07-27",38600,25,0,0,0,0,38625,null,null,null,null,null,null,null,null,null,null,null,null,null,null,null,null,null,null,null,null,null,null,null,null,null,null,null,null,null,null,null,38600,"FCX1620-08-06-2023"]
[{"$f":"IFERROR(VLOOKUP(C48,#REF!,9,FALSE),\"\")","v":""},{"$f":"C48&COUNTIF($C$2:C48,C48)","v":"FCC01101"},"FCC0110",null,"advance",158,3961930.06,"2023-06-08",57,"2023-06-20",3890031.03,0,5066.18,66832.850000000268,0,0,3961930.06,null,null,null,null,null,null,null,null,null,null,null,null,null,null,null,null,null,null,null,null,null,null,null,null,null,null,null,null,null,null,null,3961930.06,"FCC0110-08-06-2023"]
[{"$f":"IFERROR(VLOOKUP(C49,#REF!,9,FALSE),\"\")","v":""},{"$f":"C49&COUNTIF($C$2:C49,C49)","v":"FCC91931"},"FCC9193",null,null,9,381826.24,"2023-06-08",57,"2023-07-19",44839,0,0,336987.24,0,0,381826.24,null,null,null,null,null,null,null,null,null,null,null,null,null,null,null,null,null,null,null,null,null,null,null,null,null,null,null,null,null,null,null,381826.24,"FCC9193-08-06-2023"]
[{"$f":"IFERROR(VLOOKUP(C50,#REF!,9,FALSE),\"\")","v":""},{"$f":"C50&COUNTIF($C$2:C50,C50)","v":"FCC91901"},"FCC9190",null,null,3,11255,"2023-06-08",57,"2023-07-27",11255,0,0,0,0,0,11255,null,null,null,null,null,null,null,null,null,null,null,null,null,null,null,null,null,null,null,null,null,null,null,null,null,null,null,null,null,null,null,11255,"FCC9190-08-06-2023"]
[{"$f":"IFERROR(VLOOKUP(C51,#REF!,9,FALSE),\"\")","v":""},{"$f":"C51&COUNTIF($C$2:C51,C51)","v":"FCC15801"},"FCC1580",null,"advance",104,2172841,"2023-06-08",57,"2023-07-13",1571316.49,0,179.2,601345.31000000006,0,0,2172841,null,null,null,null,null,null,null,null,null,null,null,null,null,null,null,null,null,null,null,null,null,null,null,null,null,null,null,null,null,null,null,2172841,"FCC1580-08-06-2023"]
[{"$f":"IFERROR(VLOOKUP(C52,#REF!,9,FALSE),\"\")","v":""},{"$f":"C52&COUNTIF($C$2:C52,C52)","v":"FCC16501"},"FCC1650",null,"advance",6,41990.05,"2023-06-08",57,"2023-07-27",41925,65.05000000000291,0,0,"new",0,41990.05,null,null,null,null,null,null,null,null,null,null,null,null,null,null,null,null,null,null,null,null,null,null,null,null,null,null,null,null,null,null,null,41925,"FCC1650-08-06-2023"]
[{"$f":"IFERROR(VLOOKUP(C53,#REF!,9,FALSE),\"\")","v":""},{"$f":"C53&COUNTIF($C$2:C53,C53)","v":"FCC20601"},"FCC2060",null,null,2,107710,"2023-06-08",57,"2023-07-27",107710,0,0,0,0,0,107710,null,null,null,null,null,null,null,null,null,null,null,null,null,null,null,null,null,null,null,null,null,null,null,null,null,null,null,null,null,null,null,107710,"FCC2060-08-06-2023"]
[{"$f":"IFERROR(VLOOKUP(C54,#REF!,9,FALSE),\"\")","v":""},{"$f":"C54&COUNTIF($C$2:C54,C54)","v":"FCC06501"},"FCC0650",null,null,10,58065.83,"2023-06-08",57,null,null,null,null,null,null,58065.83,58065.83,null,null,null,null,null,null,null,null,null,null,null,null,null,null,null,null,null,null,null,null,null,null,null,null,null,null,null,null,null,null,null,58065.83,"FCC0650-08-06-2023"]
[{"$f":"IFERROR(VLOOKUP(C55,#REF!,9,FALSE),\"\")","v":""},{"$f":"C55&COUNTIF($C$2:C55,C55)","v":"FCC06601"},"FCC0660",null,null,7,125568.96000000001,"2023-06-08",57,"2023-07-19",125545.93,23.030000000013388,0,0,0,0,125568.96000000001,null,null,null,null,null,null,null,null,null,null,null,null,null,null,null,null,null,null,null,null,null,null,null,null,null,null,null,null,null,null,null,125545.93,"FCC0660-08-06-2023"]
[{"$f":"IFERROR(VLOOKUP(C56,#REF!,9,FALSE),\"\")","v":""},{"$f":"C56&COUNTIF($C$2:C56,C56)","v":"FCS23401"},"FCS2340",null,null,15,51430,"2023-06-08",57,"2023-07-10",49341,2089,0,0,0,0,51430,null,null,null,null,null,null,null,null,null,null,null,null,null,null,null,null,null,null,null,null,null,null,null,null,null,null,null,null,null,null,null,49341,"FCS2340-08-06-2023"]
[{"$f":"IFERROR(VLOOKUP(C57,#REF!,9,FALSE),\"\")","v":""},{"$f":"C57&COUNTIF($C$2:C57,C57)","v":"FCC91491"},"FCC9149",null,null,3,10202.450000000001,"2023-06-08",57,"2023-07-27",10142.450000000001,60.010000000000218,0,0,0,0,10202.450000000001,null,null,null,null,null,null,null,null,null,null,null,null,null,null,null,null,null,null,null,null,null,null,null,null,null,null,null,null,null,null,null,10142.44,"FCC9149-08-06-2023"]
[{"$f":"IFERROR(VLOOKUP(C58,#REF!,9,FALSE),\"\")","v":""},{"$f":"C58&COUNTIF($C$2:C58,C58)","v":"FCX26901"},"FCX2690",null,null,13,159972.39000000001,"2023-06-08",57,null,null,null,null,null,null,159972.39000000001,159972.39000000001,null,null,null,null,null,null,null,null,null,null,null,null,null,null,null,null,null,null,null,null,null,null,null,null,null,null,null,null,null,null,null,159972.39000000001,"FCX2690-08-06-2023"]
[{"$f":"IFERROR(VLOOKUP(C59,#REF!,9,FALSE),\"\")","v":""},{"$f":"C59&COUNTIF($C$2:C59,C59)","v":"FCS28301"},"FCS2830",null,"advance",54,351512.39,"2023-06-08",57,"2023-06-26",348471.94,3040.4500000000116,0,0,0,0,351512.39,null,null,null,null,null,null,null,null,null,null,null,null,null,null,null,null,null,null,null,null,null,null,null,null,null,null,null,null,null,null,null,348471.94,"FCS2830-08-06-2023"]
[{"$f":"IFERROR(VLOOKUP(C60,#REF!,9,FALSE),\"\")","v":""},{"$f":"C60&COUNTIF($C$2:C60,C60)","v":"FCC31101"},"FCC3110",null,"advance+VD",9,59100,"2023-06-08",57,"2023-07-27",55800,3300,0,0,0,0,59100,null,null,null,null,null,null,null,null,null,null,null,null,null,null,null,null,null,null,null,null,null,null,null,null,null,null,null,null,null,null,null,55800,"FCC3110-08-06-2023"]
[{"$f":"IFERROR(VLOOKUP(C61,#REF!,9,FALSE),\"\")","v":""},{"$f":"C61&COUNTIF($C$2:C61,C61)","v":"FCC30401"},"FCC3040",null,"advance",30,446193.82,"2023-06-08",57,"2023-06-19",442910,3283.820000000007,0,0,"new",0,446193.82,null,null,null,null,null,null,null,null,null,null,null,null,null,null,null,null,null,null,null,null,null,null,null,null,null,null,null,null,null,null,null,442910,"FCC3040-08-06-2023"]
[{"$f":"IFERROR(VLOOKUP(C62,#REF!,9,FALSE),\"\")","v":""},{"$f":"C62&COUNTIF($C$2:C62,C62)","v":"FCC32501"},"FCC3250",null,null,4,81173,"2023-06-08",57,"2023-07-31",43567.74,605.26000000000204,37000,0,0,0,81173,null,null,null,null,null,null,null,null,null,null,null,null,null,null,null,null,null,null,null,null,null,null,null,null,null,null,null,null,null,null,null,80567.739999999991,"FCC3250-08-06-2023"]
[{"$f":"IFERROR(VLOOKUP(C63,#REF!,9,FALSE),\"\")","v":""},{"$f":"C63&COUNTIF($C$2:C63,C63)","v":"FCX18401"},"FCX1840",null,"advance",55,727779.11,"2023-06-08",57,"2023-07-09",717412.63,1148.78,9217.7000000000007,0,"Price Difference",-2.0008883439004421E-11,727779.11,null,null,null,null,null,null,null,null,null,null,null,null,null,null,null,null,null,null,null,null,null,null,null,null,null,null,null,null,null,null,null,726630.33,"FCX1840-08-06-2023"]
[{"$f":"IFERROR(VLOOKUP(C64,#REF!,9,FALSE),\"\")","v":""},{"$f":"C64&COUNTIF($C$2:C64,C64)","v":"FCC91561"},"FCC9156",null,"advance",31,639044.69999999995,"2023-06-08",57,null,null,null,null,null,null,639044.69999999995,639044.69999999995,null,null,null,null,null,null,null,null,null,null,null,null,null,null,null,null,null,null,null,null,null,null,null,null,null,null,null,null,null,null,null,639044.69999999995,"FCC9156-08-06-2023"]
[{"$f":"IFERROR(VLOOKUP(C65,#REF!,9,FALSE),\"\")","v":""},{"$f":"C65&COUNTIF($C$2:C65,C65)","v":"FCD30501"},"FCD3050",null,null,14,75685,"2023-06-08",57,null,null,null,null,null,null,75685,75685,null,null,null,null,null,null,null,null,null,null,null,null,null,null,null,null,null,null,null,null,null,null,null,null,null,null,null,null,null,null,null,75685,"FCD3050-08-06-2023"]
[{"$f":"IFERROR(VLOOKUP(C66,#REF!,9,FALSE),\"\")","v":""},{"$f":"C66&COUNTIF($C$2:C66,C66)","v":"FCX34901"},"FCX3490",null,null,5,37852,"2023-06-11",{"$f":"+TODAY()-H66","v":54},null,null,null,null,null,null,{"$f":"+G66-K66-L66-M66-N66","v":37852},{"$f":"+G66-R66-T66-V66-X66-Z66-AB66-AD66-AF66-AH66-AJ66-AL66-AN66-AP66-AT66-AV66","v":37852},null,null,null,null,null,null,null,null,null,null,null,null,null,null,null,null,null,null,null,null,null,null,null,null,null,null,null,null,null,null,null,37852,"FCX3490-11-06-2023"]
[{"$f":"IFERROR(VLOOKUP(C67,#REF!,9,FALSE),\"\")","v":""},{"$f":"C67&COUNTIF($C$2:C67,C67)","v":"FCP31601"},"FCP3160",null,null,1,5021,"2023-06-11",54,"2023-07-27",5021,0,0,0,0,0,5021,null,null,null,null,null,null,null,null,null,null,null,null,null,null,null,null,null,null,null,null,null,null,null,null,null,null,null,null,null,null,null,{"$f":"G67-(L67++R67+T67+V67+X67+Z67+AB67+AD67+AF67+AH67+AJ67+AL67+AN67+AP67+AR67)","v":5021},{"$f":"CONCATENATE(C67,\"-\",TEXT(H67,\"DD-MM-YYYY\"))","v":"FCP3160-11-06-2023"}]
[{"$f":"IFERROR(VLOOKUP(C68,#REF!,9,FALSE),\"\")","v":""},{"$f":"C68&COUNTIF($C$2:C68,C68)","v":"FCC28801"},"FCC2880",null,null,38,907837.86,"2023-06-11",54,"2023-07-16",579691.79,916.46999999997206,17000,310229.59999999998,0,0,907837.86,null,null,null,null,null,null,null,null,null,null,null,null,null,null,null,null,null,null,null,null,null,null,null,null,null,null,null,null,null,null,null,906921.39,"FCC2880-11-06-2023"]
[{"$f":"IFERROR(VLOOKUP(C69,#REF!,9,FALSE),\"\")","v":""},{"$f":"C69&COUNTIF($C$2:C69,C69)","v":"FCF06901"},"FCF0690",null,null,6,67976.98,"2023-06-11",54,null,null,null,null,null,null,67976.98,67976.98,null,null,null,null,null,null,null,null,null,null,null,null,null,null,null,null,null,null,null,null,null,null,null,null,null,null,null,null,null,null,null,67976.98,"FCF0690-11-06-2023"]
[{"$f":"IFERROR(VLOOKUP(C70,#REF!,9,FALSE),\"\")","v":""},{"$f":"C70&COUNTIF($C$2:C70,C70)","v":"FCC17101"},"FCC1710",null,"advance",13,39094,"2023-06-11",54,"2023-07-31",39043.519999999997,50.480000000003201,0,0,0,0,39094,null,null,null,null,null,null,null,null,null,null,null,null,null,null,null,null,null,null,null,null,null,null,null,null,null,null,null,null,null,null,null,39043.519999999997,"FCC1710-11-06-2023"]
[{"$f":"IFERROR(VLOOKUP(C71,#REF!,9,FALSE),\"\")","v":""},{"$f":"C71&COUNTIF($C$2:C71,C71)","v":"FCI22101"},"FCI2210",null,null,2,8000,"2023-06-11",54,"2023-07-31",8000,0,0,0,0,0,8000,null,null,null,null,null,null,null,null,null,null,null,null,null,null,null,null,null,null,null,null,null,null,null,null,null,null,null,null,null,null,null,8000,"FCI2210-11-06-2023"]
[{"$f":"IFERROR(VLOOKUP(C72,#REF!,9,FALSE),\"\")","v":""},{"$f":"C72&COUNTIF($C$2:C72,C72)","v":"FCS10401"},"FCS1040",null,null,3,16247,"2023-06-11",54,null,null,null,null,null,null,16247,16247,null,null,null,null,null,null,null,null,null,null,null,null,null,null,null,null,null,null,null,null,null,null,null,null,null,null,null,null,null,null,null,16247,"FCS1040-11-06-2023"]
[{"$f":"IFERROR(VLOOKUP(C73,#REF!,9,FALSE),\"\")","v":""},{"$f":"C73&COUNTIF($C$2:C73,C73)","v":"FCC14101"},"FCC1410",null,"advance",32,586264.38,"2023-06-11",54,"2023-07-30",553260,1551.3800000000047,0,31453,0,0,586264.38,null,null,null,null,null,null,null,null,null,null,null,null,null,null,null,null,null,null,null,null,null,null,null,null,null,null,null,null,null,null,null,584713,"FCC1410-11-06-2023"]
[{"$f":"IFERROR(VLOOKUP(C74,#REF!,9,FALSE),\"\")","v":""},{"$f":"C74&COUNTIF($C$2:C74,C74)","v":"FCS10201"},"FCS1020",null,null,85,701322.78,"2023-06-11",54,"2023-07-31",632149,0.21000000002095476,662,68511.570000000007,0,0,701322.78,null,null,null,null,null,null,null,null,null,null,null,null,null,null,null,null,null,null,null,null,null,null,null,null,null,null,null,null,null,null,null,701322.57000000007,"FCS1020-11-06-2023"]
[{"$f":"IFERROR(VLOOKUP(C75,#REF!,9,FALSE),\"\")","v":""},{"$f":"C75&COUNTIF($C$2:C75,C75)","v":"FCC03401"},"FCC0340",null,null,1,11106.49,"2023-06-11",54,"2023-07-27",10890.48,216.01000000000022,0,0,"20% discount difference in anesthia",0,11106.49,null,null,null,null,null,null,null,null,null,null,null,null,null,null,null,null,null,null,null,null,null,null,null,null,null,null,null,null,null,null,null,10890.48,"FCC0340-11-06-2023"]
[{"$f":"IFERROR(VLOOKUP(C76,#REF!,9,FALSE),\"\")","v":""},{"$f":"C76&COUNTIF($C$2:C76,C76)","v":"FCC26501"},"FCC2650",null,null,13,129476.63,"2023-06-11",54,"2023-07-27",41881.629999999997,0,0,87595,0,0,129476.63,null,null,null,null,null,null,null,null,null,null,null,null,null,null,null,null,null,null,null,null,null,null,null,null,null,null,null,null,null,null,null,129476.63,"FCC2650-11-06-2023"]
[{"$f":"IFERROR(VLOOKUP(C77,#REF!,9,FALSE),\"\")","v":""},{"$f":"C77&COUNTIF($C$2:C77,C77)","v":"FCC21301"},"FCC2130",null,null,12,81289.83,"2023-06-11",54,"2023-07-27",80939.839999999997,349.99000000000524,0,0,0,0,81289.83,null,null,null,null,null,null,null,null,null,null,null,null,null,null,null,null,null,null,null,null,null,null,null,null,null,null,null,null,null,null,null,80939.839999999997,"FCC2130-11-06-2023"]
[{"$f":"IFERROR(VLOOKUP(C78,#REF!,9,FALSE),\"\")","v":""},{"$f":"C78&COUNTIF($C$2:C78,C78)","v":"FCS17001"},"FCS1700",null,null,56,526344.51,"2023-06-11",54,"2023-07-19",507229.67,19234.840000000026,0,0,0,-120,526344.51,null,null,null,null,null,null,null,null,null,null,null,null,null,null,null,null,null,null,null,null,null,null,null,null,null,null,null,null,null,null,null,507109.67,"FCS1700-11-06-2023"]
[{"$f":"IFERROR(VLOOKUP(C79,#REF!,9,FALSE),\"\")","v":""},{"$f":"C79&COUNTIF($C$2:C79,C79)","v":"FCX12901"},"FCX1290",null,"advance",157,2289155.9300000002,"2023-06-11",54,"2023-07-19",1964940.53,0,995.67,323219.73,0,0,2289155.9300000002,null,null,null,null,null,null,null,null,null,null,null,null,null,null,null,null,null,null,null,null,null,null,null,null,null,null,null,null,null,null,null,2289155.9300000002,"FCX1290-11-06-2023"]
[{"$f":"IFERROR(VLOOKUP(C80,#REF!,9,FALSE),\"\")","v":""},{"$f":"C80&COUNTIF($C$2:C80,C80)","v":"FCC00901"},"FCC0090",null,"advance",227,7610897.3200000003,"2023-06-11",54,"2023-07-11",7557010.9400000004,3020.2599999994854,50866.1,0,0,0,7610897.3200000003,null,null,null,null,null,null,null,null,null,null,null,null,null,null,null,null,null,null,null,null,null,null,null,null,null,null,null,null,null,null,null,7607877.0600000005,"FCC0090-11-06-2023"]
[{"$f":"IFERROR(VLOOKUP(C81,#REF!,9,FALSE),\"\")","v":""},{"$f":"C81&COUNTIF($C$2:C81,C81)","v":"FCS10301"},"FCS1030",null,"advance",125,1539703.3,"2023-06-11",54,"2023-07-19",1522611.32,17091.979999999981,0,0,0,0,1539703.3,null,null,null,null,null,null,null,null,null,null,null,null,null,null,null,null,null,null,null,null,null,null,null,null,null,null,null,null,null,null,null,1522611.32,"FCS1030-11-06-2023"]
[{"$f":"IFERROR(VLOOKUP(C82,#REF!,9,FALSE),\"\")","v":""},{"$f":"C82&COUNTIF($C$2:C82,C82)","v":"FCC91651"},"FCC9165",null,null,12,106765,"2023-06-11",54,null,null,null,null,null,null,106765,106765,null,null,null,null,null,null,null,null,null,null,null,null,null,null,null,null,null,null,null,null,null,null,null,null,null,null,null,null,null,null,null,106765,"FCC9165-11-06-2023"]
[{"$f":"IFERROR(VLOOKUP(C83,#REF!,9,FALSE),\"\")","v":""},{"$f":"C83&COUNTIF($C$2:C83,C83)","v":"FCC26201"},"FCC2620",null,"advance",50,420776.16,"2023-06-11",54,"2023-07-13",395997.26,7798.2800000000207,16980.560000000001,0,0,0,420776.16,null,null,null,null,null,null,null,null,null,null,null,null,null,null,null,null,null,null,null,null,null,null,null,null,null,null,null,null,null,null,null,412977.87999999995,"FCC2620-11-06-2023"]
[{"$f":"IFERROR(VLOOKUP(C84,#REF!,9,FALSE),\"\")","v":""},{"$f":"C84&COUNTIF($C$2:C84,C84)","v":"FCC18201"},"FCC1820",null,null,2,10400,"2023-06-11",54,"2023-07-27",10400,0,0,0,0,0,10400,null,null,null,null,null,null,null,null,null,null,null,null,null,null,null,null,null,null,null,null,null,null,null,null,null,null,null,null,null,null,null,10400,"FCC1820-11-06-2023"]
[{"$f":"IFERROR(VLOOKUP(C85,#REF!,9,FALSE),\"\")","v":""},{"$f":"C85&COUNTIF($C$2:C85,C85)","v":"FCC15701"},"FCC1570",null,null,6,26254,"2023-06-11",54,null,null,null,null,null,null,26254,26254,null,null,null,null,null,null,null,null,null,null,null,null,null,null,null,null,null,null,null,null,null,null,null,null,null,null,null,null,null,null,null,26254,"FCC1570-11-06-2023"]
[{"$f":"IFERROR(VLOOKUP(C86,#REF!,9,FALSE),\"\")","v":""},{"$f":"C86&COUNTIF($C$2:C86,C86)","v":"fcx26701"},"fcx2670",null,null,14,138775,"2023-06-11",54,"2023-07-12",138725,50,0,0,0,0,138775,null,null,null,null,null,null,null,null,null,null,null,null,null,null,null,null,null,null,null,null,null,null,null,null,null,null,null,null,null,null,null,138725,"fcx2670-11-06-2023"]
[{"$f":"IFERROR(VLOOKUP(C87,#REF!,9,FALSE),\"\")","v":""},{"$f":"C87&COUNTIF($C$2:C87,C87)","v":"FCH07101"},"FCH0710",null,null,2,19660.3,"2023-06-11",54,null,null,null,null,null,null,19660.3,19660.3,null,null,null,null,null,null,null,null,null,null,null,null,null,null,null,null,null,null,null,null,null,null,null,null,null,null,null,null,null,null,null,19660.3,"FCH0710-11-06-2023"]
[{"$f":"IFERROR(VLOOKUP(C88,#REF!,9,FALSE),\"\")","v":""},{"$f":"C88&COUNTIF($C$2:C88,C88)","v":"FCC04801"},"FCC0480",null,null,39,655037,"2023-06-12",53,"2023-07-10",607748.46,-3.0000000035215635E-2,47288.54,0,0,3.0000000071595423E-2,655037,null,null,null,null,null,null,null,null,null,null,null,null,null,null,null,null,null,null,null,null,null,null,null,null,null,null,null,null,null,null,null,655037.03,"FCC0480-12-06-2023"]
[{"$f":"IFERROR(VLOOKUP(C89,#REF!,9,FALSE),\"\")","v":""},{"$f":"C89&COUNTIF($C$2:C89,C89)","v":"FCC91641"},"FCC9164",null,null,60,469144.11,"2023-06-12",53,"2023-07-12",444255.87,-3.0000000035215635E-2,7000,0,"OLD&NEW RR",17888.270000000026,469144.11,null,null,null,null,null,null,null,null,null,null,null,null,null,null,null,null,null,null,null,null,null,null,null,null,null,null,null,null,null,null,null,469144.14,"FCC9164-12-06-2023"]
[{"$f":"IFERROR(VLOOKUP(C90,#REF!,9,FALSE),\"\")","v":""},{"$f":"C90&COUNTIF($C$2:C90,C90)","v":"FCP17201"},"FCP1720",null,null,6,19371.689999999999,"2023-06-12",53,null,null,null,null,null,null,19371.689999999999,19371.689999999999,null,null,null,null,null,null,null,null,null,null,null,null,null,null,null,null,null,null,null,null,null,null,null,null,null,null,null,null,null,null,null,19371.689999999999,"FCP1720-12-06-2023"]
[{"$f":"IFERROR(VLOOKUP(C91,#REF!,9,FALSE),\"\")","v":""},{"$f":"C91&COUNTIF($C$2:C91,C91)","v":"FCK29901"},"FCK2990",null,null,2,17615,"2023-06-12",53,null,null,null,null,null,null,17615,17615,null,null,null,null,null,null,null,null,null,null,null,null,null,null,null,null,null,null,null,null,null,null,null,null,null,null,null,null,null,null,null,17615,"FCK2990-12-06-2023"]
[{"$f":"IFERROR(VLOOKUP(C92,#REF!,9,FALSE),\"\")","v":""},{"$f":"C92&COUNTIF($C$2:C92,C92)","v":"FCC01201"},"FCC0120",null,null,50,933597.06,"2023-06-12",53,"2023-07-26",789004.85,0,1118.1500000000001,143474.06,0,0,933597.06,null,null,null,null,null,null,null,null,null,null,null,null,null,null,null,null,null,null,null,null,null,null,null,null,null,null,null,null,null,null,null,933597.06,"FCC0120-12-06-2023"]
[{"$f":"IFERROR(VLOOKUP(C93,#REF!,9,FALSE),\"\")","v":""},{"$f":"C93&COUNTIF($C$2:C93,C93)","v":"FCC91841"},"FCC9184",null,null,3,23375,"2023-06-12",53,null,null,null,null,null,null,23375,23375,null,null,null,null,null,null,null,null,null,null,null,null,null,null,null,null,null,null,null,null,null,null,null,null,null,null,null,null,null,null,null,23375,"FCC9184-12-06-2023"]
[{"$f":"IFERROR(VLOOKUP(C94,#REF!,9,FALSE),\"\")","v":""},{"$f":"C94&COUNTIF($C$2:C94,C94)","v":"FCC03001"},"FCC0300",null,"advance",218,7394952.75,"2023-06-12",53,"2023-07-19",5489783.4699999997,0,0,1905169.28,"new",0,7394952.75,null,null,null,null,null,null,null,null,null,null,null,null,null,null,null,null,null,null,null,null,null,null,null,null,null,null,null,null,null,null,null,7394952.75,"FCC0300-12-06-2023"]
[{"$f":"IFERROR(VLOOKUP(C95,#REF!,9,FALSE),\"\")","v":""},{"$f":"C95&COUNTIF($C$2:C95,C95)","v":"FCC91981"},"FCC9198",null,"advance",33,1145613.3,"2023-06-12",53,null,null,null,null,null,null,1145613.3,1145613.3,null,null,null,null,null,null,null,null,null,null,null,null,null,null,null,null,null,null,null,null,null,null,null,null,null,null,null,null,null,null,null,1145613.3,"FCC9198-12-06-2023"]
[{"$f":"IFERROR(VLOOKUP(C96,#REF!,9,FALSE),\"\")","v":""},{"$f":"C96&COUNTIF($C$2:C96,C96)","v":"FCC04001"},"FCC0400",null,"advance",198,4651817.6500000004,"2023-06-12",53,"2023-07-16",4362117.25,6305.1500000003725,283395.25,0,0,0,4651817.6500000004,null,null,null,null,null,null,null,null,null,null,null,null,null,null,null,null,null,null,null,null,null,null,null,null,null,null,null,null,null,null,null,4645512.5,"FCC0400-12-06-2023"]
[{"$f":"IFERROR(VLOOKUP(C97,#REF!,9,FALSE),\"\")","v":""},{"$f":"C97&COUNTIF($C$2:C97,C97)","v":"FCN31441"},"FCN3144",null,null,22,207744.35,"2023-06-12",53,"2023-07-16",204106,3638.1300000000047,0,0,0,0,207744.35,null,null,null,null,null,null,null,null,null,null,null,null,null,null,null,null,null,null,null,null,null,null,null,null,null,null,null,null,null,null,null,204106.22,"FCN3144-12-06-2023"]
[{"$f":"IFERROR(VLOOKUP(C98,#REF!,9,FALSE),\"\")","v":""},{"$f":"C98&COUNTIF($C$2:C98,C98)","v":"FCL07701"},"FCL0770",null,null,3,26124.45,"2023-06-12",53,null,null,null,null,null,null,26124.45,26124.45,null,null,null,null,null,null,null,null,null,null,null,null,null,null,null,null,null,null,null,null,null,null,null,null,null,null,null,null,null,null,null,26124.45,"FCL0770-12-06-2023"]
[{"$f":"IFERROR(VLOOKUP(C99,#REF!,9,FALSE),\"\")","v":""},{"$f":"C99&COUNTIF($C$2:C99,C99)","v":"FCM27621"},"FCM2762",null,null,5,55489.5,"2023-06-12",53,null,null,null,null,null,null,55489.5,55489.5,null,null,null,null,null,null,null,null,null,null,null,null,null,null,null,null,null,null,null,null,null,null,null,null,null,null,null,null,null,null,null,55489.5,"FCM2762-12-06-2023"]
[{"$f":"IFERROR(VLOOKUP(C100,#REF!,9,FALSE),\"\")","v":""},{"$f":"C100&COUNTIF($C$2:C100,C100)","v":"FCJ31721"},"FCJ3172",null,null,2,10811,"2023-06-12",53,"2023-07-30",8312,0,0,2499,0,0,10811,null,null,null,null,null,null,null,null,null,null,null,null,null,null,null,null,null,null,null,null,null,null,null,null,null,null,null,null,null,null,null,10811,"FCJ3172-12-06-2023"]
[{"$f":"IFERROR(VLOOKUP(C101,#REF!,9,FALSE),\"\")","v":""},{"$f":"C101&COUNTIF($C$2:C101,C101)","v":"FCC04501"},"FCC0450",null,null,8,34285.160000000003,"2023-06-12",53,null,null,null,null,null,null,34285.160000000003,34285.160000000003,null,null,null,null,null,null,null,null,null,null,null,null,null,null,null,null,null,null,null,null,null,null,null,null,null,null,null,null,null,null,null,34285.160000000003,"FCC0450-12-06-2023"]
[{"$f":"IFERROR(VLOOKUP(C102,#REF!,9,FALSE),\"\")","v":""},{"$f":"C102&COUNTIF($C$2:C102,C102)","v":"FCC05901"},"FCC0590",null,"advance",145,4968235.5200000005,"2023-06-12",53,"2023-07-17",3937963.26,0,217802.21,812470.05,0,0,4968235.5200000005,null,null,null,null,null,null,null,null,null,null,null,null,null,null,null,null,null,null,null,null,null,null,null,null,null,null,null,null,null,null,null,4968235.5200000005,"FCC0590-12-06-2023"]
[{"$f":"IFERROR(VLOOKUP(C103,#REF!,9,FALSE),\"\")","v":""},{"$f":"C103&COUNTIF($C$2:C103,C103)","v":"FCC26601"},"FCC2660",null,null,19,90392,"2023-06-12",53,null,null,null,null,null,null,90392,90392,null,null,null,null,null,null,null,null,null,null,null,null,null,null,null,null,null,null,null,null,null,null,null,null,null,null,null,null,null,null,null,90392,"FCC2660-12-06-2023"]
[{"$f":"IFERROR(VLOOKUP(C104,#REF!,9,FALSE),\"\")","v":""},{"$f":"C104&COUNTIF($C$2:C104,C104)","v":"FCS31501"},"FCS3150",null,null,4,56448,"2023-06-13",52,null,null,null,null,null,null,56448,56448,null,null,null,null,null,null,null,null,null,null,null,null,null,null,null,null,null,null,null,null,null,null,null,null,null,null,null,null,null,null,null,56448,"FCS3150-13-06-2023"]
[{"$f":"IFERROR(VLOOKUP(C105,#REF!,9,FALSE),\"\")","v":""},{"$f":"C105&COUNTIF($C$2:C105,C105)","v":"FCS29261"},"FCS2926",null,null,2,15331,"2023-06-13",52,null,null,null,null,null,null,15331,15331,null,null,null,null,null,null,null,null,null,null,null,null,null,null,null,null,null,null,null,null,null,null,null,null,null,null,null,null,null,null,null,15331,"FCS2926-13-06-2023"]
[{"$f":"IFERROR(VLOOKUP(C106,#REF!,9,FALSE),\"\")","v":""},{"$f":"C106&COUNTIF($C$2:C106,C106)","v":"FCC00401"},"FCC0040",null,null,8,33054,"2023-06-13",52,null,null,null,null,null,null,33054,33054,null,null,null,null,null,null,null,null,null,null,null,null,null,null,null,null,null,null,null,null,null,null,null,null,null,null,null,null,null,null,null,33054,"FCC0040-13-06-2023"]
[{"$f":"IFERROR(VLOOKUP(C107,#REF!,9,FALSE),\"\")","v":""},{"$f":"C107&COUNTIF($C$2:C107,C107)","v":"FCN31002"},"FCN3100",null,null,1,5830,"2023-06-13",52,null,null,null,null,null,null,5830,5830,null,null,null,null,null,null,null,null,null,null,null,null,null,null,null,null,null,null,null,null,null,null,null,null,null,null,null,null,null,null,null,5830,"FCN3100-13-06-2023"]
[{"$f":"IFERROR(VLOOKUP(C108,#REF!,9,FALSE),\"\")","v":""},{"$f":"C108&COUNTIF($C$2:C108,C108)","v":"FCX16101"},"FCX1610",null,null,5,194731.02,"2023-06-13",52,null,null,null,null,null,null,194731.02,194731.02,null,null,null,null,null,null,null,null,null,null,null,null,null,null,null,null,null,null,null,null,null,null,null,null,null,null,null,null,null,null,null,194731.02,"FCX1610-13-06-2023"]
[{"$f":"IFERROR(VLOOKUP(C109,#REF!,9,FALSE),\"\")","v":""},{"$f":"C109&COUNTIF($C$2:C109,C109)","v":"FCC91961"},"FCC9196",null,null,3,26844.03,"2023-06-13",52,null,null,null,null,null,null,26844.03,26844.03,null,null,null,null,null,null,null,null,null,null,null,null,null,null,null,null,null,null,null,null,null,null,null,null,null,null,null,null,null,null,null,26844.03,"FCC9196-13-06-2023"]
[{"$f":"IFERROR(VLOOKUP(C110,#REF!,9,FALSE),\"\")","v":""},{"$f":"C110&COUNTIF($C$2:C110,C110)","v":"FCC30601"},"FCC3060",null,null,2,9115,"2023-06-13",52,null,null,null,null,null,null,9115,9115,null,null,null,null,null,null,null,null,null,null,null,null,null,null,null,null,null,null,null,null,null,null,null,null,null,null,null,null,null,null,null,9115,"FCC3060-13-06-2023"]
[{"$f":"IFERROR(VLOOKUP(C111,#REF!,9,FALSE),\"\")","v":""},{"$f":"C111&COUNTIF($C$2:C111,C111)","v":"FCX18501"},"FCX1850",null,null,6,14166,"2023-06-13",52,null,null,null,null,null,null,14166,14166,null,null,null,null,null,null,null,null,null,null,null,null,null,null,null,null,null,null,null,null,null,null,null,null,null,null,null,null,null,null,null,14166,"FCX1850-13-06-2023"]
[{"$f":"IFERROR(VLOOKUP(C112,#REF!,9,FALSE),\"\")","v":""},{"$f":"C112&COUNTIF($C$2:C112,C112)","v":"FCC91671"},"FCC9167",null,"advance",47,1115648.49,"2023-06-13",52,"2023-07-16",994826.5,63390.989999999991,57431,0,"old& new / tests and radiology (10%disc)diff  ",0,1115648.49,null,null,null,null,null,null,null,null,null,null,null,null,null,null,null,null,null,null,null,null,null,null,null,null,null,null,null,null,null,null,null,1052257.5,"FCC9167-13-06-2023"]
[{"$f":"IFERROR(VLOOKUP(C113,#REF!,9,FALSE),\"\")","v":""},{"$f":"C113&COUNTIF($C$2:C113,C113)","v":"FCK30781"},"FCK3078",null,null,19,80788.45,"2023-06-13",52,null,null,null,null,null,null,80788.45,80788.45,null,null,null,null,null,null,null,null,null,null,null,null,null,null,null,null,null,null,null,null,null,null,null,null,null,null,null,null,null,null,null,80788.45,"FCK3078-13-06-2023"]
[{"$f":"IFERROR(VLOOKUP(C114,#REF!,9,FALSE),\"\")","v":""},{"$f":"C114&COUNTIF($C$2:C114,C114)","v":"FCC17801"},"FCC1780",null,null,2,46800,"2023-06-13",52,null,null,null,null,null,null,46800,46800,null,null,null,null,null,null,null,null,null,null,null,null,null,null,null,null,null,null,null,null,null,null,null,null,null,null,null,null,null,null,null,46800,"FCC1780-13-06-2023"]
[{"$f":"IFERROR(VLOOKUP(C115,#REF!,9,FALSE),\"\")","v":""},{"$f":"C115&COUNTIF($C$2:C115,C115)","v":"FCC91461"},"FCC9146",null,null,1,28510.68,"2023-06-13",52,null,null,null,null,null,null,28510.68,28510.68,null,null,null,null,null,null,null,null,null,null,null,null,null,null,null,null,null,null,null,null,null,null,null,null,null,null,null,null,null,null,null,28510.68,"FCC9146-13-06-2023"]
[{"$f":"IFERROR(VLOOKUP(C116,#REF!,9,FALSE),\"\")","v":""},{"$f":"C116&COUNTIF($C$2:C116,C116)","v":"FCC31202"},"FCC3120",null,null,80,1661535.1,"2023-06-14",51,"2023-07-10",1593188.08,345.14000000001397,0,68001.88,"Denied Amount",0,1661535.1,null,null,null,null,null,null,null,null,null,null,null,null,null,null,null,null,null,null,null,null,null,null,null,null,null,null,null,null,null,null,null,1661189.96,"FCC3120-14-06-2023"]
[{"$f":"IFERROR(VLOOKUP(C117,#REF!,9,FALSE),\"\")","v":""},{"$f":"C117&COUNTIF($C$2:C117,C117)","v":"FCN21701"},"FCN2170",null,null,4,91085,"2023-06-14",51,null,null,null,null,null,null,91085,91085,null,null,null,null,null,null,null,null,null,null,null,null,null,null,null,null,null,null,null,null,null,null,null,null,null,null,null,null,null,null,null,91085,"FCN2170-14-06-2023"]
[{"$f":"IFERROR(VLOOKUP(C118,#REF!,9,FALSE),\"\")","v":""},{"$f":"C118&COUNTIF($C$2:C118,C118)","v":"FCC91521"},"FCC9152",null,"advance+VD",11,263200,"2023-06-14",51,null,null,null,null,null,null,263200,263200,null,null,null,null,null,null,null,null,null,null,null,null,null,null,null,null,null,null,null,null,null,null,null,null,null,null,null,null,null,null,null,263200,"FCC9152-14-06-2023"]
[{"$f":"IFERROR(VLOOKUP(C119,#REF!,9,FALSE),\"\")","v":""},{"$f":"C119&COUNTIF($C$2:C119,C119)","v":"FCS29151"},"FCS2915",null,null,2,11719,"2023-06-14",51,null,null,null,null,null,null,11719,11719,null,null,null,null,null,null,null,null,null,null,null,null,null,null,null,null,null,null,null,null,null,null,null,null,null,null,null,null,null,null,null,11719,"FCS2915-14-06-2023"]
[{"$f":"IFERROR(VLOOKUP(C120,#REF!,9,FALSE),\"\")","v":""},{"$f":"C120&COUNTIF($C$2:C120,C120)","v":"FCC91721"},"FCC9172",null,null,17,308360.61,"2023-06-14",51,null,null,null,null,null,null,308360.61,308360.61,null,null,null,null,null,null,null,null,null,null,null,null,null,null,null,null,null,null,null,null,null,null,null,null,null,null,null,null,null,null,null,308360.61,"FCC9172-14-06-2023"]
[{"$f":"IFERROR(VLOOKUP(C121,#REF!,9,FALSE),\"\")","v":""},{"$f":"C121&COUNTIF($C$2:C121,C121)","v":"FCT22301"},"FCT2230",null,null,18,120741.85,"2023-06-14",51,null,null,null,null,null,null,120741.85,120741.85,null,null,null,null,null,null,null,null,null,null,null,null,null,null,null,null,null,null,null,null,null,null,null,null,null,null,null,null,null,null,null,120741.85,"FCT2230-14-06-2023"]
[{"$f":"IFERROR(VLOOKUP(C122,#REF!,9,FALSE),\"\")","v":""},{"$f":"C122&COUNTIF($C$2:C122,C122)","v":"FCC01301"},"FCC0130",null,"advance",38,859801.95,"2023-06-14",51,null,null,null,null,null,null,859801.95,859801.95,null,null,null,null,null,null,null,null,null,null,null,null,null,null,null,null,null,null,null,null,null,null,null,null,null,null,null,null,null,null,null,859801.95,"FCC0130-14-06-2023"]
[{"$f":"IFERROR(VLOOKUP(C123,#REF!,9,FALSE),\"\")","v":""},{"$f":"C123&COUNTIF($C$2:C123,C123)","v":"fcc91951"},"fcc9195",null,null,10,87291.08,"2023-06-14",51,"2023-07-27",87041.1,249.97999999999593,0,0,0,0,87291.08,null,null,null,null,null,null,null,null,null,null,null,null,null,null,null,null,null,null,null,null,null,null,null,null,null,null,null,null,null,null,null,87041.1,"fcc9195-14-06-2023"]
[{"$f":"IFERROR(VLOOKUP(C124,#REF!,9,FALSE),\"\")","v":""},{"$f":"C124&COUNTIF($C$2:C124,C124)","v":"FCC91311"},"FCC9131",null,null,5,30196.25,"2023-06-14",51,null,null,null,null,null,null,30196.25,30196.25,null,null,null,null,null,null,null,null,null,null,null,null,null,null,null,null,null,null,null,null,null,null,null,null,null,null,null,null,null,null,null,30196.25,"FCC9131-14-06-2023"]
[{"$f":"IFERROR(VLOOKUP(C125,#REF!,9,FALSE),\"\")","v":""},{"$f":"C125&COUNTIF($C$2:C125,C125)","v":"FCC91751"},"FCC9175",null,null,7,76537.039999999994,"2023-06-14",51,null,null,null,null,null,null,76537.039999999994,76537.039999999994,null,null,null,null,null,null,null,null,null,null,null,null,null,null,null,null,null,null,null,null,null,null,null,null,null,null,null,null,null,null,null,76537.039999999994,"FCC9175-14-06-2023"]
[{"$f":"IFERROR(VLOOKUP(C126,#REF!,9,FALSE),\"\")","v":""},{"$f":"C126&COUNTIF($C$2:C126,C126)","v":"FCC28701"},"FCC2870",null,null,3,19575.11,"2023-06-14",51,null,null,null,null,null,null,19575.11,19575.11,null,null,null,null,null,null,null,null,null,null,null,null,null,null,null,null,null,null,null,null,null,null,null,null,null,null,null,null,null,null,null,19575.11,"FCC2870-14-06-2023"]
[{"$f":"IFERROR(VLOOKUP(C127,#REF!,9,FALSE),\"\")","v":""},{"$f":"C127&COUNTIF($C$2:C127,C127)","v":"FCK25201"},"FCK2520",null,null,8,47500,"2023-06-14",51,"2023-07-10",47500,0,0,0,0,0,47500,null,null,null,null,null,null,null,null,null,null,null,null,null,null,null,null,null,null,null,null,null,null,null,null,null,null,null,null,null,null,null,47500,"FCK2520-14-06-2023"]
[{"$f":"IFERROR(VLOOKUP(C128,#REF!,9,FALSE),\"\")","v":""},{"$f":"C128&COUNTIF($C$2:C128,C128)","v":"FCC29701"},"FCC2970",null,null,5,20330,"2023-06-14",51,null,null,null,null,null,null,20330,20330,null,null,null,null,null,null,null,null,null,null,null,null,null,null,null,null,null,null,null,null,null,null,null,null,null,null,null,null,null,null,null,20330,"FCC2970-14-06-2023"]
[{"$f":"IFERROR(VLOOKUP(C129,#REF!,9,FALSE),\"\")","v":""},{"$f":"C129&COUNTIF($C$2:C129,C129)","v":"FCX32201"},"FCX3220",null,null,6,37582.22,"2023-06-14",51,null,null,null,null,null,null,37582.22,37582.22,null,null,null,null,null,null,null,null,null,null,null,null,null,null,null,null,null,null,null,null,null,null,null,null,null,null,null,null,null,null,null,37582.22,"FCX3220-14-06-2023"]
[{"$f":"IFERROR(VLOOKUP(C130,#REF!,9,FALSE),\"\")","v":""},{"$f":"C130&COUNTIF($C$2:C130,C130)","v":"FCX27921"},"FCX2792",null,null,7,93085.6,"2023-06-15",{"$f":"+TODAY()-H130","v":50},"2023-07-27",39601.4,-0.29999999999563443,0,53484.5,0,{"$f":"+G130-K130-L130-M130-N130","v":0},{"$f":"+G130-R130-T130-V130-X130-Z130-AB130-AD130-AF130-AH130-AJ130-AL130-AN130-AP130-AT130-AV130","v":93085.6},null,null,null,null,null,null,null,null,null,null,null,null,null,null,null,null,null,null,null,null,null,null,null,null,null,null,null,null,null,null,null,93085.9,"FCX2792-15-06-2023"]
[{"$f":"IFERROR(VLOOKUP(C131,#REF!,9,FALSE),\"\")","v":""},{"$f":"C131&COUNTIF($C$2:C131,C131)","v":"FCC25801"},"FCC2580",null,null,1,4220,"2023-06-15",50,null,null,null,null,null,null,4220,4220,null,null,null,null,null,null,null,null,null,null,null,null,null,null,null,null,null,null,null,null,null,null,null,null,null,null,null,null,null,null,null,{"$f":"G131-(L131++R131+T131+V131+X131+Z131+AB131+AD131+AF131+AH131+AJ131+AL131+AN131+AP131+AR131)","v":4220},{"$f":"CONCATENATE(C131,\"-\",TEXT(H131,\"DD-MM-YYYY\"))","v":"FCC2580-15-06-2023"}]
[{"$f":"IFERROR(VLOOKUP(C132,#REF!,9,FALSE),\"\")","v":""},{"$f":"C132&COUNTIF($C$2:C132,C132)","v":"FCP31602"},"FCP3160",null,null,1,2948,"2023-06-15",50,null,null,null,null,null,null,2948,2948,null,null,null,null,null,null,null,null,null,null,null,null,null,null,null,null,null,null,null,null,null,null,null,null,null,null,null,null,null,null,null,2948,"FCP3160-15-06-2023"]
[{"$f":"IFERROR(VLOOKUP(C133,#REF!,9,FALSE),\"\")","v":""},{"$f":"C133&COUNTIF($C$2:C133,C133)","v":"FCV11711"},"FCV1171",null,null,2,4760.6499999999996,"2023-06-15",50,null,null,null,null,null,null,4760.6499999999996,4760.6499999999996,null,null,null,null,null,null,null,null,null,null,null,null,null,null,null,null,null,null,null,null,null,null,null,null,null,null,null,null,null,null,null,4760.6499999999996,"FCV1171-15-06-2023"]
[{"$f":"IFERROR(VLOOKUP(C134,#REF!,9,FALSE),\"\")","v":""},{"$f":"C134&COUNTIF($C$2:C134,C134)","v":"FCR34601"},"FCR3460",null,null,7,56020,"2023-06-15",50,null,null,null,null,null,null,56020,56020,null,null,null,null,null,null,null,null,null,null,null,null,null,null,null,null,null,null,null,null,null,null,null,null,null,null,null,null,null,null,null,56020,"FCR3460-15-06-2023"]
[{"$f":"IFERROR(VLOOKUP(C135,#REF!,9,FALSE),\"\")","v":""},{"$f":"C135&COUNTIF($C$2:C135,C135)","v":"FCD30541"},"FCD3054",null,null,5,34517,"2023-06-15",50,null,null,null,null,null,null,34517,34517,null,null,null,null,null,null,null,null,null,null,null,null,null,null,null,null,null,null,null,null,null,null,null,null,null,null,null,null,null,null,null,34517,"FCD3054-15-06-2023"]
[{"$f":"IFERROR(VLOOKUP(C136,#REF!,9,FALSE),\"\")","v":""},{"$f":"C136&COUNTIF($C$2:C136,C136)","v":"FCM27601"},"FCM2760",null,null,12,84354.02,"2023-06-15",50,null,null,null,null,null,null,84354.02,84354.02,null,null,null,null,null,null,null,null,null,null,null,null,null,null,null,null,null,null,null,null,null,null,null,null,null,null,null,null,null,null,null,84354.02,"FCM2760-15-06-2023"]
[{"$f":"IFERROR(VLOOKUP(C137,#REF!,9,FALSE),\"\")","v":""},{"$f":"C137&COUNTIF($C$2:C137,C137)","v":"FCX28001"},"FCX2800",null,null,4,42378,"2023-06-15",50,null,null,null,null,null,null,42378,42378,null,null,null,null,null,null,null,null,null,null,null,null,null,null,null,null,null,null,null,null,null,null,null,null,null,null,null,null,null,null,null,42378,"FCX2800-15-06-2023"]
[{"$f":"IFERROR(VLOOKUP(C138,#REF!,9,FALSE),\"\")","v":""},{"$f":"C138&COUNTIF($C$2:C138,C138)","v":"FCC06001"},"FCC0600",null,null,83,400460.75,"2023-06-15",50,"2023-07-19",390770.76,4269.9899999999907,0,5420,0,0,400460.75,null,null,null,null,null,null,null,null,null,null,null,null,null,null,null,null,null,null,null,null,null,null,null,null,null,null,null,null,null,null,null,396190.76,"FCC0600-15-06-2023"]
[{"$f":"IFERROR(VLOOKUP(C139,#REF!,9,FALSE),\"\")","v":""},{"$f":"C139&COUNTIF($C$2:C139,C139)","v":"FCB26301"},"FCB2630",null,null,7,29381.05,"2023-06-15",50,null,null,null,null,null,null,29381.05,29381.05,null,null,null,null,null,null,null,null,null,null,null,null,null,null,null,null,null,null,null,null,null,null,null,null,null,null,null,null,null,null,null,29381.05,"FCB2630-15-06-2023"]
[{"$f":"IFERROR(VLOOKUP(C140,#REF!,9,FALSE),\"\")","v":""},{"$f":"C140&COUNTIF($C$2:C140,C140)","v":"FCC91761"},"FCC9176",null,"advance",114,1796270.87,"2023-06-15",50,null,null,null,null,null,null,1796270.87,1796270.87,null,null,null,null,null,null,null,null,null,null,null,null,null,null,null,null,null,null,null,null,null,null,null,null,null,null,null,null,null,null,null,1796270.87,"FCC9176-15-06-2023"]
[{"$f":"IFERROR(VLOOKUP(C141,#REF!,9,FALSE),\"\")","v":""},{"$f":"C141&COUNTIF($C$2:C141,C141)","v":"FCC91581"},"FCC9158",null,"advance",84,3572641.5,"2023-06-15",50,"2023-07-18",1804198.6,223389.5,0,1545053.4,"old&new rr",0,3572641.5,null,null,null,null,null,null,null,null,null,null,null,null,null,null,null,null,null,null,null,null,null,null,null,null,null,null,null,null,null,null,null,3349252,"FCC9158-15-06-2023"]
[{"$f":"IFERROR(VLOOKUP(C142,#REF!,9,FALSE),\"\")","v":""},{"$f":"C142&COUNTIF($C$2:C142,C142)","v":"FCC33001"},"FCC3300",null,"advance",207,7925748.1699999999,"2023-06-15",50,"2023-07-19",6910342.0499999998,0,430966.08,584440.04,0,0,7925748.1699999999,null,null,null,null,null,null,null,null,null,null,null,null,null,null,null,null,null,null,null,null,null,null,null,null,null,null,null,null,null,null,null,7925748.1699999999,"FCC3300-15-06-2023"]
[null,null,"FCS2924",null,null,5,16669,"2023-06-15",{"$f":"+TODAY()-H143","v":50},null,null,null,null,null,null,{"$f":"+G143-K143-L143-M143-N143","v":16669},null,null,null,null,null,null,null,null,null,null,null,null,null,null,null,null,null,null,null,null,null,null,null,null,null,null,null,null,null,null,null,null,16669,"FCS2924-15-06-2023"]
[{"$f":"IFERROR(VLOOKUP(C144,#REF!,9,FALSE),\"\")","v":""},{"$f":"C144&COUNTIF($C$2:C144,C144)","v":"FCF26131"},"FCF2613",null,null,6,52992.9,"2023-06-18",47,null,null,null,null,null,null,52992.9,52992.9,null,null,null,null,null,null,null,null,null,null,null,null,null,null,null,null,null,null,null,null,null,null,null,null,null,null,null,null,null,null,null,52992.9,"FCF2613-18-06-2023"]
[{"$f":"IFERROR(VLOOKUP(C145,#REF!,9,FALSE),\"\")","v":""},{"$f":"C145&COUNTIF($C$2:C145,C145)","v":"FCC35301"},"FCC3530",null,null,5,10132,"2023-06-18",47,null,null,null,null,null,null,10132,10132,null,null,null,null,null,null,null,null,null,null,null,null,null,null,null,null,null,null,null,null,null,null,null,null,null,null,null,null,null,null,null,10132,"FCC3530-18-06-2023"]
[{"$f":"IFERROR(VLOOKUP(C146,#REF!,9,FALSE),\"\")","v":""},{"$f":"C146&COUNTIF($C$2:C146,C146)","v":"FCS29781"},"FCS2978",null,null,12,60465,"2023-06-18",47,null,null,null,null,null,null,60465,60465,null,null,null,null,null,null,null,null,null,null,null,null,null,null,null,null,null,null,null,null,null,null,null,null,null,null,null,null,null,null,null,60465,"FCS2978-18-06-2023"]
[{"$f":"IFERROR(VLOOKUP(C147,#REF!,9,FALSE),\"\")","v":""},{"$f":"C147&COUNTIF($C$2:C147,C147)","v":"FCS29201"},"FCS2920",null,null,1,4229,"2023-06-18",47,null,null,null,null,null,null,4229,4229,null,null,null,null,null,null,null,null,null,null,null,null,null,null,null,null,null,null,null,null,null,null,null,null,null,null,null,null,null,null,null,4229,"FCS2920-18-06-2023"]
[{"$f":"IFERROR(VLOOKUP(C148,#REF!,9,FALSE),\"\")","v":""},{"$f":"C148&COUNTIF($C$2:C148,C148)","v":"FCC91871"},"FCC9187",null,null,2,9690,"2023-06-18",47,null,null,null,null,null,null,9690,9690,null,null,null,null,null,null,null,null,null,null,null,null,null,null,null,null,null,null,null,null,null,null,null,null,null,null,null,null,null,null,null,9690,"FCC9187-18-06-2023"]
[{"$f":"IFERROR(VLOOKUP(C149,#REF!,9,FALSE),\"\")","v":""},{"$f":"C149&COUNTIF($C$2:C149,C149)","v":"FCC91711"},"FCC9171",null,null,8,477441.69,"2023-06-18",47,null,null,null,null,null,null,477441.69,477441.69,null,null,null,null,null,null,null,null,null,null,null,null,null,null,null,null,null,null,null,null,null,null,null,null,null,null,null,null,null,null,null,477441.69,"FCC9171-18-06-2023"]
[{"$f":"IFERROR(VLOOKUP(C150,#REF!,9,FALSE),\"\")","v":""},{"$f":"C150&COUNTIF($C$2:C150,C150)","v":"FCB22201"},"FCB2220",null,null,2,1457.69,"2023-06-18",47,null,null,null,null,null,null,1457.69,1457.69,null,null,null,null,null,null,null,null,null,null,null,null,null,null,null,null,null,null,null,null,null,null,null,null,null,null,null,null,null,null,null,1457.69,"FCB2220-18-06-2023"]
[{"$f":"IFERROR(VLOOKUP(C151,#REF!,9,FALSE),\"\")","v":""},{"$f":"C151&COUNTIF($C$2:C151,C151)","v":"FCS29171"},"FCS2917",null,null,9,56634.75,"2023-06-18",47,null,null,null,null,null,null,56634.75,56634.75,null,null,null,null,null,null,null,null,null,null,null,null,null,null,null,null,null,null,null,null,null,null,null,null,null,null,null,null,null,null,null,56634.75,"FCS2917-18-06-2023"]
[{"$f":"IFERROR(VLOOKUP(C152,#REF!,9,FALSE),\"\")","v":""},{"$f":"C152&COUNTIF($C$2:C152,C152)","v":"FCS10501"},"FCS1050",null,null,15,108183.7,"2023-06-18",47,null,null,null,null,null,null,108183.7,108183.7,null,null,null,null,null,null,null,null,null,null,null,null,null,null,null,null,null,null,null,null,null,null,null,null,null,null,null,null,null,null,null,108183.7,"FCS1050-18-06-2023"]
[{"$f":"IFERROR(VLOOKUP(C153,#REF!,9,FALSE),\"\")","v":""},{"$f":"C153&COUNTIF($C$2:C153,C153)","v":"FCC14901"},"FCC1490",null,null,6,48999.88,"2023-06-18",47,null,null,null,null,null,null,48999.88,48999.88,null,null,null,null,null,null,null,null,null,null,null,null,null,null,null,null,null,null,null,null,null,null,null,null,null,null,null,null,null,null,null,48999.88,"FCC1490-18-06-2023"]
[{"$f":"IFERROR(VLOOKUP(C154,#REF!,9,FALSE),\"\")","v":""},{"$f":"C154&COUNTIF($C$2:C154,C154)","v":"FCE00971"},"FCE0097",null,null,1,1928.3,"2023-06-18",47,null,null,null,null,null,null,1928.3,1928.3,null,null,null,null,null,null,null,null,null,null,null,null,null,null,null,null,null,null,null,null,null,null,null,null,null,null,null,null,null,null,null,1928.3,"FCE0097-18-06-2023"]
[{"$f":"IFERROR(VLOOKUP(C155,#REF!,9,FALSE),\"\")","v":""},{"$f":"C155&COUNTIF($C$2:C155,C155)","v":"FCX12601"},"FCX1260",null,null,13,38394,"2023-06-18",47,null,null,null,null,null,null,38394,38394,null,null,null,null,null,null,null,null,null,null,null,null,null,null,null,null,null,null,null,null,null,null,null,null,null,null,null,null,null,null,null,38394,"FCX1260-18-06-2023"]
[{"$f":"IFERROR(VLOOKUP(C156,#REF!,9,FALSE),\"\")","v":""},{"$f":"C156&COUNTIF($C$2:C156,C156)","v":"FCC91501"},"FCC9150",null,null,6,89936.67,"2023-06-18",47,null,null,null,null,null,null,89936.67,89936.67,null,null,null,null,null,null,null,null,null,null,null,null,null,null,null,null,null,null,null,null,null,null,null,null,null,null,null,null,null,null,null,89936.67,"FCC9150-18-06-2023"]
[{"$f":"IFERROR(VLOOKUP(C157,#REF!,9,FALSE),\"\")","v":""},{"$f":"C157&COUNTIF($C$2:C157,C157)","v":"FCD24301"},"FCD2430",null,null,1,2428,"2023-06-19",46,null,null,null,null,null,null,2428,2428,null,null,null,null,null,null,null,null,null,null,null,null,null,null,null,null,null,null,null,null,null,null,null,null,null,null,null,null,null,null,null,2428,"FCD2430-19-06-2023"]
[{"$f":"IFERROR(VLOOKUP(C158,#REF!,9,FALSE),\"\")","v":""},{"$f":"C158&COUNTIF($C$2:C158,C158)","v":"FCC91691"},"FCC9169",null,null,6,156432.14000000001,"2023-06-19",46,null,null,null,null,null,null,156432.14000000001,156432.14000000001,null,null,null,null,null,null,null,null,null,null,null,null,null,null,null,null,null,null,null,null,null,null,null,null,null,null,null,null,null,null,null,156432.14000000001,"FCC9169-19-06-2023"]
[{"$f":"IFERROR(VLOOKUP(C159,#REF!,9,FALSE),\"\")","v":""},{"$f":"C159&COUNTIF($C$2:C159,C159)","v":"FCB35401"},"FCB3540",null,null,2,15529,"2023-06-19",46,null,null,null,null,null,null,15529,15529,null,null,null,null,null,null,null,null,null,null,null,null,null,null,null,null,null,null,null,null,null,null,null,null,null,null,null,null,null,null,null,15529,"FCB3540-19-06-2023"]
[{"$f":"IFERROR(VLOOKUP(C160,#REF!,9,FALSE),\"\")","v":""},{"$f":"C160&COUNTIF($C$2:C160,C160)","v":"FCC91941"},"FCC9194",null,null,3,40639,"2023-06-19",46,null,null,null,null,null,null,40639,40639,null,null,null,null,null,null,null,null,null,null,null,null,null,null,null,null,null,null,null,null,null,null,null,null,null,null,null,null,null,null,null,40639,"FCC9194-19-06-2023"]
[{"$f":"IFERROR(VLOOKUP(C161,#REF!,9,FALSE),\"\")","v":""},{"$f":"C161&COUNTIF($C$2:C161,C161)","v":"FCC91811"},"FCC9181",null,null,4,60487.5,"2023-06-19",46,null,null,null,null,null,null,60487.5,60487.5,null,null,null,null,null,null,null,null,null,null,null,null,null,null,null,null,null,null,null,null,null,null,null,null,null,null,null,null,null,null,null,60487.5,"FCC9181-19-06-2023"]
[{"$f":"IFERROR(VLOOKUP(C162,#REF!,9,FALSE),\"\")","v":""},{"$f":"C162&COUNTIF($C$2:C162,C162)","v":"FCC06401"},"FCC0640",null,null,7,162612.01,"2023-06-19",46,null,null,null,null,null,null,162612.01,162612.01,null,null,null,null,null,null,null,null,null,null,null,null,null,null,null,null,null,null,null,null,null,null,null,null,null,null,null,null,null,null,null,162612.01,"FCC0640-19-06-2023"]
[{"$f":"IFERROR(VLOOKUP(C163,#REF!,9,FALSE),\"\")","v":""},{"$f":"C163&COUNTIF($C$2:C163,C163)","v":"FCC33801"},"FCC3380",null,null,33,237061,"2023-06-19",46,"2023-07-30",214169,3,0,22889,0,0,237061,null,null,null,null,null,null,null,null,null,null,null,null,null,null,null,null,null,null,null,null,null,null,null,null,null,null,null,null,null,null,null,237058,"FCC3380-19-06-2023"]
[{"$f":"IFERROR(VLOOKUP(C164,#REF!,9,FALSE),\"\")","v":""},{"$f":"C164&COUNTIF($C$2:C164,C164)","v":"FCC90901"},"FCC9090",null,null,24,653448.48,"2023-06-19",46,null,null,null,null,null,null,653448.48,653448.48,null,null,null,null,null,null,null,null,null,null,null,null,null,null,null,null,null,null,null,null,null,null,null,null,null,null,null,null,null,null,null,653448.48,"FCC9090-19-06-2023"]
[{"$f":"IFERROR(VLOOKUP(C165,#REF!,9,FALSE),\"\")","v":""},{"$f":"C165&COUNTIF($C$2:C165,C165)","v":"FCF26161"},"FCF2616",null,null,7,28930.5,"2023-06-19",46,null,null,null,null,null,null,28930.5,28930.5,null,null,null,null,null,null,null,null,null,null,null,null,null,null,null,null,null,null,null,null,null,null,null,null,null,null,null,null,null,null,null,28930.5,"FCF2616-19-06-2023"]
[{"$f":"IFERROR(VLOOKUP(C166,#REF!,9,FALSE),\"\")","v":""},{"$f":"C166&COUNTIF($C$2:C166,C166)","v":"FCC01502"},"FCC0150",null,"advance",1,8235,"2023-06-19",46,"2023-06-20",8235,-6587.9999999999991,0,0,0,6587.9999999999991,8235,null,null,null,null,null,null,null,null,null,null,null,null,null,null,null,null,null,null,null,null,null,null,null,null,null,null,null,null,null,null,null,14823,"FCC0150-19-06-2023"]
[{"$f":"IFERROR(VLOOKUP(C167,#REF!,9,FALSE),\"\")","v":""},{"$f":"C167&COUNTIF($C$2:C167,C167)","v":"FCC02801"},"FCC0280",null,"advance",78,2129152.1,"2023-06-19",46,"2023-07-19",970988.38,0,19357.5,1138806.22,0,0,2129152.1,null,null,null,null,null,null,null,null,null,null,null,null,null,null,null,null,null,null,null,null,null,null,null,null,null,null,null,null,null,null,null,2129152.1,"FCC0280-19-06-2023"]
[{"$f":"IFERROR(VLOOKUP(C168,#REF!,9,FALSE),\"\")","v":""},{"$f":"C168&COUNTIF($C$2:C168,C168)","v":"FCS22701"},"FCS2270",null,null,4,34709.1,"2023-06-19",46,null,null,null,null,null,null,34709.1,34709.1,null,null,null,null,null,null,null,null,null,null,null,null,null,null,null,null,null,null,null,null,null,null,null,null,null,null,null,null,null,null,null,34709.1,"FCS2270-19-06-2023"]
[{"$f":"IFERROR(VLOOKUP(C169,#REF!,9,FALSE),\"\")","v":""},{"$f":"C169&COUNTIF($C$2:C169,C169)","v":"FCS29271"},"FCS2927",null,null,22,254561.69,"2023-06-19",46,null,null,null,null,null,null,254561.69,254561.69,null,null,null,null,null,null,null,null,null,null,null,null,null,null,null,null,null,null,null,null,null,null,null,null,null,null,null,null,null,null,null,254561.69,"FCS2927-19-06-2023"]
[{"$f":"IFERROR(VLOOKUP(C170,#REF!,9,FALSE),\"\")","v":""},{"$f":"C170&COUNTIF($C$2:C170,C170)","v":"FCC91391"},"FCC9139",null,null,9,39405,"2023-06-19",46,null,null,null,null,null,null,39405,39405,null,null,null,null,null,null,null,null,null,null,null,null,null,null,null,null,null,null,null,null,null,null,null,null,null,null,null,null,null,null,null,39405,"FCC9139-19-06-2023"]
[{"$f":"IFERROR(VLOOKUP(C171,#REF!,9,FALSE),\"\")","v":""},{"$f":"C171&COUNTIF($C$2:C171,C171)","v":"FCC21101"},"FCC2110",null,null,2,9528,"2023-06-19",46,null,null,null,null,null,null,9528,9528,null,null,null,null,null,null,null,null,null,null,null,null,null,null,null,null,null,null,null,null,null,null,null,null,null,null,null,null,null,null,null,9528,"FCC2110-19-06-2023"]
[{"$f":"IFERROR(VLOOKUP(C172,#REF!,9,FALSE),\"\")","v":""},{"$f":"C172&COUNTIF($C$2:C172,C172)","v":"FCC91821"},"FCC9182",null,null,3,24482.5,"2023-06-19",46,null,null,null,null,null,null,24482.5,24482.5,null,null,null,null,null,null,null,null,null,null,null,null,null,null,null,null,null,null,null,null,null,null,null,null,null,null,null,null,null,null,null,24482.5,"FCC9182-19-06-2023"]
[{"$f":"IFERROR(VLOOKUP(C173,#REF!,9,FALSE),\"\")","v":""},{"$f":"C173&COUNTIF($C$2:C173,C173)","v":"FCF26171"},"FCF2617",null,null,5,74039.44,"2023-06-20",45,null,null,null,null,null,null,74039.44,74039.44,null,null,null,null,null,null,null,null,null,null,null,null,null,null,null,null,null,null,null,null,null,null,null,null,null,null,null,null,null,null,null,74039.44,"FCF2617-20-06-2023"]
[{"$f":"IFERROR(VLOOKUP(C174,#REF!,9,FALSE),\"\")","v":""},{"$f":"C174&COUNTIF($C$2:C174,C174)","v":"FCC28401"},"FCC2840",null,"advance",43,148371.5,"2023-06-20",45,"2023-07-27",118209.9,10322.100000000006,0,19839.5,0,0,148371.5,null,null,null,null,null,null,null,null,null,null,null,null,null,null,null,null,null,null,null,null,null,null,null,null,null,null,null,null,null,null,null,138049.4,"FCC2840-20-06-2023"]
[{"$f":"IFERROR(VLOOKUP(C175,#REF!,9,FALSE),\"\")","v":""},{"$f":"C175&COUNTIF($C$2:C175,C175)","v":"FCS29141"},"FCS2914",null,null,13,62991.53,"2023-06-20",45,null,null,null,null,null,null,62991.53,62991.53,null,null,null,null,null,null,null,null,null,null,null,null,null,null,null,null,null,null,null,null,null,null,null,null,null,null,null,null,null,null,null,62991.53,"FCS2914-20-06-2023"]
[{"$f":"IFERROR(VLOOKUP(C176,#REF!,9,FALSE),\"\")","v":""},{"$f":"C176&COUNTIF($C$2:C176,C176)","v":"FCC91881"},"FCC9188",null,null,9,119375.26,"2023-06-20",45,null,null,null,null,null,null,119375.26,119375.26,null,null,null,null,null,null,null,null,null,null,null,null,null,null,null,null,null,null,null,null,null,null,null,null,null,null,null,null,null,null,null,119375.26,"FCC9188-20-06-2023"]
[{"$f":"IFERROR(VLOOKUP(C177,#REF!,9,FALSE),\"\")","v":""},{"$f":"C177&COUNTIF($C$2:C177,C177)","v":"FCC16601"},"FCC1660",null,"advance+VD",63,792226.13,"2023-06-20",45,"2023-07-19",788554.87,3471.2600000000093,200,0,0,0,792226.13,null,null,null,null,null,null,null,null,null,null,null,null,null,null,null,null,null,null,null,null,null,null,null,null,null,null,null,null,null,null,null,788754.87,"FCC1660-20-06-2023"]
[{"$f":"IFERROR(VLOOKUP(C178,#REF!,9,FALSE),\"\")","v":""},{"$f":"C178&COUNTIF($C$2:C178,C178)","v":"FCK24101"},"FCK2410",null,null,19,109745.66,"2023-06-20",45,null,null,null,null,null,null,109745.66,109745.66,null,null,null,null,null,null,null,null,null,null,null,null,null,null,null,null,null,null,null,null,null,null,null,null,null,null,null,null,null,null,null,109745.66,"FCK2410-20-06-2023"]
[{"$f":"IFERROR(VLOOKUP(C179,#REF!,9,FALSE),\"\")","v":""},{"$f":"C179&COUNTIF($C$2:C179,C179)","v":"FCU19921"},"FCU1992",null,null,6,59956.41,"2023-06-21",44,null,null,null,null,null,null,59956.41,59956.41,null,null,null,null,null,null,null,null,null,null,null,null,null,null,null,null,null,null,null,null,null,null,null,null,null,null,null,null,null,null,null,59956.41,"FCU1992-21-06-2023"]
[{"$f":"IFERROR(VLOOKUP(C180,#REF!,9,FALSE),\"\")","v":""},{"$f":"C180&COUNTIF($C$2:C180,C180)","v":"FCC02701"},"FCC0270",null,"advance",10,53720,"2023-06-21",44,"2023-07-16",48858.29,4861.7099999999991,0,0,"price differnce, claim paid in cash",0,53720,null,null,null,null,null,null,null,null,null,null,null,null,null,null,null,null,null,null,null,null,null,null,null,null,null,null,null,null,null,null,null,48858.29,"FCC0270-21-06-2023"]
[{"$f":"IFERROR(VLOOKUP(C181,#REF!,9,FALSE),\"\")","v":""},{"$f":"C181&COUNTIF($C$2:C181,C181)","v":"FCV11701"},"FCV1170",null,null,10,48259.24,"2023-06-21",44,null,null,null,null,null,null,48259.24,48259.24,null,null,null,null,null,null,null,null,null,null,null,null,null,null,null,null,null,null,null,null,null,null,null,null,null,null,null,null,null,null,null,48259.24,"FCV1170-21-06-2023"]
[{"$f":"IFERROR(VLOOKUP(C182,#REF!,9,FALSE),\"\")","v":""},{"$f":"C182&COUNTIF($C$2:C182,C182)","v":"FCC00601"},"FCC0060",null,"advance",24,220562.8,"2023-06-21",44,null,null,null,null,null,null,220562.8,220562.8,null,null,null,null,null,null,null,null,null,null,null,null,null,null,null,null,null,null,null,null,null,null,null,null,null,null,null,null,null,null,null,220562.8,"FCC0060-21-06-2023"]
[{"$f":"IFERROR(VLOOKUP(C183,#REF!,9,FALSE),\"\")","v":""},{"$f":"C183&COUNTIF($C$2:C183,C183)","v":"FCE01011"},"FCE0101",null,null,19,96402.36,"2023-06-21",44,null,null,null,null,null,null,96402.36,96402.36,null,null,null,null,null,null,null,null,null,null,null,null,null,null,null,null,null,null,null,null,null,null,null,null,null,null,null,null,null,null,null,96402.36,"FCE0101-21-06-2023"]
[{"$f":"IFERROR(VLOOKUP(C184,#REF!,9,FALSE),\"\")","v":""},{"$f":"C184&COUNTIF($C$2:C184,C184)","v":"FCU19901"},"FCU1990",null,null,20,115126.85,"2023-06-21",44,null,null,null,null,null,null,115126.85,115126.85,null,null,null,null,null,null,null,null,null,null,null,null,null,null,null,null,null,null,null,null,null,null,null,null,null,null,null,null,null,null,null,115126.85,"FCU1990-21-06-2023"]
[{"$f":"IFERROR(VLOOKUP(C185,#REF!,9,FALSE),\"\")","v":""},{"$f":"C185&COUNTIF($C$2:C185,C185)","v":"FCC91471"},"FCC9147",null,null,2,6500,"2023-06-21",44,null,null,null,null,null,null,6500,6500,null,null,null,null,null,null,null,null,null,null,null,null,null,null,null,null,null,null,null,null,null,null,null,null,null,null,null,null,null,null,null,6500,"FCC9147-21-06-2023"]
[{"$f":"IFERROR(VLOOKUP(C186,#REF!,9,FALSE),\"\")","v":""},{"$f":"C186&COUNTIF($C$2:C186,C186)","v":"FCK30841"},"FCK3084",null,null,15,180167.3,"2023-06-21",44,null,null,null,null,null,null,180167.3,180167.3,null,null,null,null,null,null,null,null,null,null,null,null,null,null,null,null,null,null,null,null,null,null,null,null,null,null,null,null,null,null,null,180167.3,"FCK3084-21-06-2023"]
[{"$f":"IFERROR(VLOOKUP(C187,#REF!,9,FALSE),\"\")","v":""},{"$f":"C187&COUNTIF($C$2:C187,C187)","v":"FCX27991"},"FCX2799",null,null,9,120856.68,"2023-06-22",43,null,null,null,null,null,null,120856.68,120856.68,null,null,null,null,null,null,null,null,null,null,null,null,null,null,null,null,null,null,null,null,null,null,null,null,null,null,null,null,null,null,null,120856.68,"FCX2799-22-06-2023"]
[{"$f":"IFERROR(VLOOKUP(C188,#REF!,9,FALSE),\"\")","v":""},{"$f":"C188&COUNTIF($C$2:C188,C188)","v":"FCN08901"},"FCN0890",null,null,6,91728.74,"2023-06-22",43,null,null,null,null,null,null,91728.74,91728.74,null,null,null,null,null,null,null,null,null,null,null,null,null,null,null,null,null,null,null,null,null,null,null,null,null,null,null,null,null,null,null,91728.74,"FCN0890-22-06-2023"]
[{"$f":"IFERROR(VLOOKUP(C189,#REF!,9,FALSE),\"\")","v":""},{"$f":"C189&COUNTIF($C$2:C189,C189)","v":"FCF26181"},"FCF2618",null,null,4,53285.86,"2023-06-22",43,null,null,null,null,null,null,53285.86,53285.86,null,null,null,null,null,null,null,null,null,null,null,null,null,null,null,null,null,null,null,null,null,null,null,null,null,null,null,null,null,null,null,53285.86,"FCF2618-22-06-2023"]
[{"$f":"IFERROR(VLOOKUP(C190,#REF!,9,FALSE),\"\")","v":""},{"$f":"C190&COUNTIF($C$2:C190,C190)","v":"FCZ17801"},"FCZ1780",null,null,42,69243.95,"2023-06-22",43,"2023-07-26",62820.83,5694.6299999999956,728.49,0,0,-2.2737367544323206E-13,69243.95,null,null,null,null,null,null,null,null,null,null,null,null,null,null,null,null,null,null,null,null,null,null,null,null,null,null,null,null,null,null,null,63549.32,"FCZ1780-22-06-2023"]
[{"$f":"IFERROR(VLOOKUP(C191,#REF!,9,FALSE),\"\")","v":""},{"$f":"C191&COUNTIF($C$2:C191,C191)","v":"FCC91741"},"FCC9174",null,null,1,27000,"2023-06-22",43,null,null,null,null,null,null,27000,27000,null,null,null,null,null,null,null,null,null,null,null,null,null,null,null,null,null,null,null,null,null,null,null,null,null,null,null,null,null,null,null,27000,"FCC9174-22-06-2023"]
[{"$f":"IFERROR(VLOOKUP(C192,#REF!,9,FALSE),\"\")","v":""},{"$f":"C192&COUNTIF($C$2:C192,C192)","v":"FCC17802"},"FCC1780",null,null,4,51700,"2023-06-22",43,null,null,null,null,null,null,51700,51700,null,null,null,null,null,null,null,null,null,null,null,null,null,null,null,null,null,null,null,null,null,null,null,null,null,null,null,null,null,null,null,51700,"FCC1780-22-06-2023"]
[{"$f":"IFERROR(VLOOKUP(C193,#REF!,9,FALSE),\"\")","v":""},{"$f":"C193&COUNTIF($C$2:C193,C193)","v":"FCC35201"},"FCC3520",null,"advance",33,540315.6,"2023-06-25",40,null,null,null,null,null,null,540315.6,540315.6,null,null,null,null,null,null,null,null,null,null,null,null,null,null,null,null,null,null,null,null,null,null,null,null,null,null,null,null,null,null,null,540315.6,"FCC3520-25-06-2023"]
[{"$f":"IFERROR(VLOOKUP(C194,#REF!,9,FALSE),\"\")","v":""},{"$f":"C194&COUNTIF($C$2:C194,C194)","v":"FCC91921"},"FCC9192",null,null,9,109246.09,"2023-06-25",{"$f":"+TODAY()-H194","v":40},null,null,null,null,null,null,{"$f":"+G194-K194-L194-M194-N194","v":109246.09},{"$f":"+G194-R194-T194-V194-X194-Z194-AB194-AD194-AF194-AH194-AJ194-AL194-AN194-AP194-AT194-AV194","v":109246.09},null,null,null,null,null,null,null,null,null,null,null,null,null,null,null,null,null,null,null,null,null,null,null,null,null,null,null,null,null,null,null,109246.09,"FCC9192-25-06-2023"]
[{"$f":"IFERROR(VLOOKUP(C195,#REF!,9,FALSE),\"\")","v":""},{"$f":"C195&COUNTIF($C$2:C195,C195)","v":"FCY13501"},"FCY1350",null,null,20,195774.97,"2023-06-25",40,null,null,null,null,null,null,195774.97,195774.97,null,null,null,null,null,null,null,null,null,null,null,null,null,null,null,null,null,null,null,null,null,null,null,null,null,null,null,null,null,null,null,{"$f":"G195-(L195++R195+T195+V195+X195+Z195+AB195+AD195+AF195+AH195+AJ195+AL195+AN195+AP195+AR195)","v":195774.97},{"$f":"CONCATENATE(C195,\"-\",TEXT(H195,\"DD-MM-YYYY\"))","v":"FCY1350-25-06-2023"}]
[{"$f":"IFERROR(VLOOKUP(C196,#REF!,9,FALSE),\"\")","v":""},{"$f":"C196&COUNTIF($C$2:C196,C196)","v":"FCG30921"},"FCG3092",null,null,5,20125.25,"2023-06-25",40,null,null,null,null,null,null,20125.25,20125.25,null,null,null,null,null,null,null,null,null,null,null,null,null,null,null,null,null,null,null,null,null,null,null,null,null,null,null,null,null,null,null,20125.25,"FCG3092-25-06-2023"]
[{"$f":"IFERROR(VLOOKUP(C197,#REF!,9,FALSE),\"\")","v":""},{"$f":"C197&COUNTIF($C$2:C197,C197)","v":"FCX18301"},"FCX1830",null,null,20,191489.71,"2023-06-25",40,null,null,null,null,null,null,191489.71,191489.71,null,null,null,null,null,null,null,null,null,null,null,null,null,null,null,null,null,null,null,null,null,null,null,null,null,null,null,null,null,null,null,191489.71,"FCX1830-25-06-2023"]
[{"$f":"IFERROR(VLOOKUP(C198,#REF!,9,FALSE),\"\")","v":""},{"$f":"C198&COUNTIF($C$2:C198,C198)","v":"FCZ18101"},"FCZ1810",null,null,11,4744.1000000000004,"2023-06-25",40,null,null,null,null,null,null,4744.1000000000004,4744.1000000000004,null,null,null,null,null,null,null,null,null,null,null,null,null,null,null,null,null,null,null,null,null,null,null,null,null,null,null,null,null,null,null,4744.1000000000004,"FCZ1810-25-06-2023"]
[{"$f":"IFERROR(VLOOKUP(C199,#REF!,9,FALSE),\"\")","v":""},{"$f":"C199&COUNTIF($C$2:C199,C199)","v":"FCX25601"},"FCX2560",null,null,3,81282.960000000006,"2023-06-25",40,null,null,null,null,null,null,81282.960000000006,81282.960000000006,null,null,null,null,null,null,null,null,null,null,null,null,null,null,null,null,null,null,null,null,null,null,null,null,null,null,null,null,null,null,null,81282.960000000006,"FCX2560-25-06-2023"]
[{"$f":"IFERROR(VLOOKUP(C200,#REF!,9,FALSE),\"\")","v":""},{"$f":"C200&COUNTIF($C$2:C200,C200)","v":"FCK35501"},"FCK3550",null,null,1,9380.2199999999993,"2023-06-25",40,null,null,null,null,null,null,9380.2199999999993,9380.2199999999993,null,null,null,null,null,null,null,null,null,null,null,null,null,null,null,null,null,null,null,null,null,null,null,null,null,null,null,null,null,null,null,9380.2199999999993,"FCK3550-25-06-2023"]
[{"$f":"IFERROR(VLOOKUP(C201,#REF!,9,FALSE),\"\")","v":""},{"$f":"C201&COUNTIF($C$2:C201,C201)","v":"FCK30821"},"FCK3082",null,null,8,68966.080000000002,"2023-06-25",40,null,null,null,null,null,null,68966.080000000002,68966.080000000002,null,null,null,null,null,null,null,null,null,null,null,null,null,null,null,null,null,null,null,null,null,null,null,null,null,null,null,null,null,null,null,68966.080000000002,"FCK3082-25-06-2023"]
[{"$f":"IFERROR(VLOOKUP(C202,#REF!,9,FALSE),\"\")","v":""},{"$f":"C202&COUNTIF($C$2:C202,C202)","v":"FCC91401"},"FCC9140",null,null,1,4546,"2023-06-25",40,null,null,null,null,null,null,4546,4546,null,null,null,null,null,null,null,null,null,null,null,null,null,null,null,null,null,null,null,null,null,null,null,null,null,null,null,null,null,null,null,4546,"FCC9140-25-06-2023"]
[{"$f":"IFERROR(VLOOKUP(C203,#REF!,9,FALSE),\"\")","v":""},{"$f":"C203&COUNTIF($C$2:C203,C203)","v":"FCZ27291"},"FCZ2729",null,null,11,93017.67,"2023-06-25",40,null,null,null,null,null,null,93017.67,93017.67,null,null,null,null,null,null,null,null,null,null,null,null,null,null,null,null,null,null,null,null,null,null,null,null,null,null,null,null,null,null,null,93017.67,"FCZ2729-25-06-2023"]
[{"$f":"IFERROR(VLOOKUP(C204,#REF!,9,FALSE),\"\")","v":""},{"$f":"C204&COUNTIF($C$2:C204,C204)","v":"FCC03901"},"FCC0390",null,null,2,13616.15,"2023-06-25",40,null,null,null,null,null,null,13616.15,13616.15,null,null,null,null,null,null,null,null,null,null,null,null,null,null,null,null,null,null,null,null,null,null,null,null,null,null,null,null,null,null,null,13616.15,"FCC0390-25-06-2023"]
[{"$f":"IFERROR(VLOOKUP(C205,#REF!,9,FALSE),\"\")","v":""},{"$f":"C205&COUNTIF($C$2:C205,C205)","v":"FCX12001"},"FCX1200",null,null,21,318088.03000000003,"2023-06-25",40,null,null,null,null,null,null,318088.03000000003,318088.03000000003,null,null,null,null,null,null,null,null,null,null,null,null,null,null,null,null,null,null,null,null,null,null,null,null,null,null,null,null,null,null,null,318088.03000000003,"FCX1200-25-06-2023"]
[{"$f":"IFERROR(VLOOKUP(C206,#REF!,9,FALSE),\"\")","v":""},{"$f":"C206&COUNTIF($C$2:C206,C206)","v":"FCC29501"},"FCC2950",null,null,30,158929,"2023-06-25",40,null,null,null,null,null,null,158929,158929,null,null,null,null,null,null,null,null,null,null,null,null,null,null,null,null,null,null,null,null,null,null,null,null,null,null,null,null,null,null,null,158929,"FCC2950-25-06-2023"]
[{"$f":"IFERROR(VLOOKUP(C207,#REF!,9,FALSE),\"\")","v":""},{"$f":"C207&COUNTIF($C$2:C207,C207)","v":"FCC05802"},"FCC0580",null,"advance",69,1509195,"2023-06-25",40,"2023-07-19",1186921.28,0,2798.79,319474.93,0,0,1509195,null,null,null,null,null,null,null,null,null,null,null,null,null,null,null,null,null,null,null,null,null,null,null,null,null,null,null,null,null,null,null,1509195,"FCC0580-25-06-2023"]
[{"$f":"IFERROR(VLOOKUP(C208,#REF!,9,FALSE),\"\")","v":""},{"$f":"C208&COUNTIF($C$2:C208,C208)","v":"FCC03802"},"FCC0380",null,null,28,321461.5,"2023-06-25",40,"2023-07-26",292115.84000000003,704.15999999997439,4000,24641.5,0,0,321461.5,null,null,null,null,null,null,null,null,null,null,null,null,null,null,null,null,null,null,null,null,null,null,null,null,null,null,null,null,null,null,null,320757.34000000003,"FCC0380-25-06-2023"]
[{"$f":"IFERROR(VLOOKUP(C209,#REF!,9,FALSE),\"\")","v":""},{"$f":"C209&COUNTIF($C$2:C209,C209)","v":"FCD30531"},"FCD3053",null,null,4,12720,"2023-06-25",40,null,null,null,null,null,null,12720,12720,null,null,null,null,null,null,null,null,null,null,null,null,null,null,null,null,null,null,null,null,null,null,null,null,null,null,null,null,null,null,null,12720,"FCD3053-25-06-2023"]
[{"$f":"IFERROR(VLOOKUP(C210,#REF!,9,FALSE),\"\")","v":""},{"$f":"C210&COUNTIF($C$2:C210,C210)","v":"FCC02301"},"FCC0230",null,null,7,131371.1,"2023-06-25",40,null,null,null,null,null,null,131371.1,131371.1,null,null,null,null,null,null,null,null,null,null,null,null,null,null,null,null,null,null,null,null,null,null,null,null,null,null,null,null,null,null,null,131371.1,"FCC0230-25-06-2023"]
[{"$f":"IFERROR(VLOOKUP(C211,#REF!,9,FALSE),\"\")","v":""},{"$f":"C211&COUNTIF($C$2:C211,C211)","v":"FCS22601"},"FCS2260",null,null,18,96801.1,"2023-06-25",40,null,null,null,null,null,null,96801.1,96801.1,null,null,null,null,null,null,null,null,null,null,null,null,null,null,null,null,null,null,null,null,null,null,null,null,null,null,null,null,null,null,null,96801.1,"FCS2260-25-06-2023"]
[{"$f":"IFERROR(VLOOKUP(C212,#REF!,9,FALSE),\"\")","v":""},{"$f":"C212&COUNTIF($C$2:C212,C212)","v":"FCC29801"},"FCC2980",null,null,26,393139.07,"2023-06-25",40,null,null,null,null,null,null,393139.07,393139.07,null,null,null,null,null,null,null,null,null,null,null,null,null,null,null,null,null,null,null,null,null,null,null,null,null,null,null,null,null,null,null,393139.07,"FCC2980-25-06-2023"]
[{"$f":"IFERROR(VLOOKUP(C213,#REF!,9,FALSE),\"\")","v":""},{"$f":"C213&COUNTIF($C$2:C213,C213)","v":"FCC91381"},"FCC9138",null,null,8,42561,"2023-06-25",40,null,null,null,null,null,null,42561,42561,null,null,null,null,null,null,null,null,null,null,null,null,null,null,null,null,null,null,null,null,null,null,null,null,null,null,null,null,null,null,null,42561,"FCC9138-25-06-2023"]
[{"$f":"IFERROR(VLOOKUP(C214,#REF!,9,FALSE),\"\")","v":""},{"$f":"C214&COUNTIF($C$2:C214,C214)","v":"FCC91661"},"FCC9166",null,null,2,20800,"2023-06-25",40,null,null,null,null,null,null,20800,20800,null,null,null,null,null,null,null,null,null,null,null,null,null,null,null,null,null,null,null,null,null,null,null,null,null,null,null,null,null,null,null,20800,"FCC9166-25-06-2023"]
[{"$f":"IFERROR(VLOOKUP(C215,#REF!,9,FALSE),\"\")","v":""},{"$f":"C215&COUNTIF($C$2:C215,C215)","v":"FCC91831"},"FCC9183",null,null,8,70737.570000000007,"2023-06-25",40,null,null,null,null,null,null,70737.570000000007,70737.570000000007,null,null,null,null,null,null,null,null,null,null,null,null,null,null,null,null,null,null,null,null,null,null,null,null,null,null,null,null,null,null,null,70737.570000000007,"FCC9183-25-06-2023"]
[{"$f":"IFERROR(VLOOKUP(C216,#REF!,9,FALSE),\"\")","v":""},{"$f":"C216&COUNTIF($C$2:C216,C216)","v":"FCC20901"},"FCC2090",null,"advance",1,11574.93,"2023-06-25",40,null,null,null,null,null,null,11574.93,11574.93,null,null,null,null,null,null,null,null,null,null,null,null,null,null,null,null,null,null,null,null,null,null,null,null,null,null,null,null,null,null,null,11574.93,"FCC2090-25-06-2023"]
[{"$f":"IFERROR(VLOOKUP(C217,#REF!,9,FALSE),\"\")","v":""},{"$f":"C217&COUNTIF($C$2:C217,C217)","v":"FCC17401"},"FCC1740",null,null,22,192834,"2023-06-25",40,null,null,null,null,null,null,192834,192834,null,null,null,null,null,null,null,null,null,null,null,null,null,null,null,null,null,null,null,null,null,null,null,null,null,null,null,null,null,null,null,192834,"FCC1740-25-06-2023"]
[{"$f":"IFERROR(VLOOKUP(C218,#REF!,9,FALSE),\"\")","v":""},{"$f":"C218&COUNTIF($C$2:C218,C218)","v":"FCA19101"},"FCA1910",null,null,18,30062.400000000001,"2023-06-25",40,null,null,null,null,null,null,30062.400000000001,30062.400000000001,null,null,null,null,null,null,null,null,null,null,null,null,null,null,null,null,null,null,null,null,null,null,null,null,null,null,null,null,null,null,null,30062.400000000001,"FCA1910-25-06-2023"]
[{"$f":"IFERROR(VLOOKUP(C219,#REF!,9,FALSE),\"\")","v":""},{"$f":"C219&COUNTIF($C$2:C219,C219)","v":"FCC27501"},"FCC2750",null,null,1,17858.07,"2023-06-25",40,null,null,null,null,null,null,17858.07,17858.07,null,null,null,null,null,null,null,null,null,null,null,null,null,null,null,null,null,null,null,null,null,null,null,null,null,null,null,null,null,null,null,17858.07,"FCC2750-25-06-2023"]
[{"$f":"IFERROR(VLOOKUP(C220,#REF!,9,FALSE),\"\")","v":""},{"$f":"C220&COUNTIF($C$2:C220,C220)","v":"FCF33301"},"FCF3330",null,"advance",31,924596.18,"2023-06-25",40,null,null,null,null,null,null,924596.18,924596.18,null,null,null,null,null,null,null,null,null,null,null,null,null,null,null,null,null,null,null,null,null,null,null,null,null,null,null,null,null,null,null,924596.18,"FCF3330-25-06-2023"]
[{"$f":"IFERROR(VLOOKUP(C221,#REF!,9,FALSE),\"\")","v":""},{"$f":"C221&COUNTIF($C$2:C221,C221)","v":"FCC33401"},"FCC3340",null,null,8,85583.35,"2023-06-25",40,null,null,null,null,null,null,85583.35,85583.35,null,null,null,null,null,null,null,null,null,null,null,null,null,null,null,null,null,null,null,null,null,null,null,null,null,null,null,null,null,null,null,85583.35,"FCC3340-25-06-2023"]
[{"$f":"IFERROR(VLOOKUP(C222,#REF!,9,FALSE),\"\")","v":""},{"$f":"C222&COUNTIF($C$2:C222,C222)","v":"FCX13101"},"FCX1310",null,null,3,11790,"2023-06-26",39,null,null,null,null,null,null,11790,11790,null,null,null,null,null,null,null,null,null,null,null,null,null,null,null,null,null,null,null,null,null,null,null,null,null,null,null,null,null,null,null,11790,"FCX1310-26-06-2023"]
[{"$f":"IFERROR(VLOOKUP(C223,#REF!,9,FALSE),\"\")","v":""},{"$f":"C223&COUNTIF($C$2:C223,C223)","v":"FCZ18301"},"FCZ1830",null,null,1,1861,"2023-06-26",39,null,null,null,null,null,null,1861,1861,null,null,null,null,null,null,null,null,null,null,null,null,null,null,null,null,null,null,null,null,null,null,null,null,null,null,null,null,null,null,null,1861,"FCZ1830-26-06-2023"]
[{"$f":"IFERROR(VLOOKUP(C224,#REF!,9,FALSE),\"\")","v":""},{"$f":"C224&COUNTIF($C$2:C224,C224)","v":"FCY16701"},"FCY1670",null,null,2,5470,"2023-06-26",39,null,null,null,null,null,null,5470,5470,null,null,null,null,null,null,null,null,null,null,null,null,null,null,null,null,null,null,null,null,null,null,null,null,null,null,null,null,null,null,null,5470,"FCY1670-26-06-2023"]
[{"$f":"IFERROR(VLOOKUP(C225,#REF!,9,FALSE),\"\")","v":""},{"$f":"C225&COUNTIF($C$2:C225,C225)","v":"0"},null,null,null,null,null,null,45142,null,null,null,null,null,null,0,0,null,null,null,null,null,null,null,null,null,null,null,null,null,null,null,null,null,null,null,null,null,null,null,null,null,null,null,null,null,null,null,0,"-00-01-1900"]
[{"$f":"IFERROR(VLOOKUP(C226,#REF!,9,FALSE),\"\")","v":""},{"$f":"C226&COUNTIF($C$2:C226,C226)","v":"0"},null,null,null,null,null,null,45142,null,null,null,null,null,null,0,0,null,null,null,null,null,null,null,null,null,null,null,null,null,null,null,null,null,null,null,null,null,null,null,null,null,null,null,null,null,null,null,0,"-00-01-1900"]
[{"$f":"IFERROR(VLOOKUP(C227,#REF!,9,FALSE),\"\")","v":""},{"$f":"C227&COUNTIF($C$2:C227,C227)","v":"0"},null,null,null,null,null,null,45142,null,null,null,null,null,null,0,0,null,null,null,null,null,null,null,null,null,null,null,null,null,null,null,null,null,null,null,null,null,null,null,null,null,null,null,null,null,null,null,0,"-00-01-1900"]
[{"$f":"IFERROR(VLOOKUP(C228,#REF!,9,FALSE),\"\")","v":""},{"$f":"C228&COUNTIF($C$2:C228,C228)","v":"0"},null,null,null,null,null,null,45142,null,null,null,null,null,null,0,0,null,null,null,null,null,null,null,null,null,null,null,null,null,null,null,null,null,null,null,null,null,null,null,null,null,null,null,null,null,null,null,0,"-00-01-1900"]
[{"$f":"IFERROR(VLOOKUP(C229,#REF!,9,FALSE),\"\")","v":""},{"$f":"C229&COUNTIF($C$2:C229,C229)","v":"0"},null,null,null,null,null,null,45142,null,null,null,null,null,null,0,0,null,null,null,null,null,null,null,null,null,null,null,null,null,null,null,null,null,null,null,null,null,null,null,null,null,null,null,null,null,null,null,0,"-00-01-1900"]
[{"$f":"IFERROR(VLOOKUP(C230,#REF!,9,FALSE),\"\")","v":""},{"$f":"C230&COUNTIF($C$2:C230,C230)","v":"0"},null,null,null,null,null,null,45142,null,null,null,null,null,null,0,0,null,null,null,null,null,null,null,null,null,null,null,null,null,null,null,null,null,null,null,null,null,null,null,null,null,null,null,null,null,null,null,0,"-00-01-1900"]
[{"$f":"IFERROR(VLOOKUP(C231,#REF!,9,FALSE),\"\")","v":""},{"$f":"C231&COUNTIF($C$2:C231,C231)","v":"0"},null,null,null,null,null,null,45142,null,null,null,null,null,null,0,0,null,null,null,null,null,null,null,null,null,null,null,null,null,null,null,null,null,null,null,null,null,null,null,null,null,null,null,null,null,null,null,0,"-00-01-1900"]
[{"$f":"IFERROR(VLOOKUP(C232,#REF!,9,FALSE),\"\")","v":""},{"$f":"C232&COUNTIF($C$2:C232,C232)","v":"0"},null,null,null,null,null,null,45142,null,null,null,null,null,null,0,0,null,null,null,null,null,null,null,null,null,null,null,null,null,null,null,null,null,null,null,null,null,null,null,null,null,null,null,null,null,null,null,0,"-00-01-1900"]
[{"$f":"IFERROR(VLOOKUP(C233,#REF!,9,FALSE),\"\")","v":""},{"$f":"C233&COUNTIF($C$2:C233,C233)","v":"0"},null,null,null,null,null,null,45142,null,null,null,null,null,null,0,0,null,null,null,null,null,null,null,null,null,null,null,null,null,null,null,null,null,null,null,null,null,null,null,null,null,null,null,null,null,null,null,0,"-00-01-1900"]
[{"$f":"IFERROR(VLOOKUP(C234,#REF!,9,FALSE),\"\")","v":""},{"$f":"C234&COUNTIF($C$2:C234,C234)","v":"0"},null,null,null,null,null,null,45142,null,null,null,null,null,null,0,0,null,null,null,null,null,null,null,null,null,null,null,null,null,null,null,null,null,null,null,null,null,null,null,null,null,null,null,null,null,null,null,0,"-00-01-1900"]
[{"$f":"IFERROR(VLOOKUP(C235,#REF!,9,FALSE),\"\")","v":""},{"$f":"C235&COUNTIF($C$2:C235,C235)","v":"0"},null,null,null,null,null,null,45142,null,null,null,null,null,null,0,0,null,null,null,null,null,null,null,null,null,null,null,null,null,null,null,null,null,null,null,null,null,null,null,null,null,null,null,null,null,null,null,0,"-00-01-1900"]
[{"$f":"IFERROR(VLOOKUP(C236,#REF!,9,FALSE),\"\")","v":""},{"$f":"C236&COUNTIF($C$2:C236,C236)","v":"0"},null,null,null,null,null,null,45142,null,null,null,null,null,null,0,0,null,null,null,null,null,null,null,null,null,null,null,null,null,null,null,null,null,null,null,null,null,null,null,null,null,null,null,null,null,null,null,0,"-00-01-1900"]
[{"$f":"IFERROR(VLOOKUP(C237,#REF!,9,FALSE),\"\")","v":""},{"$f":"C237&COUNTIF($C$2:C237,C237)","v":"0"},null,null,null,null,null,null,45142,null,null,null,null,null,null,0,0,null,null,null,null,null,null,null,null,null,null,null,null,null,null,null,null,null,null,null,null,null,null,null,null,null,null,null,null,null,null,null,0,"-00-01-1900"]
[{"$f":"IFERROR(VLOOKUP(C238,#REF!,9,FALSE),\"\")","v":""},{"$f":"C238&COUNTIF($C$2:C238,C238)","v":"0"},null,null,null,null,null,null,45142,null,null,null,null,null,null,0,0,null,null,null,null,null,null,null,null,null,null,null,null,null,null,null,null,null,null,null,null,null,null,null,null,null,null,null,null,null,null,null,0,"-00-01-1900"]
[{"$f":"IFERROR(VLOOKUP(C239,#REF!,9,FALSE),\"\")","v":""},{"$f":"C239&COUNTIF($C$2:C239,C239)","v":"0"},null,null,null,null,null,null,45142,null,null,null,null,null,null,0,0,null,null,null,null,null,null,null,null,null,null,null,null,null,null,null,null,null,null,null,null,null,null,null,null,null,null,null,null,null,null,null,0,"-00-01-1900"]
[{"$f":"IFERROR(VLOOKUP(C240,#REF!,9,FALSE),\"\")","v":""},{"$f":"C240&COUNTIF($C$2:C240,C240)","v":"0"},null,null,null,null,null,null,45142,null,null,null,null,null,null,0,0,null,null,null,null,null,null,null,null,null,null,null,null,null,null,null,null,null,null,null,null,null,null,null,null,null,null,null,null,null,null,null,0,"-00-01-1900"]
[{"$f":"IFERROR(VLOOKUP(C241,#REF!,9,FALSE),\"\")","v":""},{"$f":"C241&COUNTIF($C$2:C241,C241)","v":"0"},null,null,null,null,null,null,45142,null,null,null,null,null,null,0,0,null,null,null,null,null,null,null,null,null,null,null,null,null,null,null,null,null,null,null,null,null,null,null,null,null,null,null,null,null,null,null,0,"-00-01-1900"]
[{"$f":"IFERROR(VLOOKUP(C242,#REF!,9,FALSE),\"\")","v":""},{"$f":"C242&COUNTIF($C$2:C242,C242)","v":"0"},null,null,null,null,null,null,45142,null,null,null,null,null,null,0,0,null,null,null,null,null,null,null,null,null,null,null,null,null,null,null,null,null,null,null,null,null,null,null,null,null,null,null,null,null,null,null,0,"-00-01-1900"]
[{"$f":"IFERROR(VLOOKUP(C243,#REF!,9,FALSE),\"\")","v":""},{"$f":"C243&COUNTIF($C$2:C243,C243)","v":"0"},null,null,null,null,null,null,45142,null,null,null,null,null,null,0,0,null,null,null,null,null,null,null,null,null,null,null,null,null,null,null,null,null,null,null,null,null,null,null,null,null,null,null,null,null,null,null,0,"-00-01-1900"]
[{"$f":"IFERROR(VLOOKUP(C244,#REF!,9,FALSE),\"\")","v":""},{"$f":"C244&COUNTIF($C$2:C244,C244)","v":"0"},null,null,null,null,null,null,45142,null,null,null,null,null,null,0,0,null,null,null,null,null,null,null,null,null,null,null,null,null,null,null,null,null,null,null,null,null,null,null,null,null,null,null,null,null,null,null,0,"-00-01-1900"]
[{"$f":"IFERROR(VLOOKUP(C245,#REF!,9,FALSE),\"\")","v":""},{"$f":"C245&COUNTIF($C$2:C245,C245)","v":"0"},null,null,null,null,null,null,45142,null,null,null,null,null,null,0,0,null,null,null,null,null,null,null,null,null,null,null,null,null,null,null,null,null,null,null,null,null,null,null,null,null,null,null,null,null,null,null,0,"-00-01-1900"]
[{"$f":"IFERROR(VLOOKUP(C246,#REF!,9,FALSE),\"\")","v":""},{"$f":"C246&COUNTIF($C$2:C246,C246)","v":"0"},null,null,null,null,null,null,45142,null,null,null,null,null,null,0,0,null,null,null,null,null,null,null,null,null,null,null,null,null,null,null,null,null,null,null,null,null,null,null,null,null,null,null,null,null,null,null,0,"-00-01-1900"]
[{"$f":"IFERROR(VLOOKUP(C247,#REF!,9,FALSE),\"\")","v":""},{"$f":"C247&COUNTIF($C$2:C247,C247)","v":"0"},null,null,null,null,null,null,45142,null,null,null,null,null,null,0,0,null,null,null,null,null,null,null,null,null,null,null,null,null,null,null,null,null,null,null,null,null,null,null,null,null,null,null,null,null,null,null,0,"-00-01-1900"]
[{"$f":"IFERROR(VLOOKUP(C248,#REF!,9,FALSE),\"\")","v":""},{"$f":"C248&COUNTIF($C$2:C248,C248)","v":"0"},null,null,null,null,null,null,45142,null,null,null,null,null,null,0,0,null,null,null,null,null,null,null,null,null,null,null,null,null,null,null,null,null,null,null,null,null,null,null,null,null,null,null,null,null,null,null,0,"-00-01-1900"]
[{"$f":"IFERROR(VLOOKUP(C249,#REF!,9,FALSE),\"\")","v":""},{"$f":"C249&COUNTIF($C$2:C249,C249)","v":"0"},null,null,null,null,null,null,45142,null,null,null,null,null,null,0,0,null,null,null,null,null,null,null,null,null,null,null,null,null,null,null,null,null,null,null,null,null,null,null,null,null,null,null,null,null,null,null,0,"-00-01-1900"]
[{"$f":"IFERROR(VLOOKUP(C250,#REF!,9,FALSE),\"\")","v":""},{"$f":"C250&COUNTIF($C$2:C250,C250)","v":"0"},null,null,null,null,null,null,45142,null,null,null,null,null,null,0,0,null,null,null,null,null,null,null,null,null,null,null,null,null,null,null,null,null,null,null,null,null,null,null,null,null,null,null,null,null,null,null,0,"-00-01-1900"]
[{"$f":"IFERROR(VLOOKUP(C251,#REF!,9,FALSE),\"\")","v":""},{"$f":"C251&COUNTIF($C$2:C251,C251)","v":"0"},null,null,null,null,null,null,45142,null,null,null,null,null,null,0,0,null,null,null,null,null,null,null,null,null,null,null,null,null,null,null,null,null,null,null,null,null,null,null,null,null,null,null,null,null,null,null,0,"-00-01-1900"]
[{"$f":"IFERROR(VLOOKUP(C252,#REF!,9,FALSE),\"\")","v":""},{"$f":"C252&COUNTIF($C$2:C252,C252)","v":"0"},null,null,null,null,null,null,45142,null,null,null,null,null,null,0,0,null,null,null,null,null,null,null,null,null,null,null,null,null,null,null,null,null,null,null,null,null,null,null,null,null,null,null,null,null,null,null,0,"-00-01-1900"]
[{"$f":"IFERROR(VLOOKUP(C253,#REF!,9,FALSE),\"\")","v":""},{"$f":"C253&COUNTIF($C$2:C253,C253)","v":"0"},null,null,null,null,null,null,45142,null,null,null,null,null,null,0,0,null,null,null,null,null,null,null,null,null,null,null,null,null,null,null,null,null,null,null,null,null,null,null,null,null,null,null,null,null,null,null,0,"-00-01-1900"]
[{"$f":"IFERROR(VLOOKUP(C254,#REF!,9,FALSE),\"\")","v":""},{"$f":"C254&COUNTIF($C$2:C254,C254)","v":"0"},null,null,null,null,null,null,45142,null,null,null,null,null,null,0,0,null,null,null,null,null,null,null,null,null,null,null,null,null,null,null,null,null,null,null,null,null,null,null,null,null,null,null,null,null,null,null,0,"-00-01-1900"]
[{"$f":"IFERROR(VLOOKUP(C255,#REF!,9,FALSE),\"\")","v":""},{"$f":"C255&COUNTIF($C$2:C255,C255)","v":"0"},null,null,null,null,null,null,45142,null,null,null,null,null,null,0,0,null,null,null,null,null,null,null,null,null,null,null,null,null,null,null,null,null,null,null,null,null,null,null,null,null,null,null,null,null,null,null,0,"-00-01-1900"]
[{"$f":"IFERROR(VLOOKUP(C256,#REF!,9,FALSE),\"\")","v":""},{"$f":"C256&COUNTIF($C$2:C256,C256)","v":"0"},null,null,null,null,null,null,45142,null,null,null,null,null,null,0,0,null,null,null,null,null,null,null,null,null,null,null,null,null,null,null,null,null,null,null,null,null,null,null,null,null,null,null,null,null,null,null,0,"-00-01-1900"]
[{"$f":"IFERROR(VLOOKUP(C257,#REF!,9,FALSE),\"\")","v":""},{"$f":"C257&COUNTIF($C$2:C257,C257)","v":"0"},null,null,null,null,null,null,45142,null,null,null,null,null,null,0,0,null,null,null,null,null,null,null,null,null,null,null,null,null,null,null,null,null,null,null,null,null,null,null,null,null,null,null,null,null,null,null,0,"-00-01-1900"]
[{"$f":"IFERROR(VLOOKUP(C258,#REF!,9,FALSE),\"\")","v":""},{"$f":"C258&COUNTIF($C$2:C258,C258)","v":"0"},null,null,null,null,null,null,{"$f":"+TODAY()-H258","v":45142},null,null,null,null,null,null,{"$f":"+G258-K258-L258-M258-N258","v":0},{"$f":"+G258-R258-T258-V258-X258-Z258-AB258-AD258-AF258-AH258-AJ258-AL258-AN258-AP258-AT258-AV258","v":0},null,null,null,null,null,null,null,null,null,null,null,null,null,null,null,null,null,null,null,null,null,null,null,null,null,null,null,null,null,null,null,0,"-00-01-1900"]
[{"$f":"IFERROR(VLOOKUP(C259,#REF!,9,FALSE),\"\")","v":""},{"$f":"C259&COUNTIF($C$2:C259,C259)","v":"0"},null,null,null,null,null,null,45142,null,null,null,null,null,null,0,0,null,null,null,null,null,null,null,null,null,null,null,null,null,null,null,null,null,null,null,null,null,null,null,null,null,null,null,null,null,null,null,{"$f":"G259-(L259++R259+T259+V259+X259+Z259+AB259+AD259+AF259+AH259+AJ259+AL259+AN259+AP259+AR259)","v":0},{"$f":"CONCATENATE(C259,\"-\",TEXT(H259,\"DD-MM-YYYY\"))","v":"-00-01-1900"}]
[{"$f":"IFERROR(VLOOKUP(C260,#REF!,9,FALSE),\"\")","v":""},{"$f":"C260&COUNTIF($C$2:C260,C260)","v":"0"},null,null,null,null,null,null,45142,null,null,null,null,null,null,0,0,null,null,null,null,null,null,null,null,null,null,null,null,null,null,null,null,null,null,null,null,null,null,null,null,null,null,null,null,null,null,null,0,"-00-01-1900"]
[{"$f":"IFERROR(VLOOKUP(C261,#REF!,9,FALSE),\"\")","v":""},{"$f":"C261&COUNTIF($C$2:C261,C261)","v":"0"},null,null,null,null,null,null,45142,null,null,null,null,null,null,0,0,null,null,null,null,null,null,null,null,null,null,null,null,null,null,null,null,null,null,null,null,null,null,null,null,null,null,null,null,null,null,null,0,"-00-01-1900"]
[{"$f":"IFERROR(VLOOKUP(C262,#REF!,9,FALSE),\"\")","v":""},{"$f":"C262&COUNTIF($C$2:C262,C262)","v":"0"},null,null,null,null,null,null,45142,null,null,null,null,null,null,0,0,null,null,null,null,null,null,null,null,null,null,null,null,null,null,null,null,null,null,null,null,null,null,null,null,null,null,null,null,null,null,null,0,"-00-01-1900"]
[{"$f":"IFERROR(VLOOKUP(C263,#REF!,9,FALSE),\"\")","v":""},{"$f":"C263&COUNTIF($C$2:C263,C263)","v":"0"},null,null,null,null,null,null,45142,null,null,null,null,null,null,0,0,null,null,null,null,null,null,null,null,null,null,null,null,null,null,null,null,null,null,null,null,null,null,null,null,null,null,null,null,null,null,null,0,"-00-01-1900"]
[{"$f":"IFERROR(VLOOKUP(C264,#REF!,9,FALSE),\"\")","v":""},{"$f":"C264&COUNTIF($C$2:C264,C264)","v":"0"},null,null,null,null,null,null,45142,null,null,null,null,null,null,0,0,null,null,null,null,null,null,null,null,null,null,null,null,null,null,null,null,null,null,null,null,null,null,null,null,null,null,null,null,null,null,null,0,"-00-01-1900"]
[{"$f":"IFERROR(VLOOKUP(C265,#REF!,9,FALSE),\"\")","v":""},{"$f":"C265&COUNTIF($C$2:C265,C265)","v":"0"},null,null,null,null,null,null,45142,null,null,null,null,null,null,0,0,null,null,null,null,null,null,null,null,null,null,null,null,null,null,null,null,null,null,null,null,null,null,null,null,null,null,null,null,null,null,null,0,"-00-01-1900"]
[{"$f":"IFERROR(VLOOKUP(C266,#REF!,9,FALSE),\"\")","v":""},{"$f":"C266&COUNTIF($C$2:C266,C266)","v":"0"},null,null,null,null,null,null,45142,null,null,null,null,null,null,0,0,null,null,null,null,null,null,null,null,null,null,null,null,null,null,null,null,null,null,null,null,null,null,null,null,null,null,null,null,null,null,null,0,"-00-01-1900"]
[{"$f":"IFERROR(VLOOKUP(C267,#REF!,9,FALSE),\"\")","v":""},{"$f":"C267&COUNTIF($C$2:C267,C267)","v":"0"},null,null,null,null,null,null,45142,null,null,null,null,null,null,0,0,null,null,null,null,null,null,null,null,null,null,null,null,null,null,null,null,null,null,null,null,null,null,null,null,null,null,null,null,null,null,null,0,"-00-01-1900"]
[{"$f":"IFERROR(VLOOKUP(C268,#REF!,9,FALSE),\"\")","v":""},{"$f":"C268&COUNTIF($C$2:C268,C268)","v":"0"},null,null,null,null,null,null,45142,null,null,null,null,null,null,0,0,null,null,null,null,null,null,null,null,null,null,null,null,null,null,null,null,null,null,null,null,null,null,null,null,null,null,null,null,null,null,null,0,"-00-01-1900"]
[{"$f":"IFERROR(VLOOKUP(C269,#REF!,9,FALSE),\"\")","v":""},{"$f":"C269&COUNTIF($C$2:C269,C269)","v":"0"},null,null,null,null,null,null,45142,null,null,null,null,null,null,0,0,null,null,null,null,null,null,null,null,null,null,null,null,null,null,null,null,null,null,null,null,null,null,null,null,null,null,null,null,null,null,null,0,"-00-01-1900"]
[{"$f":"IFERROR(VLOOKUP(C270,#REF!,9,FALSE),\"\")","v":""},{"$f":"C270&COUNTIF($C$2:C270,C270)","v":"0"},null,null,null,null,null,null,45142,null,null,null,null,null,null,0,0,null,null,null,null,null,null,null,null,null,null,null,null,null,null,null,null,null,null,null,null,null,null,null,null,null,null,null,null,null,null,null,0,"-00-01-1900"]
[{"$f":"IFERROR(VLOOKUP(C271,#REF!,9,FALSE),\"\")","v":""},{"$f":"C271&COUNTIF($C$2:C271,C271)","v":"0"},null,null,null,null,null,null,45142,null,null,null,null,null,null,0,0,null,null,null,null,null,null,null,null,null,null,null,null,null,null,null,null,null,null,null,null,null,null,null,null,null,null,null,null,null,null,null,0,"-00-01-1900"]
[{"$f":"IFERROR(VLOOKUP(C272,#REF!,9,FALSE),\"\")","v":""},{"$f":"C272&COUNTIF($C$2:C272,C272)","v":"0"},null,null,null,null,null,null,45142,null,null,null,null,null,null,0,0,null,null,null,null,null,null,null,null,null,null,null,null,null,null,null,null,null,null,null,null,null,null,null,null,null,null,null,null,null,null,null,0,"-00-01-1900"]
[null,null,null,null,null,null,{"$f":"SUM(G2:G272)","v":89417165.769999936},null,null,null,null,{"$f":"SUM(L2:L272)","v":589868.56999999983},null,null,null,null,null,{"$f":"SUM(R2:R272)","v":0},null,{"$f":"SUM(T2:T272)","v":0},null,{"$f":"SUM(V2:V272)","v":0},null,{"$f":"SUM(X2:X272)","v":0},null,{"$f":"SUM(Z2:Z272)","v":0},null,{"$f":"SUM(AB2:AB272)","v":0},null,{"$f":"SUM(AD2:AD272)","v":0},null,{"$f":"SUM(AF2:AF272)","v":0},null,{"$f":"SUM(AH2:AH272)","v":0},null,{"$f":"SUM(AJ2:AJ272)","v":0},null,{"$f":"SUM(AL2:AL272)","v":0},null,{"$f":"SUM(AN2:AN272)","v":0},null,{"$f":"SUM(AP2:AP272)","v":0},null,{"$f":"SUM(AR2:AR272)","v":0},null,{"$f":"SUM(AT2:AT272)","v":0},null,{"$f":"SUM(AV2:AV272)","v":0},0,{"$f":"SUM(AX60:AX257)","v":0}]
[]
[]
[]
[]
[]
[null,null,"Total sumb",null,null,null,{"$f":"D279-D283","v":0}]
[null,null,"Total Paid"]
[null,null,"Total Rejected",null,null,null,{"$f":"D280+G279","v":0}]
[null,null,"Total Tax"]
[null,null,"Total Paid - Rejecteed - Tax"]

{"sheet":"Month 07-2023","index":3,"n_rows":255,"n_cols":50,"rows_kept":255,"cut":false,"hidden":false,"merged":[]}
["Status","Helper","Provider Code",null,"BATCH NO:","Number of claims","AMOUNT","Date Received ","TAT","Date posting","Paid","Rejected","H.H","Pending","Comment","Rev Diff","Pay Diff","Taxes","Checks no.","Amount checks","Checks no.","Amount checks","Checks no.","Amount checks","Checks no.","Amount checks","Checks no.","Amount checks","Checks no.","Amount checks","Checks no.","Amount checks","Checks no.","Amount checks","Checks no.","Amount checks","Checks no.","Amount checks","Checks no.","Amount checks","Checks no.","Amount checks","Checks no.","Amount checks","Checks no.","Amount checks","Checks no.","Amount checks","TAT",{"$f":"CONCATENATE(C1,\"-\",TEXT(H1,\"DD-MM-YYYY\"))","v":"Provider Code-Date Received "}]
[{"$f":"IFERROR(VLOOKUP(C2,#REF!,9,FALSE),\"\")","v":""},{"$f":"C2&COUNTIF($C$2:C2,C2)","v":"FCC01401"},"FCC0140",null,null,20,365238.29,"2023-07-04",{"$f":"+TODAY()-H2","v":31},null,null,null,null,null,null,{"$f":"+G2-K2-L2-M2-N2","v":365238.29},{"$f":"+G2-R2-T2-V2-X2-Z2-AB2-AD2-AF2-AH2-AJ2-AL2-AN2-AP2-AT2-AV2","v":365238.29},null,null,null,null,null,null,null,null,null,null,null,null,null,null,null,null,null,null,null,null,null,null,null,null,null,null,null,null,null,null,null,{"$f":"G2-(L2++R2+T2+V2+X2+Z2+AB2+AD2+AF2+AH2+AJ2+AL2+AN2+AP2+AR2)","v":365238.29},"FCC0140-04-07-2023"]
[{"$f":"IFERROR(VLOOKUP(C3,#REF!,9,FALSE),\"\")","v":""},{"$f":"C3&COUNTIF($C$2:C3,C3)","v":"FCK30831"},"FCK3083",null,null,4,74064,"2023-07-04",31,null,null,null,null,null,null,74064,74064,null,null,null,null,null,null,null,null,null,null,null,null,null,null,null,null,null,null,null,null,null,null,null,null,null,null,null,null,null,null,null,74064,"FCK3083-04-07-2023"]
[{"$f":"IFERROR(VLOOKUP(C4,#REF!,9,FALSE),\"\")","v":""},{"$f":"C4&COUNTIF($C$2:C4,C4)","v":"FCC22001"},"FCC2200",null,null,2,46000,"2023-07-04",31,null,null,null,null,null,null,46000,46000,null,null,null,null,null,null,null,null,null,null,null,null,null,null,null,null,null,null,null,null,null,null,null,null,null,null,null,null,null,null,null,46000,"FCC2200-04-07-2023"]
[{"$f":"IFERROR(VLOOKUP(C5,#REF!,9,FALSE),\"\")","v":""},{"$f":"C5&COUNTIF($C$2:C5,C5)","v":"fcc21501"},"fcc2150",null,null,7,61637.74,"2023-07-04",31,null,null,null,null,null,null,61637.74,61637.74,null,null,null,null,null,null,null,null,null,null,null,null,null,null,null,null,null,null,null,null,null,null,null,null,null,null,null,null,null,null,null,61637.74,"fcc2150-04-07-2023"]
[{"$f":"IFERROR(VLOOKUP(C6,#REF!,9,FALSE),\"\")","v":""},{"$f":"C6&COUNTIF($C$2:C6,C6)","v":"FCB30801"},"FCB3080",null,null,2,8941,"2023-07-04",31,null,null,null,null,null,null,8941,8941,null,null,null,null,null,null,null,null,null,null,null,null,null,null,null,null,null,null,null,null,null,null,null,null,null,null,null,null,null,null,null,8941,"FCB3080-04-07-2023"]
[{"$f":"IFERROR(VLOOKUP(C7,#REF!,9,FALSE),\"\")","v":""},{"$f":"C7&COUNTIF($C$2:C7,C7)","v":"FCF23301"},"FCF2330",null,null,6,36686.949999999997,"2023-07-04",31,null,null,null,null,null,null,36686.949999999997,36686.949999999997,null,null,null,null,null,null,null,null,null,null,null,null,null,null,null,null,null,null,null,null,null,null,null,null,null,null,null,null,null,null,null,36686.949999999997,"FCF2330-04-07-2023"]
[{"$f":"IFERROR(VLOOKUP(C8,#REF!,9,FALSE),\"\")","v":""},{"$f":"C8&COUNTIF($C$2:C8,C8)","v":"FCN31431"},"FCN3143",null,null,14,65145.59,"2023-07-04",31,null,null,null,null,null,null,65145.59,65145.59,null,null,null,null,null,null,null,null,null,null,null,null,null,null,null,null,null,null,null,null,null,null,null,null,null,null,null,null,null,null,null,65145.59,"FCN3143-04-07-2023"]
[{"$f":"IFERROR(VLOOKUP(C9,#REF!,9,FALSE),\"\")","v":""},{"$f":"C9&COUNTIF($C$2:C9,C9)","v":"FCU11301"},"FCU1130",null,null,1,8817.85,"2023-07-04",31,null,null,null,null,null,null,8817.85,8817.85,null,null,null,null,null,null,null,null,null,null,null,null,null,null,null,null,null,null,null,null,null,null,null,null,null,null,null,null,null,null,null,8817.85,"FCU1130-04-07-2023"]
[{"$f":"IFERROR(VLOOKUP(C10,#REF!,9,FALSE),\"\")","v":""},{"$f":"C10&COUNTIF($C$2:C10,C10)","v":"FCX34801"},"FCX3480",null,null,3,33283.019999999997,"2023-07-05",30,null,null,null,null,null,null,33283.019999999997,33283.019999999997,null,null,null,null,null,null,null,null,null,null,null,null,null,null,null,null,null,null,null,null,null,null,null,null,null,null,null,null,null,null,null,33283.019999999997,"FCX3480-05-07-2023"]
[{"$f":"IFERROR(VLOOKUP(C11,#REF!,9,FALSE),\"\")","v":""},{"$f":"C11&COUNTIF($C$2:C11,C11)","v":"FCH07201"},"FCH0720",null,null,3,63341.120000000003,"2023-07-05",30,null,null,null,null,null,null,63341.120000000003,63341.120000000003,null,null,null,null,null,null,null,null,null,null,null,null,null,null,null,null,null,null,null,null,null,null,null,null,null,null,null,null,null,null,null,63341.120000000003,"FCH0720-05-07-2023"]
[{"$f":"IFERROR(VLOOKUP(C12,#REF!,9,FALSE),\"\")","v":""},{"$f":"C12&COUNTIF($C$2:C12,C12)","v":"FCF26101"},"FCF2610",null,null,17,103017,"2023-07-05",30,null,null,null,null,null,null,103017,103017,null,null,null,null,null,null,null,null,null,null,null,null,null,null,null,null,null,null,null,null,null,null,null,null,null,null,null,null,null,null,null,103017,"FCF2610-05-07-2023"]
[{"$f":"IFERROR(VLOOKUP(C13,#REF!,9,FALSE),\"\")","v":""},{"$f":"C13&COUNTIF($C$2:C13,C13)","v":"FCC15901"},"FCC1590",null,null,4,36373.5,"2023-07-05",30,null,null,null,null,null,null,36373.5,36373.5,null,null,null,null,null,null,null,null,null,null,null,null,null,null,null,null,null,null,null,null,null,null,null,null,null,null,null,null,null,null,null,36373.5,"FCC1590-05-07-2023"]
[{"$f":"IFERROR(VLOOKUP(C14,#REF!,9,FALSE),\"\")","v":""},{"$f":"C14&COUNTIF($C$2:C14,C14)","v":"FCC04101"},"FCC0410",null,null,4,13078,"2023-07-05",30,null,null,null,null,null,null,13078,13078,null,null,null,null,null,null,null,null,null,null,null,null,null,null,null,null,null,null,null,null,null,null,null,null,null,null,null,null,null,null,null,13078,"FCC0410-05-07-2023"]
[{"$f":"IFERROR(VLOOKUP(C15,#REF!,9,FALSE),\"\")","v":""},{"$f":"C15&COUNTIF($C$2:C15,C15)","v":"FCF24701"},"FCF2470",null,null,2,27877.96,"2023-07-05",30,null,null,null,null,null,null,27877.96,27877.96,null,null,null,null,null,null,null,null,null,null,null,null,null,null,null,null,null,null,null,null,null,null,null,null,null,null,null,null,null,null,null,27877.96,"FCF2470-05-07-2023"]
[{"$f":"IFERROR(VLOOKUP(C16,#REF!,9,FALSE),\"\")","v":""},{"$f":"C16&COUNTIF($C$2:C16,C16)","v":"FCC27801"},"FCC2780",null,null,14,86652,"2023-07-05",30,"2023-07-31",86101.5,550.5,0,0,0,0,86652,null,null,null,null,null,null,null,null,null,null,null,null,null,null,null,null,null,null,null,null,null,null,null,null,null,null,null,null,null,null,null,86101.5,"FCC2780-05-07-2023"]
[{"$f":"IFERROR(VLOOKUP(C17,#REF!,9,FALSE),\"\")","v":""},{"$f":"C17&COUNTIF($C$2:C17,C17)","v":"FCX16101"},"FCX1610",null,null,1,35306.720000000001,"2023-07-05",30,null,null,null,null,null,null,35306.720000000001,35306.720000000001,null,null,null,null,null,null,null,null,null,null,null,null,null,null,null,null,null,null,null,null,null,null,null,null,null,null,null,null,null,null,null,35306.720000000001,"FCX1610-05-07-2023"]
[{"$f":"IFERROR(VLOOKUP(C18,#REF!,9,FALSE),\"\")","v":""},{"$f":"C18&COUNTIF($C$2:C18,C18)","v":"FCF26141"},"FCF2614",null,null,4,109729.46,"2023-07-05",30,null,null,null,null,null,null,109729.46,109729.46,null,null,null,null,null,null,null,null,null,null,null,null,null,null,null,null,null,null,null,null,null,null,null,null,null,null,null,null,null,null,null,109729.46,"FCF2614-05-07-2023"]
[{"$f":"IFERROR(VLOOKUP(C19,#REF!,9,FALSE),\"\")","v":""},{"$f":"C19&COUNTIF($C$2:C19,C19)","v":"FCX27961"},"FCX2796",null,null,1,3043.55,"2023-07-05",30,null,null,null,null,null,null,3043.55,3043.55,null,null,null,null,null,null,null,null,null,null,null,null,null,null,null,null,null,null,null,null,null,null,null,null,null,null,null,null,null,null,null,3043.55,"FCX2796-05-07-2023"]
[{"$f":"IFERROR(VLOOKUP(C20,#REF!,9,FALSE),\"\")","v":""},{"$f":"C20&COUNTIF($C$2:C20,C20)","v":"FCD30501"},"FCD3050",null,null,8,42779,"2023-07-05",30,null,null,null,null,null,null,42779,42779,null,null,null,null,null,null,null,null,null,null,null,null,null,null,null,null,null,null,null,null,null,null,null,null,null,null,null,null,null,null,null,42779,"FCD3050-05-07-2023"]
[{"$f":"IFERROR(VLOOKUP(C21,#REF!,9,FALSE),\"\")","v":""},{"$f":"C21&COUNTIF($C$2:C21,C21)","v":"FCC91861"},"FCC9186",null,null,2,13200,"2023-07-05",30,null,null,null,null,null,null,13200,13200,null,null,null,null,null,null,null,null,null,null,null,null,null,null,null,null,null,null,null,null,null,null,null,null,null,null,null,null,null,null,null,13200,"FCC9186-05-07-2023"]
[{"$f":"IFERROR(VLOOKUP(C22,#REF!,9,FALSE),\"\")","v":""},{"$f":"C22&COUNTIF($C$2:C22,C22)","v":"FCX12301"},"FCX1230",null,null,1,2018.7,"2023-07-05",30,null,null,null,null,null,null,2018.7,2018.7,null,null,null,null,null,null,null,null,null,null,null,null,null,null,null,null,null,null,null,null,null,null,null,null,null,null,null,null,null,null,null,2018.7,"FCX1230-05-07-2023"]
[{"$f":"IFERROR(VLOOKUP(C23,#REF!,9,FALSE),\"\")","v":""},{"$f":"C23&COUNTIF($C$2:C23,C23)","v":"FCK34201"},"FCK3420",null,"advance",40,460541.81,"2023-07-06",29,null,null,null,null,null,null,460541.81,460541.81,null,null,null,null,null,null,null,null,null,null,null,null,null,null,null,null,null,null,null,null,null,null,null,null,null,null,null,null,null,null,null,460541.81,"FCK3420-06-07-2023"]
[{"$f":"IFERROR(VLOOKUP(C24,#REF!,9,FALSE),\"\")","v":""},{"$f":"C24&COUNTIF($C$2:C24,C24)","v":"FCB26301"},"FCB2630",null,null,9,49598.37,"2023-07-06",29,null,null,null,null,null,null,49598.37,49598.37,null,null,null,null,null,null,null,null,null,null,null,null,null,null,null,null,null,null,null,null,null,null,null,null,null,null,null,null,null,null,null,49598.37,"FCB2630-06-07-2023"]
[{"$f":"IFERROR(VLOOKUP(C25,#REF!,9,FALSE),\"\")","v":""},{"$f":"C25&COUNTIF($C$2:C25,C25)","v":"FCP32821"},"FCP3282",null,null,1,1648.18,"2023-07-06",29,null,null,null,null,null,null,1648.18,1648.18,null,null,null,null,null,null,null,null,null,null,null,null,null,null,null,null,null,null,null,null,null,null,null,null,null,null,null,null,null,null,null,1648.18,"FCP3282-06-07-2023"]
[{"$f":"IFERROR(VLOOKUP(C26,#REF!,9,FALSE),\"\")","v":""},{"$f":"C26&COUNTIF($C$2:C26,C26)","v":"FCS29191"},"FCS2919",null,null,3,15446.75,"2023-07-06",29,null,null,null,null,null,null,15446.75,15446.75,null,null,null,null,null,null,null,null,null,null,null,null,null,null,null,null,null,null,null,null,null,null,null,null,null,null,null,null,null,null,null,15446.75,"FCS2919-06-07-2023"]
[{"$f":"IFERROR(VLOOKUP(C27,#REF!,9,FALSE),\"\")","v":""},{"$f":"C27&COUNTIF($C$2:C27,C27)","v":"FCC33101"},"FCC3310",null,null,4,23919.21,"2023-07-06",29,null,null,null,null,null,null,23919.21,23919.21,null,null,null,null,null,null,null,null,null,null,null,null,null,null,null,null,null,null,null,null,null,null,null,null,null,null,null,null,null,null,null,23919.21,"FCC3310-06-07-2023"]
[{"$f":"IFERROR(VLOOKUP(C28,#REF!,9,FALSE),\"\")","v":""},{"$f":"C28&COUNTIF($C$2:C28,C28)","v":"FCZ27281"},"FCZ2728",null,null,5,2524.16,"2023-07-06",29,null,null,null,null,null,null,2524.16,2524.16,null,null,null,null,null,null,null,null,null,null,null,null,null,null,null,null,null,null,null,null,null,null,null,null,null,null,null,null,null,null,null,2524.16,"FCZ2728-06-07-2023"]
[{"$f":"IFERROR(VLOOKUP(C29,#REF!,9,FALSE),\"\")","v":""},{"$f":"C29&COUNTIF($C$2:C29,C29)","v":"FCC91451"},"FCC9145",null,null,2,22788,"2023-07-06",29,null,null,null,null,null,null,22788,22788,null,null,null,null,null,null,null,null,null,null,null,null,null,null,null,null,null,null,null,null,null,null,null,null,null,null,null,null,null,null,null,22788,"FCC9145-06-07-2023"]
[{"$f":"IFERROR(VLOOKUP(C30,#REF!,9,FALSE),\"\")","v":""},{"$f":"C30&COUNTIF($C$2:C30,C30)","v":"FCS10601"},"FCS1060",null,null,6,25876.35,"2023-07-06",29,null,null,null,null,null,null,25876.35,25876.35,null,null,null,null,null,null,null,null,null,null,null,null,null,null,null,null,null,null,null,null,null,null,null,null,null,null,null,null,null,null,null,25876.35,"FCS1060-06-07-2023"]
[{"$f":"IFERROR(VLOOKUP(C31,#REF!,9,FALSE),\"\")","v":""},{"$f":"C31&COUNTIF($C$2:C31,C31)","v":"FCC17501"},"FCC1750",null,null,4,40600,"2023-07-06",29,null,null,null,null,null,null,40600,40600,null,null,null,null,null,null,null,null,null,null,null,null,null,null,null,null,null,null,null,null,null,null,null,null,null,null,null,null,null,null,null,40600,"FCC1750-06-07-2023"]
[{"$f":"IFERROR(VLOOKUP(C32,#REF!,9,FALSE),\"\")","v":""},{"$f":"C32&COUNTIF($C$2:C32,C32)","v":"FCC91621"},"FCC9162",null,"advance",18,253293,"2023-07-06",29,null,null,null,null,null,null,253293,253293,null,null,null,null,null,null,null,null,null,null,null,null,null,null,null,null,null,null,null,null,null,null,null,null,null,null,null,null,null,null,null,253293,"FCC9162-06-07-2023"]
[{"$f":"IFERROR(VLOOKUP(C33,#REF!,9,FALSE),\"\")","v":""},{"$f":"C33&COUNTIF($C$2:C33,C33)","v":"FCC01501"},"FCC0150",null,"advance",22,244724,"2023-07-06",29,null,null,null,null,null,null,244724,244724,null,null,null,null,null,null,null,null,null,null,null,null,null,null,null,null,null,null,null,null,null,null,null,null,null,null,null,null,null,null,null,244724,"FCC0150-06-07-2023"]
[{"$f":"IFERROR(VLOOKUP(C34,#REF!,9,FALSE),\"\")","v":""},{"$f":"C34&COUNTIF($C$2:C34,C34)","v":"FCU11501"},"FCU1150",null,null,6,18038.5,"2023-07-09",26,null,null,null,null,null,null,18038.5,18038.5,null,null,null,null,null,null,null,null,null,null,null,null,null,null,null,null,null,null,null,null,null,null,null,null,null,null,null,null,null,null,null,18038.5,"FCU1150-09-07-2023"]
[{"$f":"IFERROR(VLOOKUP(C35,#REF!,9,FALSE),\"\")","v":""},{"$f":"C35&COUNTIF($C$2:C35,C35)","v":"FCB28001"},"FCB2800",null,null,4,42000,"2023-07-09",26,null,null,null,null,null,null,42000,42000,null,null,null,null,null,null,null,null,null,null,null,null,null,null,null,null,null,null,null,null,null,null,null,null,null,null,null,null,null,null,null,42000,"FCB2800-09-07-2023"]
[{"$f":"IFERROR(VLOOKUP(C36,#REF!,9,FALSE),\"\")","v":""},{"$f":"C36&COUNTIF($C$2:C36,C36)","v":"FCY27051"},"FCY2705",null,null,2,11281.57,"2023-07-09",26,null,null,null,null,null,null,11281.57,11281.57,null,null,null,null,null,null,null,null,null,null,null,null,null,null,null,null,null,null,null,null,null,null,null,null,null,null,null,null,null,null,null,11281.57,"FCY2705-09-07-2023"]
[{"$f":"IFERROR(VLOOKUP(C37,#REF!,9,FALSE),\"\")","v":""},{"$f":"C37&COUNTIF($C$2:C37,C37)","v":"FCC02001"},"FCC0200",null,"advance",27,275373,"2023-07-09",26,null,null,null,null,null,null,275373,275373,null,null,null,null,null,null,null,null,null,null,null,null,null,null,null,null,null,null,null,null,null,null,null,null,null,null,null,null,null,null,null,275373,"FCC0200-09-07-2023"]
[{"$f":"IFERROR(VLOOKUP(C38,#REF!,9,FALSE),\"\")","v":""},{"$f":"C38&COUNTIF($C$2:C38,C38)","v":"FCC06501"},"FCC0650",null,null,3,18202.71,"2023-07-09",26,null,null,null,null,null,null,18202.71,18202.71,null,null,null,null,null,null,null,null,null,null,null,null,null,null,null,null,null,null,null,null,null,null,null,null,null,null,null,null,null,null,null,18202.71,"FCC0650-09-07-2023"]
[{"$f":"IFERROR(VLOOKUP(C39,#REF!,9,FALSE),\"\")","v":""},{"$f":"C39&COUNTIF($C$2:C39,C39)","v":"FCE33901"},"FCE3390",null,null,3,6718,"2023-07-09",26,null,null,null,null,null,null,6718,6718,null,null,null,null,null,null,null,null,null,null,null,null,null,null,null,null,null,null,null,null,null,null,null,null,null,null,null,null,null,null,null,6718,"FCE3390-09-07-2023"]
[{"$f":"IFERROR(VLOOKUP(C40,#REF!,9,FALSE),\"\")","v":""},{"$f":"C40&COUNTIF($C$2:C40,C40)","v":"FCC00801"},"FCC0080",null,null,36,190024.31,"2023-07-09",26,null,null,null,null,null,null,190024.31,190024.31,null,null,null,null,null,null,null,null,null,null,null,null,null,null,null,null,null,null,null,null,null,null,null,null,null,null,null,null,null,null,null,190024.31,"FCC0080-09-07-2023"]
[{"$f":"IFERROR(VLOOKUP(C41,#REF!,9,FALSE),\"\")","v":""},{"$f":"C41&COUNTIF($C$2:C41,C41)","v":"FCC91801"},"FCC9180",null,null,7,90123.51,"2023-07-09",26,null,null,null,null,null,null,90123.51,90123.51,null,null,null,null,null,null,null,null,null,null,null,null,null,null,null,null,null,null,null,null,null,null,null,null,null,null,null,null,null,null,null,90123.51,"FCC9180-09-07-2023"]
[{"$f":"IFERROR(VLOOKUP(C42,#REF!,9,FALSE),\"\")","v":""},{"$f":"C42&COUNTIF($C$2:C42,C42)","v":"FCC35101"},"FCC3510",null,null,4,8012.91,"2023-07-09",26,null,null,null,null,null,null,8012.91,8012.91,null,null,null,null,null,null,null,null,null,null,null,null,null,null,null,null,null,null,null,null,null,null,null,null,null,null,null,null,null,null,null,8012.91,"FCC3510-09-07-2023"]
[{"$f":"IFERROR(VLOOKUP(C43,#REF!,9,FALSE),\"\")","v":""},{"$f":"C43&COUNTIF($C$2:C43,C43)","v":"FCC35801"},"FCC3580",null,null,1,5362,"2023-07-09",26,null,null,null,null,null,null,5362,5362,null,null,null,null,null,null,null,null,null,null,null,null,null,null,null,null,null,null,null,null,null,null,null,null,null,null,null,null,null,null,null,5362,"FCC3580-09-07-2023"]
[{"$f":"IFERROR(VLOOKUP(C44,#REF!,9,FALSE),\"\")","v":""},{"$f":"C44&COUNTIF($C$2:C44,C44)","v":"FCC15801"},"FCC1580",null,"advance",116,2520525.52,"2023-07-09",26,null,null,null,null,null,null,2520525.52,2520525.52,null,null,null,null,null,null,null,null,null,null,null,null,null,null,null,null,null,null,null,null,null,null,null,null,null,null,null,null,null,null,null,2520525.52,"FCC1580-09-07-2023"]
[{"$f":"IFERROR(VLOOKUP(C45,#REF!,9,FALSE),\"\")","v":""},{"$f":"C45&COUNTIF($C$2:C45,C45)","v":"FCC91461"},"FCC9146",null,null,2,24164,"2023-07-09",26,null,null,null,null,null,null,24164,24164,null,null,null,null,null,null,null,null,null,null,null,null,null,null,null,null,null,null,null,null,null,null,null,null,null,null,null,null,null,null,null,24164,"FCC9146-09-07-2023"]
[{"$f":"IFERROR(VLOOKUP(C46,#REF!,9,FALSE),\"\")","v":""},{"$f":"C46&COUNTIF($C$2:C46,C46)","v":"FCC91721"},"FCC9172",null,null,17,439919.65,"2023-07-09",26,null,null,null,null,null,null,439919.65,439919.65,null,null,null,null,null,null,null,null,null,null,null,null,null,null,null,null,null,null,null,null,null,null,null,null,null,null,null,null,null,null,null,439919.65,"FCC9172-09-07-2023"]
[{"$f":"IFERROR(VLOOKUP(C47,#REF!,9,FALSE),\"\")","v":""},{"$f":"C47&COUNTIF($C$2:C47,C47)","v":"FCS28301"},"FCS2830",null,"advance",40,395709.92,"2023-07-09",26,null,null,null,null,null,null,395709.92,395709.92,null,null,null,null,null,null,null,null,null,null,null,null,null,null,null,null,null,null,null,null,null,null,null,null,null,null,null,null,null,null,null,395709.92,"FCS2830-09-07-2023"]
[{"$f":"IFERROR(VLOOKUP(C48,#REF!,9,FALSE),\"\")","v":""},{"$f":"C48&COUNTIF($C$2:C48,C48)","v":"FCJ31721"},"FCJ3172",null,null,1,1860,"2023-07-09",26,null,null,null,null,null,null,1860,1860,null,null,null,null,null,null,null,null,null,null,null,null,null,null,null,null,null,null,null,null,null,null,null,null,null,null,null,null,null,null,null,1860,"FCJ3172-09-07-2023"]
[{"$f":"IFERROR(VLOOKUP(C49,#REF!,9,FALSE),\"\")","v":""},{"$f":"C49&COUNTIF($C$2:C49,C49)","v":"FCC91641"},"FCC9164",null,null,44,387551,"2023-07-09",26,null,null,null,null,null,null,387551,387551,null,null,null,null,null,null,null,null,null,null,null,null,null,null,null,null,null,null,null,null,null,null,null,null,null,null,null,null,null,null,null,387551,"FCC9164-09-07-2023"]
[{"$f":"IFERROR(VLOOKUP(C50,#REF!,9,FALSE),\"\")","v":""},{"$f":"C50&COUNTIF($C$2:C50,C50)","v":"FCX27951"},"FCX2795",null,null,3,17806.73,"2023-07-09",26,null,null,null,null,null,null,17806.73,17806.73,null,null,null,null,null,null,null,null,null,null,null,null,null,null,null,null,null,null,null,null,null,null,null,null,null,null,null,null,null,null,null,17806.73,"FCX2795-09-07-2023"]
[{"$f":"IFERROR(VLOOKUP(C51,#REF!,9,FALSE),\"\")","v":""},{"$f":"C51&COUNTIF($C$2:C51,C51)","v":"FCC21801"},"FCC2180",null,"advance",111,2922299.88,"2023-07-09",26,"2023-07-19",1036414.49,0.73999999999068677,95162.65,1790722,0,0,2922299.88,null,null,null,null,null,null,null,null,null,null,null,null,null,null,null,null,null,null,null,null,null,null,null,null,null,null,null,null,null,null,null,2922299.1399999997,"FCC2180-09-07-2023"]
[{"$f":"IFERROR(VLOOKUP(C52,#REF!,9,FALSE),\"\")","v":""},{"$f":"C52&COUNTIF($C$2:C52,C52)","v":"FCC31101"},"FCC3110",null,"advance+VD",5,48000,"2023-07-09",26,null,null,null,null,null,null,48000,48000,null,null,null,null,null,null,null,null,null,null,null,null,null,null,null,null,null,null,null,null,null,null,null,null,null,null,null,null,null,null,null,48000,"FCC3110-09-07-2023"]
[{"$f":"IFERROR(VLOOKUP(C53,#REF!,9,FALSE),\"\")","v":""},{"$f":"C53&COUNTIF($C$2:C53,C53)","v":"FCC14101"},"FCC1410",null,"advance",36,714981.97,"2023-07-09",26,null,null,null,null,null,null,714981.97,714981.97,null,null,null,null,null,null,null,null,null,null,null,null,null,null,null,null,null,null,null,null,null,null,null,null,null,null,null,null,null,null,null,714981.97,"FCC1410-09-07-2023"]
[{"$f":"IFERROR(VLOOKUP(C54,#REF!,9,FALSE),\"\")","v":""},{"$f":"C54&COUNTIF($C$2:C54,C54)","v":"FCC26201"},"FCC2620",null,"advance",63,587745.24,"2023-07-09",26,"2023-07-26",546713.21,16032.03,0,25000,0,2.9103830456733704E-11,587745.24,null,null,null,null,null,null,null,null,null,null,null,null,null,null,null,null,null,null,null,null,null,null,null,null,null,null,null,null,null,null,null,571713.21,"FCC2620-09-07-2023"]
[{"$f":"IFERROR(VLOOKUP(C55,#REF!,9,FALSE),\"\")","v":""},{"$f":"C55&COUNTIF($C$2:C55,C55)","v":"FCC32001"},"FCC3200",null,"advance",10,232847.22,"2023-07-09",26,null,null,null,null,null,null,232847.22,232847.22,null,null,null,null,null,null,null,null,null,null,null,null,null,null,null,null,null,null,null,null,null,null,null,null,null,null,null,null,null,null,null,232847.22,"FCC3200-09-07-2023"]
[{"$f":"IFERROR(VLOOKUP(C56,#REF!,9,FALSE),\"\")","v":""},{"$f":"C56&COUNTIF($C$2:C56,C56)","v":"FCB31941"},"FCB3194",null,null,4,27701.5,"2023-07-10",25,null,null,null,null,null,null,27701.5,27701.5,null,null,null,null,null,null,null,null,null,null,null,null,null,null,null,null,null,null,null,null,null,null,null,null,null,null,null,null,null,null,null,27701.5,"FCB3194-10-07-2023"]
[{"$f":"IFERROR(VLOOKUP(C57,#REF!,9,FALSE),\"\")","v":""},{"$f":"C57&COUNTIF($C$2:C57,C57)","v":"FCQ09801"},"FCQ0980",null,null,2,80465,"2023-07-10",25,null,null,null,null,null,null,80465,80465,null,null,null,null,null,null,null,null,null,null,null,null,null,null,null,null,null,null,null,null,null,null,null,null,null,null,null,null,null,null,null,80465,"FCQ0980-10-07-2023"]
[{"$f":"IFERROR(VLOOKUP(C58,#REF!,9,FALSE),\"\")","v":""},{"$f":"C58&COUNTIF($C$2:C58,C58)","v":"FCM27601"},"FCM2760",null,null,7,76121.19,"2023-07-10",25,null,null,null,null,null,null,76121.19,76121.19,null,null,null,null,null,null,null,null,null,null,null,null,null,null,null,null,null,null,null,null,null,null,null,null,null,null,null,null,null,null,null,76121.19,"FCM2760-10-07-2023"]
[{"$f":"IFERROR(VLOOKUP(C59,#REF!,9,FALSE),\"\")","v":""},{"$f":"C59&COUNTIF($C$2:C59,C59)","v":"FCC28801"},"FCC2880",null,null,37,438865.24,"2023-07-10",25,null,null,null,null,null,null,438865.24,438865.24,null,null,null,null,null,null,null,null,null,null,null,null,null,null,null,null,null,null,null,null,null,null,null,null,null,null,null,null,null,null,null,438865.24,"FCC2880-10-07-2023"]
[{"$f":"IFERROR(VLOOKUP(C60,#REF!,9,FALSE),\"\")","v":""},{"$f":"C60&COUNTIF($C$2:C60,C60)","v":"FCP32811"},"FCP3281",null,null,1,39307.440000000002,"2023-07-10",25,null,null,null,null,null,null,39307.440000000002,39307.440000000002,null,null,null,null,null,null,null,null,null,null,null,null,null,null,null,null,null,null,null,null,null,null,null,null,null,null,null,null,null,null,null,39307.440000000002,"FCP3281-10-07-2023"]
[{"$f":"IFERROR(VLOOKUP(C61,#REF!,9,FALSE),\"\")","v":""},{"$f":"C61&COUNTIF($C$2:C61,C61)","v":"FCK29901"},"FCK2990",null,null,5,32623,"2023-07-10",25,null,null,null,null,null,null,32623,32623,null,null,null,null,null,null,null,null,null,null,null,null,null,null,null,null,null,null,null,null,null,null,null,null,null,null,null,null,null,null,null,32623,"FCK2990-10-07-2023"]
[{"$f":"IFERROR(VLOOKUP(C62,#REF!,9,FALSE),\"\")","v":""},{"$f":"C62&COUNTIF($C$2:C62,C62)","v":"FCL32101"},"FCL3210",null,null,6,56989,"2023-07-10",25,null,null,null,null,null,null,56989,56989,null,null,null,null,null,null,null,null,null,null,null,null,null,null,null,null,null,null,null,null,null,null,null,null,null,null,null,null,null,null,null,56989,"FCL3210-10-07-2023"]
[{"$f":"IFERROR(VLOOKUP(C63,#REF!,9,FALSE),\"\")","v":""},{"$f":"C63&COUNTIF($C$2:C63,C63)","v":"FCS17001"},"FCS1700",null,null,41,377554.08,"2023-07-10",25,null,null,null,null,null,null,377554.08,377554.08,null,null,null,null,null,null,null,null,null,null,null,null,null,null,null,null,null,null,null,null,null,null,null,null,null,null,null,null,null,null,null,377554.08,"FCS1700-10-07-2023"]
[{"$f":"IFERROR(VLOOKUP(C64,#REF!,9,FALSE),\"\")","v":""},{"$f":"C64&COUNTIF($C$2:C64,C64)","v":"FCS10201"},"FCS1020",null,null,78,808395.54,"2023-07-10",25,null,null,null,null,null,null,808395.54,808395.54,null,null,null,null,null,null,null,null,null,null,null,null,null,null,null,null,null,null,null,null,null,null,null,null,null,null,null,null,null,null,null,808395.54,"FCS1020-10-07-2023"]
[{"$f":"IFERROR(VLOOKUP(C65,#REF!,9,FALSE),\"\")","v":""},{"$f":"C65&COUNTIF($C$2:C65,C65)","v":"FCX27931"},"FCX2793",null,null,3,37065.31,"2023-07-10",25,null,null,null,null,null,null,37065.31,37065.31,null,null,null,null,null,null,null,null,null,null,null,null,null,null,null,null,null,null,null,null,null,null,null,null,null,null,null,null,null,null,null,37065.31,{"$f":"CONCATENATE(C65,\"-\",TEXT(H65,\"DD-MM-YYYY\"))","v":"FCX2793-10-07-2023"}]
[{"$f":"IFERROR(VLOOKUP(C66,#REF!,9,FALSE),\"\")","v":""},{"$f":"C66&COUNTIF($C$2:C66,C66)","v":"FCC91931"},"FCC9193",null,null,3,66396.09,"2023-07-10",{"$f":"+TODAY()-H66","v":25},null,null,null,null,null,null,{"$f":"+G66-K66-L66-M66-N66","v":66396.09},{"$f":"+G66-R66-T66-V66-X66-Z66-AB66-AD66-AF66-AH66-AJ66-AL66-AN66-AP66-AT66-AV66","v":66396.09},null,null,null,null,null,null,null,null,null,null,null,null,null,null,null,null,null,null,null,null,null,null,null,null,null,null,null,null,null,null,null,{"$f":"G66-(L66++R66+T66+V66+X66+Z66+AB66+AD66+AF66+AH66+AJ66+AL66+AN66+AP66+AR66)","v":66396.09},"FCC9193-10-07-2023"]
[{"$f":"IFERROR(VLOOKUP(C67,#REF!,9,FALSE),\"\")","v":""},{"$f":"C67&COUNTIF($C$2:C67,C67)","v":"FCC91661"},"FCC9166",null,null,1,10400,"2023-07-10",25,null,null,null,null,null,null,10400,10400,null,null,null,null,null,null,null,null,null,null,null,null,null,null,null,null,null,null,null,null,null,null,null,null,null,null,null,null,null,null,null,10400,"FCC9166-10-07-2023"]
[{"$f":"IFERROR(VLOOKUP(C68,#REF!,9,FALSE),\"\")","v":""},{"$f":"C68&COUNTIF($C$2:C68,C68)","v":"FCC91851"},"FCC9185",null,null,6,96401.72,"2023-07-10",25,null,null,null,null,null,null,96401.72,96401.72,null,null,null,null,null,null,null,null,null,null,null,null,null,null,null,null,null,null,null,null,null,null,null,null,null,null,null,null,null,null,null,96401.72,"FCC9185-10-07-2023"]
[{"$f":"IFERROR(VLOOKUP(C69,#REF!,9,FALSE),\"\")","v":""},{"$f":"C69&COUNTIF($C$2:C69,C69)","v":"fcn31451"},"fcn3145",null,null,41,96758.14,"2023-07-10",25,"2023-07-25",90228.14,6610,0,0,0,-80,96758.14,null,null,null,null,null,null,null,null,null,null,null,null,null,null,null,null,null,null,null,null,null,null,null,null,null,null,null,null,null,null,null,90148.14,"fcn3145-10-07-2023"]
[{"$f":"IFERROR(VLOOKUP(C70,#REF!,9,FALSE),\"\")","v":""},{"$f":"C70&COUNTIF($C$2:C70,C70)","v":"FCU11302"},"FCU1130",null,null,1,6229.9,"2023-07-10",25,null,null,null,null,null,null,6229.9,6229.9,null,null,null,null,null,null,null,null,null,null,null,null,null,null,null,null,null,null,null,null,null,null,null,null,null,null,null,null,null,null,null,6229.9,"FCU1130-10-07-2023"]
[{"$f":"IFERROR(VLOOKUP(C71,#REF!,9,FALSE),\"\")","v":""},{"$f":"C71&COUNTIF($C$2:C71,C71)","v":"FCS23401"},"FCS2340",null,null,9,46745,"2023-07-10",25,null,null,null,null,null,null,46745,46745,null,null,null,null,null,null,null,null,null,null,null,null,null,null,null,null,null,null,null,null,null,null,null,null,null,null,null,null,null,null,null,46745,"FCS2340-10-07-2023"]
[{"$f":"IFERROR(VLOOKUP(C72,#REF!,9,FALSE),\"\")","v":""},{"$f":"C72&COUNTIF($C$2:C72,C72)","v":"FCX27401"},"FCX2740",null,"advance",79,1419946.21,"2023-07-10",25,null,null,null,null,null,null,1419946.21,1419946.21,null,null,null,null,null,null,null,null,null,null,null,null,null,null,null,null,null,null,null,null,null,null,null,null,null,null,null,null,null,null,null,1419946.21,"FCX2740-10-07-2023"]
[{"$f":"IFERROR(VLOOKUP(C73,#REF!,9,FALSE),\"\")","v":""},{"$f":"C73&COUNTIF($C$2:C73,C73)","v":"FCC06601"},"FCC0660",null,null,8,133388.35,"2023-07-10",25,null,null,null,null,null,null,133388.35,133388.35,null,null,null,null,null,null,null,null,null,null,null,null,null,null,null,null,null,null,null,null,null,null,null,null,null,null,null,null,null,null,null,133388.35,"FCC0660-10-07-2023"]
[{"$f":"IFERROR(VLOOKUP(C74,#REF!,9,FALSE),\"\")","v":""},{"$f":"C74&COUNTIF($C$2:C74,C74)","v":"FCC01101"},"FCC0110",null,"advance",125,3166994.59,"2023-07-10",25,null,null,null,null,null,null,3166994.59,3166994.59,null,null,null,null,null,null,null,null,null,null,null,null,null,null,null,null,null,null,null,null,null,null,null,null,null,null,null,null,null,null,null,3166994.59,"FCC0110-10-07-2023"]
[{"$f":"IFERROR(VLOOKUP(C75,#REF!,9,FALSE),\"\")","v":""},{"$f":"C75&COUNTIF($C$2:C75,C75)","v":"FCC30401"},"FCC3040",null,"advance",45,820775.8,"2023-07-10",25,"2023-07-26",744062.09,0,0,76713.710000000079,0,0,820775.8,null,null,null,null,null,null,null,null,null,null,null,null,null,null,null,null,null,null,null,null,null,null,null,null,null,null,null,null,null,null,null,820775.8,"FCC3040-10-07-2023"]
[{"$f":"IFERROR(VLOOKUP(C76,#REF!,9,FALSE),\"\")","v":""},{"$f":"C76&COUNTIF($C$2:C76,C76)","v":"FCC00901"},"FCC0090",null,"advance",172,7143878.75,"2023-07-10",25,null,null,null,null,null,null,7143878.75,7143878.75,null,null,null,null,null,null,null,null,null,null,null,null,null,null,null,null,null,null,null,null,null,null,null,null,null,null,null,null,null,null,null,7143878.75,"FCC0090-10-07-2023"]
[{"$f":"IFERROR(VLOOKUP(C77,#REF!,9,FALSE),\"\")","v":""},{"$f":"C77&COUNTIF($C$2:C77,C77)","v":"FCX18401"},"FCX1840",null,"advance",47,601023.71,"2023-07-10",25,null,null,null,null,null,null,601023.71,601023.71,null,null,null,null,null,null,null,null,null,null,null,null,null,null,null,null,null,null,null,null,null,null,null,null,null,null,null,null,null,null,null,601023.71,"FCX1840-10-07-2023"]
[{"$f":"IFERROR(VLOOKUP(C78,#REF!,9,FALSE),\"\")","v":""},{"$f":"C78&COUNTIF($C$2:C78,C78)","v":"FCC03401"},"FCC0340",null,null,1,5356.53,"2023-07-10",25,null,null,null,null,null,null,5356.53,5356.53,null,null,null,null,null,null,null,null,null,null,null,null,null,null,null,null,null,null,null,null,null,null,null,null,null,null,null,null,null,null,null,5356.53,"FCC0340-10-07-2023"]
[{"$f":"IFERROR(VLOOKUP(C79,#REF!,9,FALSE),\"\")","v":""},{"$f":"C79&COUNTIF($C$2:C79,C79)","v":"FCC91551"},"FCC9155",null,null,9,435639.2,"2023-07-10",25,null,null,null,null,null,null,435639.2,435639.2,null,null,null,null,null,null,null,null,null,null,null,null,null,null,null,null,null,null,null,null,null,null,null,null,null,null,null,null,null,null,null,435639.2,"FCC9155-10-07-2023"]
[{"$f":"IFERROR(VLOOKUP(C80,#REF!,9,FALSE),\"\")","v":""},{"$f":"C80&COUNTIF($C$2:C80,C80)","v":"FCX34901"},"FCX3490",null,null,1,11795,"2023-07-11",24,null,null,null,null,null,null,11795,11795,null,null,null,null,null,null,null,null,null,null,null,null,null,null,null,null,null,null,null,null,null,null,null,null,null,null,null,null,null,null,null,11795,"FCX3490-11-07-2023"]
[{"$f":"IFERROR(VLOOKUP(C81,#REF!,9,FALSE),\"\")","v":""},{"$f":"C81&COUNTIF($C$2:C81,C81)","v":"fcx26701"},"fcx2670",null,null,4,25150,"2023-07-11",24,null,null,null,null,null,null,25150,25150,null,null,null,null,null,null,null,null,null,null,null,null,null,null,null,null,null,null,null,null,null,null,null,null,null,null,null,null,null,null,null,25150,"fcx2670-11-07-2023"]
[{"$f":"IFERROR(VLOOKUP(C82,#REF!,9,FALSE),\"\")","v":""},{"$f":"C82&COUNTIF($C$2:C82,C82)","v":"FCX18201"},"FCX1820",null,null,4,8752.07,"2023-07-11",24,null,null,null,null,null,null,8752.07,8752.07,null,null,null,null,null,null,null,null,null,null,null,null,null,null,null,null,null,null,null,null,null,null,null,null,null,null,null,null,null,null,null,8752.07,"FCX1820-11-07-2023"]
[{"$f":"IFERROR(VLOOKUP(C83,#REF!,9,FALSE),\"\")","v":""},{"$f":"C83&COUNTIF($C$2:C83,C83)","v":"FCM27611"},"FCM2761",null,null,1,4950,"2023-07-11",24,null,null,null,null,null,null,4950,4950,null,null,null,null,null,null,null,null,null,null,null,null,null,null,null,null,null,null,null,null,null,null,null,null,null,null,null,null,null,null,null,4950,"FCM2761-11-07-2023"]
[{"$f":"IFERROR(VLOOKUP(C84,#REF!,9,FALSE),\"\")","v":""},{"$f":"C84&COUNTIF($C$2:C84,C84)","v":"FCC04001"},"FCC0400",null,"advance",173,3719772.06,"2023-07-11",24,null,null,null,null,null,null,3719772.06,3719772.06,null,null,null,null,null,null,null,null,null,null,null,null,null,null,null,null,null,null,null,null,null,null,null,null,null,null,null,null,null,null,null,3719772.06,"FCC0400-11-07-2023"]
[{"$f":"IFERROR(VLOOKUP(C85,#REF!,9,FALSE),\"\")","v":""},{"$f":"C85&COUNTIF($C$2:C85,C85)","v":"FCE01001"},"FCE0100",null,null,3,13680,"2023-07-11",24,null,null,null,null,null,null,13680,13680,null,null,null,null,null,null,null,null,null,null,null,null,null,null,null,null,null,null,null,null,null,null,null,null,null,null,null,null,null,null,null,13680,"FCE0100-11-07-2023"]
[{"$f":"IFERROR(VLOOKUP(C86,#REF!,9,FALSE),\"\")","v":""},{"$f":"C86&COUNTIF($C$2:C86,C86)","v":"FCC91981"},"FCC9198",null,"advance",32,676259.65,"2023-07-11",24,null,null,null,null,null,null,676259.65,676259.65,null,null,null,null,null,null,null,null,null,null,null,null,null,null,null,null,null,null,null,null,null,null,null,null,null,null,null,null,null,null,null,676259.65,"FCC9198-11-07-2023"]
[{"$f":"IFERROR(VLOOKUP(C87,#REF!,9,FALSE),\"\")","v":""},{"$f":"C87&COUNTIF($C$2:C87,C87)","v":"FCC03001"},"FCC0300",null,"advance",204,6608235.8200000003,"2023-07-11",24,null,null,null,null,null,null,6608235.8200000003,6608235.8200000003,null,null,null,null,null,null,null,null,null,null,null,null,null,null,null,null,null,null,null,null,null,null,null,null,null,null,null,null,null,null,null,6608235.8200000003,"FCC0300-11-07-2023"]
[{"$f":"IFERROR(VLOOKUP(C88,#REF!,9,FALSE),\"\")","v":""},{"$f":"C88&COUNTIF($C$2:C88,C88)","v":"FCS10301"},"FCS1030",null,"advance",84,1131170.48,"2023-07-11",24,null,null,null,null,null,null,1131170.48,1131170.48,null,null,null,null,null,null,null,null,null,null,null,null,null,null,null,null,null,null,null,null,null,null,null,null,null,null,null,null,null,null,null,1131170.48,"FCS1030-11-07-2023"]
[{"$f":"IFERROR(VLOOKUP(C89,#REF!,9,FALSE),\"\")","v":""},{"$f":"C89&COUNTIF($C$2:C89,C89)","v":"FCC17101"},"FCC1710",null,"advance",6,26539,"2023-07-11",24,null,null,null,null,null,null,26539,26539,null,null,null,null,null,null,null,null,null,null,null,null,null,null,null,null,null,null,null,null,null,null,null,null,null,null,null,null,null,null,null,26539,"FCC1710-11-07-2023"]
[{"$f":"IFERROR(VLOOKUP(C90,#REF!,9,FALSE),\"\")","v":""},{"$f":"C90&COUNTIF($C$2:C90,C90)","v":"FCF06901"},"FCF0690",null,null,20,84757.3,"2023-07-11",24,null,null,null,null,null,null,84757.3,84757.3,null,null,null,null,null,null,null,null,null,null,null,null,null,null,null,null,null,null,null,null,null,null,null,null,null,null,null,null,null,null,null,84757.3,"FCF0690-11-07-2023"]
[{"$f":"IFERROR(VLOOKUP(C91,#REF!,9,FALSE),\"\")","v":""},{"$f":"C91&COUNTIF($C$2:C91,C91)","v":"FCS29151"},"FCS2915",null,null,2,8809,"2023-07-11",24,null,null,null,null,null,null,8809,8809,null,null,null,null,null,null,null,null,null,null,null,null,null,null,null,null,null,null,null,null,null,null,null,null,null,null,null,null,null,null,null,8809,"FCS2915-11-07-2023"]
[{"$f":"IFERROR(VLOOKUP(C92,#REF!,9,FALSE),\"\")","v":""},{"$f":"C92&COUNTIF($C$2:C92,C92)","v":"FCC35701"},"FCC3570",null,"advance",9,65477.31,"2023-07-11",24,null,null,null,null,null,null,65477.31,65477.31,null,null,null,null,null,null,null,null,null,null,null,null,null,null,null,null,null,null,null,null,null,null,null,null,null,null,null,null,null,null,null,65477.31,"FCC3570-11-07-2023"]
[{"$f":"IFERROR(VLOOKUP(C93,#REF!,9,FALSE),\"\")","v":""},{"$f":"C93&COUNTIF($C$2:C93,C93)","v":"FCC91311"},"FCC9131",null,null,3,27433.75,"2023-07-11",24,null,null,null,null,null,null,27433.75,27433.75,null,null,null,null,null,null,null,null,null,null,null,null,null,null,null,null,null,null,null,null,null,null,null,null,null,null,null,null,null,null,null,27433.75,"FCC9131-11-07-2023"]
[{"$f":"IFERROR(VLOOKUP(C94,#REF!,9,FALSE),\"\")","v":""},{"$f":"C94&COUNTIF($C$2:C94,C94)","v":"FCC91751"},"FCC9175",null,null,2,90000,"2023-07-11",24,null,null,null,null,null,null,90000,90000,null,null,null,null,null,null,null,null,null,null,null,null,null,null,null,null,null,null,null,null,null,null,null,null,null,null,null,null,null,null,null,90000,"FCC9175-11-07-2023"]
[{"$f":"IFERROR(VLOOKUP(C95,#REF!,9,FALSE),\"\")","v":""},{"$f":"C95&COUNTIF($C$2:C95,C95)","v":"FCX12901"},"FCX1290",null,"advance",136,3400565.7,"2023-07-11",24,null,null,null,null,null,null,3400565.7,3400565.7,null,null,null,null,null,null,null,null,null,null,null,null,null,null,null,null,null,null,null,null,null,null,null,null,null,null,null,null,null,null,null,3400565.7,"FCX1290-11-07-2023"]
[{"$f":"IFERROR(VLOOKUP(C96,#REF!,9,FALSE),\"\")","v":""},{"$f":"C96&COUNTIF($C$2:C96,C96)","v":"FCC32501"},"FCC3250",null,null,1,15784.5,"2023-07-11",24,null,null,null,null,null,null,15784.5,15784.5,null,null,null,null,null,null,null,null,null,null,null,null,null,null,null,null,null,null,null,null,null,null,null,null,null,null,null,null,null,null,null,15784.5,"FCC3250-11-07-2023"]
[{"$f":"IFERROR(VLOOKUP(C97,#REF!,9,FALSE),\"\")","v":""},{"$f":"C97&COUNTIF($C$2:C97,C97)","v":"FCC91791"},"FCC9179",null,null,1,61845.74,"2023-07-12",23,null,null,null,null,null,null,61845.74,61845.74,null,null,null,null,null,null,null,null,null,null,null,null,null,null,null,null,null,null,null,null,null,null,null,null,null,null,null,null,null,null,null,61845.74,"FCC9179-12-07-2023"]
[{"$f":"IFERROR(VLOOKUP(C98,#REF!,9,FALSE),\"\")","v":""},{"$f":"C98&COUNTIF($C$2:C98,C98)","v":"FCX16201"},"FCX1620",null,null,5,41351.85,"2023-07-12",23,null,null,null,null,null,null,41351.85,41351.85,null,null,null,null,null,null,null,null,null,null,null,null,null,null,null,null,null,null,null,null,null,null,null,null,null,null,null,null,null,null,null,41351.85,"FCX1620-12-07-2023"]
[{"$f":"IFERROR(VLOOKUP(C99,#REF!,9,FALSE),\"\")","v":""},{"$f":"C99&COUNTIF($C$2:C99,C99)","v":"FCX27981"},"FCX2798",null,null,21,303247.8,"2023-07-12",23,null,null,null,null,null,null,303247.8,303247.8,null,null,null,null,null,null,null,null,null,null,null,null,null,null,null,null,null,null,null,null,null,null,null,null,null,null,null,null,null,null,null,303247.8,"FCX2798-12-07-2023"]
[{"$f":"IFERROR(VLOOKUP(C100,#REF!,9,FALSE),\"\")","v":""},{"$f":"C100&COUNTIF($C$2:C100,C100)","v":"FCC01201"},"FCC0120",null,null,34,792144.49,"2023-07-12",23,null,null,null,null,null,null,792144.49,792144.49,null,null,null,null,null,null,null,null,null,null,null,null,null,null,null,null,null,null,null,null,null,null,null,null,null,null,null,null,null,null,null,792144.49,"FCC0120-12-07-2023"]
[{"$f":"IFERROR(VLOOKUP(C101,#REF!,9,FALSE),\"\")","v":""},{"$f":"C101&COUNTIF($C$2:C101,C101)","v":"FCC91841"},"FCC9184",null,null,1,7790,"2023-07-12",23,null,null,null,null,null,null,7790,7790,null,null,null,null,null,null,null,null,null,null,null,null,null,null,null,null,null,null,null,null,null,null,null,null,null,null,null,null,null,null,null,7790,"FCC9184-12-07-2023"]
[{"$f":"IFERROR(VLOOKUP(C102,#REF!,9,FALSE),\"\")","v":""},{"$f":"C102&COUNTIF($C$2:C102,C102)","v":"FCN08901"},"FCN0890",null,null,7,57470.98,"2023-07-12",23,null,null,null,null,null,null,57470.98,57470.98,null,null,null,null,null,null,null,null,null,null,null,null,null,null,null,null,null,null,null,null,null,null,null,null,null,null,null,null,null,null,null,57470.98,"FCN0890-12-07-2023"]
[{"$f":"IFERROR(VLOOKUP(C103,#REF!,9,FALSE),\"\")","v":""},{"$f":"C103&COUNTIF($C$2:C103,C103)","v":"FCC91691"},"FCC9169",null,null,5,54381.71,"2023-07-12",23,null,null,null,null,null,null,54381.71,54381.71,null,null,null,null,null,null,null,null,null,null,null,null,null,null,null,null,null,null,null,null,null,null,null,null,null,null,null,null,null,null,null,54381.71,"FCC9169-12-07-2023"]
[{"$f":"IFERROR(VLOOKUP(C104,#REF!,9,FALSE),\"\")","v":""},{"$f":"C104&COUNTIF($C$2:C104,C104)","v":"FCT22301"},"FCT2230",null,null,13,80775.94,"2023-07-12",23,null,null,null,null,null,null,80775.94,80775.94,null,null,null,null,null,null,null,null,null,null,null,null,null,null,null,null,null,null,null,null,null,null,null,null,null,null,null,null,null,null,null,80775.94,"FCT2230-12-07-2023"]
[{"$f":"IFERROR(VLOOKUP(C105,#REF!,9,FALSE),\"\")","v":""},{"$f":"C105&COUNTIF($C$2:C105,C105)","v":"FCX26901"},"FCX2690",null,null,18,191452.03,"2023-07-12",23,null,null,null,null,null,null,191452.03,191452.03,null,null,null,null,null,null,null,null,null,null,null,null,null,null,null,null,null,null,null,null,null,null,null,null,null,null,null,null,null,null,null,191452.03,"FCX2690-12-07-2023"]
[{"$f":"IFERROR(VLOOKUP(C106,#REF!,9,FALSE),\"\")","v":""},{"$f":"C106&COUNTIF($C$2:C106,C106)","v":"FCC91961"},"FCC9196",null,null,4,47124,"2023-07-12",23,null,null,null,null,null,null,47124,47124,null,null,null,null,null,null,null,null,null,null,null,null,null,null,null,null,null,null,null,null,null,null,null,null,null,null,null,null,null,null,null,47124,"FCC9196-12-07-2023"]
[{"$f":"IFERROR(VLOOKUP(C107,#REF!,9,FALSE),\"\")","v":""},{"$f":"C107&COUNTIF($C$2:C107,C107)","v":"FCC91521"},"FCC9152",null,"advance",5,90500,"2023-07-12",23,null,null,null,null,null,null,90500,90500,null,null,null,null,null,null,null,null,null,null,null,null,null,null,null,null,null,null,null,null,null,null,null,null,null,null,null,null,null,null,null,90500,"FCC9152-12-07-2023"]
[{"$f":"IFERROR(VLOOKUP(C108,#REF!,9,FALSE),\"\")","v":""},{"$f":"C108&COUNTIF($C$2:C108,C108)","v":"FCC91651"},"FCC9165",null,null,8,41891.800000000003,"2023-07-12",23,null,null,null,null,null,null,41891.800000000003,41891.800000000003,null,null,null,null,null,null,null,null,null,null,null,null,null,null,null,null,null,null,null,null,null,null,null,null,null,null,null,null,null,null,null,41891.800000000003,"FCC9165-12-07-2023"]
[{"$f":"IFERROR(VLOOKUP(C109,#REF!,9,FALSE),\"\")","v":""},{"$f":"C109&COUNTIF($C$2:C109,C109)","v":"FCC30601"},"FCC3060",null,null,4,90000,"2023-07-12",23,null,null,null,null,null,null,90000,90000,null,null,null,null,null,null,null,null,null,null,null,null,null,null,null,null,null,null,null,null,null,null,null,null,null,null,null,null,null,null,null,90000,"FCC3060-12-07-2023"]
[{"$f":"IFERROR(VLOOKUP(C110,#REF!,9,FALSE),\"\")","v":""},{"$f":"C110&COUNTIF($C$2:C110,C110)","v":"FCN31441"},"FCN3144",null,null,25,207047.6,"2023-07-12",23,null,null,null,null,null,null,207047.6,207047.6,null,null,null,null,null,null,null,null,null,null,null,null,null,null,null,null,null,null,null,null,null,null,null,null,null,null,null,null,null,null,null,207047.6,"FCN3144-12-07-2023"]
[{"$f":"IFERROR(VLOOKUP(C111,#REF!,9,FALSE),\"\")","v":""},{"$f":"C111&COUNTIF($C$2:C111,C111)","v":"FCC22501"},"FCC2250",null,null,1,16301,"2023-07-12",23,null,null,null,null,null,null,16301,16301,null,null,null,null,null,null,null,null,null,null,null,null,null,null,null,null,null,null,null,null,null,null,null,null,null,null,null,null,null,null,null,{"$f":"G111-(L111++R111+T111+V111+X111+Z111+AB111+AD111+AF111+AH111+AJ111+AL111+AN111+AP111+AR111+AT111+AV111)","v":16301},"FCC2250-12-07-2023"]
[{"$f":"IFERROR(VLOOKUP(C112,#REF!,9,FALSE),\"\")","v":""},{"$f":"C112&COUNTIF($C$2:C112,C112)","v":"FCC91561"},"FCC9156",null,"advance",15,240467.28,"2023-07-12",23,null,null,null,null,null,null,240467.28,240467.28,null,null,null,null,null,null,null,null,null,null,null,null,null,null,null,null,null,null,null,null,null,null,null,null,null,null,null,null,null,null,null,240467.28,"FCC9156-12-07-2023"]
[{"$f":"IFERROR(VLOOKUP(C113,#REF!,9,FALSE),\"\")","v":""},{"$f":"C113&COUNTIF($C$2:C113,C113)","v":"FCC04201"},"FCC0420",null,null,1,46700,"2023-07-12",23,null,null,null,null,null,null,46700,46700,null,null,null,null,null,null,null,null,null,null,null,null,null,null,null,null,null,null,null,null,null,null,null,null,null,null,null,null,null,null,null,46700,"FCC0420-12-07-2023"]
[{"$f":"IFERROR(VLOOKUP(C114,#REF!,9,FALSE),\"\")","v":""},{"$f":"C114&COUNTIF($C$2:C114,C114)","v":"FCX12601"},"FCX1260",null,null,6,63775,"2023-07-13",22,null,null,null,null,null,null,63775,63775,null,null,null,null,null,null,null,null,null,null,null,null,null,null,null,null,null,null,null,null,null,null,null,null,null,null,null,null,null,null,null,63775,"FCX1260-13-07-2023"]
[{"$f":"IFERROR(VLOOKUP(C115,#REF!,9,FALSE),\"\")","v":""},{"$f":"C115&COUNTIF($C$2:C115,C115)","v":"FCC21301"},"FCC2130",null,null,9,30275.200000000001,"2023-07-13",22,null,null,null,null,null,null,30275.200000000001,30275.200000000001,null,null,null,null,null,null,null,null,null,null,null,null,null,null,null,null,null,null,null,null,null,null,null,null,null,null,null,null,null,null,null,30275.200000000001,"FCC2130-13-07-2023"]
[{"$f":"IFERROR(VLOOKUP(C116,#REF!,9,FALSE),\"\")","v":""},{"$f":"C116&COUNTIF($C$2:C116,C116)","v":"FCX16102"},"FCX1610",null,null,1,86857.32,"2023-07-13",22,null,null,null,null,null,null,86857.32,86857.32,null,null,null,null,null,null,null,null,null,null,null,null,null,null,null,null,null,null,null,null,null,null,null,null,null,null,null,null,null,null,null,86857.32,"FCX1610-13-07-2023"]
[{"$f":"IFERROR(VLOOKUP(C117,#REF!,9,FALSE),\"\")","v":""},{"$f":"C117&COUNTIF($C$2:C117,C117)","v":"FCC01901"},"FCC0190",null,null,22,139543,"2023-07-13",22,null,null,null,null,null,null,139543,139543,null,null,null,null,null,null,null,null,null,null,null,null,null,null,null,null,null,null,null,null,null,null,null,null,null,null,null,null,null,null,null,139543,"FCC0190-13-07-2023"]
[{"$f":"IFERROR(VLOOKUP(C118,#REF!,9,FALSE),\"\")","v":""},{"$f":"C118&COUNTIF($C$2:C118,C118)","v":"FCS10501"},"FCS1050",null,null,6,27677.200000000001,"2023-07-13",22,null,null,null,null,null,null,27677.200000000001,27677.200000000001,null,null,null,null,null,null,null,null,null,null,null,null,null,null,null,null,null,null,null,null,null,null,null,null,null,null,null,null,null,null,null,27677.200000000001,"FCS1050-13-07-2023"]
[{"$f":"IFERROR(VLOOKUP(C119,#REF!,9,FALSE),\"\")","v":""},{"$f":"C119&COUNTIF($C$2:C119,C119)","v":"FCC16601"},"FCC1660",null,"advance",52,683246.48,"2023-07-13",22,null,null,null,null,null,null,683246.48,683246.48,null,null,null,null,null,null,null,null,null,null,null,null,null,null,null,null,null,null,null,null,null,null,null,null,null,null,null,null,null,null,null,683246.48,"FCC1660-13-07-2023"]
[{"$f":"IFERROR(VLOOKUP(C120,#REF!,9,FALSE),\"\")","v":""},{"$f":"C120&COUNTIF($C$2:C120,C120)","v":"FCK30781"},"FCK3078",null,null,16,88405.75,"2023-07-13",22,null,null,null,null,null,null,88405.75,88405.75,null,null,null,null,null,null,null,null,null,null,null,null,null,null,null,null,null,null,null,null,null,null,null,null,null,null,null,null,null,null,null,88405.75,"FCK3078-13-07-2023"]
[{"$f":"IFERROR(VLOOKUP(C121,#REF!,9,FALSE),\"\")","v":""},{"$f":"C121&COUNTIF($C$2:C121,C121)","v":"FCC01301"},"FCC0130",null,"advance",49,962089.51,"2023-07-13",22,null,null,null,null,null,null,962089.51,962089.51,null,null,null,null,null,null,null,null,null,null,null,null,null,null,null,null,null,null,null,null,null,null,null,null,null,null,null,null,null,null,null,962089.51,"FCC0130-13-07-2023"]
[{"$f":"IFERROR(VLOOKUP(C122,#REF!,9,FALSE),\"\")","v":""},{"$f":"C122&COUNTIF($C$2:C122,C122)","v":"FCC02401"},"FCC0240",null,null,2,34684.550000000003,"2023-07-13",22,null,null,null,null,null,null,34684.550000000003,34684.550000000003,null,null,null,null,null,null,null,null,null,null,null,null,null,null,null,null,null,null,null,null,null,null,null,null,null,null,null,null,null,null,null,34684.550000000003,"FCC0240-13-07-2023"]
[{"$f":"IFERROR(VLOOKUP(C123,#REF!,9,FALSE),\"\")","v":""},{"$f":"C123&COUNTIF($C$2:C123,C123)","v":"FCC91671"},"FCC9167",null,"advance",77,1668247.94,"2023-07-13",22,null,null,null,null,null,null,1668247.94,1668247.94,null,null,null,null,null,null,null,null,null,null,null,null,null,null,null,null,null,null,null,null,null,null,null,null,null,null,null,null,null,null,null,1668247.94,"FCC9167-13-07-2023"]
[{"$f":"IFERROR(VLOOKUP(C124,#REF!,9,FALSE),\"\")","v":""},{"$f":"C124&COUNTIF($C$2:C124,C124)","v":"FCV11721"},"FCV1172",null,null,1,3650.5,"2023-07-16",19,null,null,null,null,null,null,3650.5,3650.5,null,null,null,null,null,null,null,null,null,null,null,null,null,null,null,null,null,null,null,null,null,null,null,null,null,null,null,null,null,null,null,3650.5,"FCV1172-16-07-2023"]
[{"$f":"IFERROR(VLOOKUP(C125,#REF!,9,FALSE),\"\")","v":""},{"$f":"C125&COUNTIF($C$2:C125,C125)","v":"FCC00401"},"FCC0040",null,null,2,7088.5,"2023-07-16",19,null,null,null,null,null,null,7088.5,7088.5,null,null,null,null,null,null,null,null,null,null,null,null,null,null,null,null,null,null,null,null,null,null,null,null,null,null,null,null,null,null,null,7088.5,"FCC0040-16-07-2023"]
[{"$f":"IFERROR(VLOOKUP(C126,#REF!,9,FALSE),\"\")","v":""},{"$f":"C126&COUNTIF($C$2:C126,C126)","v":"FCP17201"},"FCP1720",null,null,12,119099.57,"2023-07-16",19,null,null,null,null,null,null,119099.57,119099.57,null,null,null,null,null,null,null,null,null,null,null,null,null,null,null,null,null,null,null,null,null,null,null,null,null,null,null,null,null,null,null,119099.57,"FCP1720-16-07-2023"]
[{"$f":"IFERROR(VLOOKUP(C127,#REF!,9,FALSE),\"\")","v":""},{"$f":"C127&COUNTIF($C$2:C127,C127)","v":"FCX28001"},"FCX2800",null,null,1,9117.5,"2023-07-16",19,null,null,null,null,null,null,9117.5,9117.5,null,null,null,null,null,null,null,null,null,null,null,null,null,null,null,null,null,null,null,null,null,null,null,null,null,null,null,null,null,null,null,9117.5,"FCX2800-16-07-2023"]
[{"$f":"IFERROR(VLOOKUP(C128,#REF!,9,FALSE),\"\")","v":""},{"$f":"C128&COUNTIF($C$2:C128,C128)","v":"FCX27921"},"FCX2792",null,null,6,39905.4,"2023-07-16",19,null,null,null,null,null,null,39905.4,39905.4,null,null,null,null,null,null,null,null,null,null,null,null,null,null,null,null,null,null,null,null,null,null,null,null,null,null,null,null,null,null,null,39905.4,"FCX2792-16-07-2023"]
[{"$f":"IFERROR(VLOOKUP(C129,#REF!,9,FALSE),\"\")","v":""},{"$f":"C129&COUNTIF($C$2:C129,C129)","v":"FCC25801"},"FCC2580",null,null,3,9523,"2023-07-16",19,null,null,null,null,null,null,9523,9523,null,null,null,null,null,null,null,null,null,null,null,null,null,null,null,null,null,null,null,null,null,null,null,null,null,null,null,null,null,null,null,9523,{"$f":"CONCATENATE(C129,\"-\",TEXT(H129,\"DD-MM-YYYY\"))","v":"FCC2580-16-07-2023"}]
[{"$f":"IFERROR(VLOOKUP(C130,#REF!,9,FALSE),\"\")","v":""},{"$f":"C130&COUNTIF($C$2:C130,C130)","v":"FCV11711"},"FCV1171",null,null,3,8032.72,"2023-07-16",{"$f":"+TODAY()-H130","v":19},null,null,null,null,null,null,{"$f":"+G130-K130-L130-M130-N130","v":8032.72},{"$f":"+G130-R130-T130-V130-X130-Z130-AB130-AD130-AF130-AH130-AJ130-AL130-AN130-AP130-AT130-AV130","v":8032.72},null,null,null,null,null,null,null,null,null,null,null,null,null,null,null,null,null,null,null,null,null,null,null,null,null,null,null,null,null,null,null,{"$f":"G130-(L130++R130+T130+V130+X130+Z130+AB130+AD130+AF130+AH130+AJ130+AL130+AN130+AP130+AR130)","v":8032.72},"FCV1171-16-07-2023"]
[{"$f":"IFERROR(VLOOKUP(C131,#REF!,9,FALSE),\"\")","v":""},{"$f":"C131&COUNTIF($C$2:C131,C131)","v":"FCE00971"},"FCE0097",null,null,1,968,"2023-07-16",19,null,null,null,null,null,null,968,968,null,null,null,null,null,null,null,null,null,null,null,null,null,null,null,null,null,null,null,null,null,null,null,null,null,null,null,null,null,null,null,968,"FCE0097-16-07-2023"]
[{"$f":"IFERROR(VLOOKUP(C132,#REF!,9,FALSE),\"\")","v":""},{"$f":"C132&COUNTIF($C$2:C132,C132)","v":"FCC91871"},"FCC9187",null,null,3,12900,"2023-07-16",19,null,null,null,null,null,null,12900,12900,null,null,null,null,null,null,null,null,null,null,null,null,null,null,null,null,null,null,null,null,null,null,null,null,null,null,null,null,null,null,null,12900,"FCC9187-16-07-2023"]
[{"$f":"IFERROR(VLOOKUP(C133,#REF!,9,FALSE),\"\")","v":""},{"$f":"C133&COUNTIF($C$2:C133,C133)","v":"FCC15701"},"FCC1570",null,null,4,27496,"2023-07-16",19,null,null,null,null,null,null,27496,27496,null,null,null,null,null,null,null,null,null,null,null,null,null,null,null,null,null,null,null,null,null,null,null,null,null,null,null,null,null,null,null,27496,"FCC1570-16-07-2023"]
[{"$f":"IFERROR(VLOOKUP(C134,#REF!,9,FALSE),\"\")","v":""},{"$f":"C134&COUNTIF($C$2:C134,C134)","v":"FCR34601"},"FCR3460",null,null,5,43890,"2023-07-16",19,null,null,null,null,null,null,43890,43890,null,null,null,null,null,null,null,null,null,null,null,null,null,null,null,null,null,null,null,null,null,null,null,null,null,null,null,null,null,null,null,43890,"FCR3460-16-07-2023"]
[{"$f":"IFERROR(VLOOKUP(C135,#REF!,9,FALSE),\"\")","v":""},{"$f":"C135&COUNTIF($C$2:C135,C135)","v":"FCC06001"},"FCC0600",null,null,22,141687.5,"2023-07-16",19,null,null,null,null,null,null,141687.5,141687.5,null,null,null,null,null,null,null,null,null,null,null,null,null,null,null,null,null,null,null,null,null,null,null,null,null,null,null,null,null,null,null,141687.5,"FCC0600-16-07-2023"]
[{"$f":"IFERROR(VLOOKUP(C136,#REF!,9,FALSE),\"\")","v":""},{"$f":"C136&COUNTIF($C$2:C136,C136)","v":"FCH17901"},"FCH1790",null,"advance",7,146818,"2023-07-16",19,null,null,null,null,null,null,146818,146818,null,null,null,null,null,null,null,null,null,null,null,null,null,null,null,null,null,null,null,null,null,null,null,null,null,null,null,null,null,null,null,146818,"FCH1790-16-07-2023"]
[{"$f":"IFERROR(VLOOKUP(C137,#REF!,9,FALSE),\"\")","v":""},{"$f":"C137&COUNTIF($C$2:C137,C137)","v":"FCF26151"},"FCF2615",null,null,2,16383,"2023-07-16",19,null,null,null,null,null,null,16383,16383,null,null,null,null,null,null,null,null,null,null,null,null,null,null,null,null,null,null,null,null,null,null,null,null,null,null,null,null,null,null,null,16383,"FCF2615-16-07-2023"]
[{"$f":"IFERROR(VLOOKUP(C138,#REF!,9,FALSE),\"\")","v":""},{"$f":"C138&COUNTIF($C$2:C138,C138)","v":"FCC33001"},"FCC3300",null,"advance",178,5232136.13,"2023-07-16",19,null,null,null,null,null,null,5232136.13,5232136.13,null,null,null,null,null,null,null,null,null,null,null,null,null,null,null,null,null,null,null,null,null,null,null,null,null,null,null,null,null,null,null,5232136.13,"FCC3300-16-07-2023"]
[{"$f":"IFERROR(VLOOKUP(C139,#REF!,9,FALSE),\"\")","v":""},{"$f":"C139&COUNTIF($C$2:C139,C139)","v":"FCC18301"},"FCC1830",null,null,1,28500,"2023-07-16",19,null,null,null,null,null,null,28500,28500,null,null,null,null,null,null,null,null,null,null,null,null,null,null,null,null,null,null,null,null,null,null,null,null,null,null,null,null,null,null,null,28500,"FCC1830-16-07-2023"]
[{"$f":"IFERROR(VLOOKUP(C140,#REF!,9,FALSE),\"\")","v":""},{"$f":"C140&COUNTIF($C$2:C140,C140)","v":"FCC27301"},"FCC2730",null,"advance",24,249413.25,"2023-07-16",19,null,null,null,null,null,null,249413.25,249413.25,null,null,null,null,null,null,null,null,null,null,null,null,null,null,null,null,null,null,null,null,null,null,null,null,null,null,null,null,null,null,null,249413.25,"FCC2730-16-07-2023"]
[{"$f":"IFERROR(VLOOKUP(C141,#REF!,9,FALSE),\"\")","v":""},{"$f":"C141&COUNTIF($C$2:C141,C141)","v":"FCK24101"},"FCK2410",null,null,13,71556.34,"2023-07-16",19,null,null,null,null,null,null,71556.34,71556.34,null,null,null,null,null,null,null,null,null,null,null,null,null,null,null,null,null,null,null,null,null,null,null,null,null,null,null,null,null,null,null,71556.34,"FCK2410-16-07-2023"]
[{"$f":"IFERROR(VLOOKUP(C142,#REF!,9,FALSE),\"\")","v":""},{"$f":"C142&COUNTIF($C$2:C142,C142)","v":"FCC91681"},"FCC9168",null,null,8,260362.35,"2023-07-16",19,null,null,null,null,null,null,260362.35,260362.35,null,null,null,null,null,null,null,null,null,null,null,null,null,null,null,null,null,null,null,null,null,null,null,null,null,null,null,null,null,null,null,260362.35,"FCC9168-16-07-2023"]
[{"$f":"IFERROR(VLOOKUP(C143,#REF!,9,FALSE),\"\")","v":""},{"$f":"C143&COUNTIF($C$2:C143,C143)","v":"FCS10401"},"FCS1040",null,null,2,14491,"2023-07-16",19,null,null,null,null,null,null,14491,14491,null,null,null,null,null,null,null,null,null,null,null,null,null,null,null,null,null,null,null,null,null,null,null,null,null,null,null,null,null,null,null,14491,"FCS1040-16-07-2023"]
[{"$f":"IFERROR(VLOOKUP(C144,#REF!,9,FALSE),\"\")","v":""},{"$f":"C144&COUNTIF($C$2:C144,C144)","v":"FCC91501"},"FCC9150",null,null,2,18457.87,"2023-07-16",19,null,null,null,null,null,null,18457.87,18457.87,null,null,null,null,null,null,null,null,null,null,null,null,null,null,null,null,null,null,null,null,null,null,null,null,null,null,null,null,null,null,null,18457.87,"FCC9150-16-07-2023"]
[{"$f":"IFERROR(VLOOKUP(C145,#REF!,9,FALSE),\"\")","v":""},{"$f":"C145&COUNTIF($C$2:C145,C145)","v":"FCC91761"},"FCC9176",null,"advance",99,1326853.1399999999,"2023-07-16",19,null,null,null,null,null,null,1326853.1399999999,1326853.1399999999,null,null,null,null,null,null,null,null,null,null,null,null,null,null,null,null,null,null,null,null,null,null,null,null,null,null,null,null,null,null,null,1326853.1399999999,"FCC9176-16-07-2023"]
[{"$f":"IFERROR(VLOOKUP(C146,#REF!,9,FALSE),\"\")","v":""},{"$f":"C146&COUNTIF($C$2:C146,C146)","v":"FCC91941"},"FCC9194",null,null,4,50561,"2023-07-17",18,null,null,null,null,null,null,50561,50561,null,null,null,null,null,null,null,null,null,null,null,null,null,null,null,null,null,null,null,null,null,null,null,null,null,null,null,null,null,null,null,50561,"FCC9194-17-07-2023"]
[{"$f":"IFERROR(VLOOKUP(C147,#REF!,9,FALSE),\"\")","v":""},{"$f":"C147&COUNTIF($C$2:C147,C147)","v":"FCH07101"},"FCH0710",null,null,6,31462.13,"2023-07-17",18,null,null,null,null,null,null,31462.13,31462.13,null,null,null,null,null,null,null,null,null,null,null,null,null,null,null,null,null,null,null,null,null,null,null,null,null,null,null,null,null,null,null,31462.13,"FCH0710-17-07-2023"]
[{"$f":"IFERROR(VLOOKUP(C148,#REF!,9,FALSE),\"\")","v":""},{"$f":"C148&COUNTIF($C$2:C148,C148)","v":"FCC28401"},"FCC2840",null,"advance",45,251535,"2023-07-17",18,null,null,null,null,null,null,251535,251535,null,null,null,null,null,null,null,null,null,null,null,null,null,null,null,null,null,null,null,null,null,null,null,null,null,null,null,null,null,null,null,251535,"FCC2840-17-07-2023"]
[{"$f":"IFERROR(VLOOKUP(C149,#REF!,9,FALSE),\"\")","v":""},{"$f":"C149&COUNTIF($C$2:C149,C149)","v":"FCC31201"},"FCC3120",null,null,98,2552187.7999999998,"2023-07-17",18,null,null,null,null,null,null,2552187.7999999998,2552187.7999999998,null,null,null,null,null,null,null,null,null,null,null,null,null,null,null,null,null,null,null,null,null,null,null,null,null,null,null,null,null,null,null,2552187.7999999998,"FCC3120-17-07-2023"]
[{"$f":"IFERROR(VLOOKUP(C150,#REF!,9,FALSE),\"\")","v":""},{"$f":"C150&COUNTIF($C$2:C150,C150)","v":"FCN21701"},"FCN2170",null,null,5,172230,"2023-07-17",18,null,null,null,null,null,null,172230,172230,null,null,null,null,null,null,null,null,null,null,null,null,null,null,null,null,null,null,null,null,null,null,null,null,null,null,null,null,null,null,null,172230,"FCN2170-17-07-2023"]
[{"$f":"IFERROR(VLOOKUP(C151,#REF!,9,FALSE),\"\")","v":""},{"$f":"C151&COUNTIF($C$2:C151,C151)","v":"FCX18501"},"FCX1850",null,null,4,10715,"2023-07-17",18,null,null,null,null,null,null,10715,10715,null,null,null,null,null,null,null,null,null,null,null,null,null,null,null,null,null,null,null,null,null,null,null,null,null,null,null,null,null,null,null,10715,"FCX1850-17-07-2023"]
[{"$f":"IFERROR(VLOOKUP(C152,#REF!,9,FALSE),\"\")","v":""},{"$f":"C152&COUNTIF($C$2:C152,C152)","v":"FCN31432"},"FCN3143",null,null,8,34753.25,"2023-07-17",18,null,null,null,null,null,null,34753.25,34753.25,null,null,null,null,null,null,null,null,null,null,null,null,null,null,null,null,null,null,null,null,null,null,null,null,null,null,null,null,null,null,null,34753.25,"FCN3143-17-07-2023"]
[{"$f":"IFERROR(VLOOKUP(C153,#REF!,9,FALSE),\"\")","v":""},{"$f":"C153&COUNTIF($C$2:C153,C153)","v":"FCL07701"},"FCL0770",null,null,4,34461,"2023-07-17",18,null,null,null,null,null,null,34461,34461,null,null,null,null,null,null,null,null,null,null,null,null,null,null,null,null,null,null,null,null,null,null,null,null,null,null,null,null,null,null,null,34461,"FCL0770-17-07-2023"]
[{"$f":"IFERROR(VLOOKUP(C154,#REF!,9,FALSE),\"\")","v":""},{"$f":"C154&COUNTIF($C$2:C154,C154)","v":"FCP31601"},"FCP3160",null,null,1,3462,"2023-07-17",18,null,null,null,null,null,null,3462,3462,null,null,null,null,null,null,null,null,null,null,null,null,null,null,null,null,null,null,null,null,null,null,null,null,null,null,null,null,null,null,null,3462,"FCP3160-17-07-2023"]
[{"$f":"IFERROR(VLOOKUP(C155,#REF!,9,FALSE),\"\")","v":""},{"$f":"C155&COUNTIF($C$2:C155,C155)","v":"FCT10801"},"FCT1080",null,null,1,14275,"2023-07-17",18,null,null,null,null,null,null,14275,14275,null,null,null,null,null,null,null,null,null,null,null,null,null,null,null,null,null,null,null,null,null,null,null,null,null,null,null,null,null,null,null,14275,"FCT1080-17-07-2023"]
[{"$f":"IFERROR(VLOOKUP(C156,#REF!,9,FALSE),\"\")","v":""},{"$f":"C156&COUNTIF($C$2:C156,C156)","v":"FCX13001"},"FCX1300",null,null,1,6256.34,"2023-07-17",18,null,null,null,null,null,null,6256.34,6256.34,null,null,null,null,null,null,null,null,null,null,null,null,null,null,null,null,null,null,null,null,null,null,null,null,null,null,null,null,null,null,null,6256.34,"FCX1300-17-07-2023"]
[{"$f":"IFERROR(VLOOKUP(C157,#REF!,9,FALSE),\"\")","v":""},{"$f":"C157&COUNTIF($C$2:C157,C157)","v":"FCC21101"},"FCC2110",null,null,2,6733.5,"2023-07-17",18,null,null,null,null,null,null,6733.5,6733.5,null,null,null,null,null,null,null,null,null,null,null,null,null,null,null,null,null,null,null,null,null,null,null,null,null,null,null,null,null,null,null,6733.5,"FCC2110-17-07-2023"]
[{"$f":"IFERROR(VLOOKUP(C158,#REF!,9,FALSE),\"\")","v":""},{"$f":"C158&COUNTIF($C$2:C158,C158)","v":"FCC16501"},"FCC1650",null,"advance",7,89159.91,"2023-07-17",18,null,null,null,null,null,null,89159.91,89159.91,null,null,null,null,null,null,null,null,null,null,null,null,null,null,null,null,null,null,null,null,null,null,null,null,null,null,null,null,null,null,null,89159.91,"FCC1650-17-07-2023"]
[{"$f":"IFERROR(VLOOKUP(C159,#REF!,9,FALSE),\"\")","v":""},{"$f":"C159&COUNTIF($C$2:C159,C159)","v":"FCC91971"},"FCC9197",null,null,2,12728.87,"2023-07-17",18,null,null,null,null,null,null,12728.87,12728.87,null,null,null,null,null,null,null,null,null,null,null,null,null,null,null,null,null,null,null,null,null,null,null,null,null,null,null,null,null,null,null,12728.87,"FCC9197-17-07-2023"]
[{"$f":"IFERROR(VLOOKUP(C160,#REF!,9,FALSE),\"\")","v":""},{"$f":"C160&COUNTIF($C$2:C160,C160)","v":"FCC90901"},"FCC9090",null,null,26,589576.81000000006,"2023-07-17",18,null,null,null,null,null,null,589576.81000000006,589576.81000000006,null,null,null,null,null,null,null,null,null,null,null,null,null,null,null,null,null,null,null,null,null,null,null,null,null,null,null,null,null,null,null,589576.81000000006,"FCC9090-17-07-2023"]
[{"$f":"IFERROR(VLOOKUP(C161,#REF!,9,FALSE),\"\")","v":""},{"$f":"C161&COUNTIF($C$2:C161,C161)","v":"FCC91541"},"FCC9154",null,null,9,266779.09000000003,"2023-07-17",18,null,null,null,null,null,null,266779.09000000003,266779.09000000003,null,null,null,null,null,null,null,null,null,null,null,null,null,null,null,null,null,null,null,null,null,null,null,null,null,null,null,null,null,null,null,266779.09000000003,"FCC9154-17-07-2023"]
[{"$f":"IFERROR(VLOOKUP(C162,#REF!,9,FALSE),\"\")","v":""},{"$f":"C162&COUNTIF($C$2:C162,C162)","v":"FCC04801"},"FCC0480",null,null,41,644858,"2023-07-17",18,null,null,null,null,null,null,644858,644858,null,null,null,null,null,null,null,null,null,null,null,null,null,null,null,null,null,null,null,null,null,null,null,null,null,null,null,null,null,null,null,644858,"FCC0480-17-07-2023"]
[{"$f":"IFERROR(VLOOKUP(C163,#REF!,9,FALSE),\"\")","v":""},{"$f":"C163&COUNTIF($C$2:C163,C163)","v":"FCC26601"},"FCC2660",null,null,17,49959,"2023-07-17",18,null,null,null,null,null,null,49959,49959,null,null,null,null,null,null,null,null,null,null,null,null,null,null,null,null,null,null,null,null,null,null,null,null,null,null,null,null,null,null,null,49959,"FCC2660-17-07-2023"]
[{"$f":"IFERROR(VLOOKUP(C164,#REF!,9,FALSE),\"\")","v":""},{"$f":"C164&COUNTIF($C$2:C164,C164)","v":"FCC30201"},"FCC3020",null,null,1,2000,"2023-07-17",18,null,null,null,null,null,null,2000,2000,null,null,null,null,null,null,null,null,null,null,null,null,null,null,null,null,null,null,null,null,null,null,null,null,null,null,null,null,null,null,null,2000,"FCC3020-17-07-2023"]
[{"$f":"IFERROR(VLOOKUP(C165,#REF!,9,FALSE),\"\")","v":""},{"$f":"C165&COUNTIF($C$2:C165,C165)","v":"FCC91581"},"FCC9158",null,"advance",41,1465686.51,"2023-07-17",18,null,null,null,null,null,null,1465686.51,1465686.51,null,null,null,null,null,null,null,null,null,null,null,null,null,null,null,null,null,null,null,null,null,null,null,null,null,null,null,null,null,null,null,1465686.51,"FCC9158-17-07-2023"]
[{"$f":"IFERROR(VLOOKUP(C166,#REF!,9,FALSE),\"\")","v":""},{"$f":"C166&COUNTIF($C$2:C166,C166)","v":"FCC05901"},"FCC0590",null,"advance",115,3944708.21,"2023-07-17",18,null,null,null,null,null,null,3944708.21,3944708.21,null,null,null,null,null,null,null,null,null,null,null,null,null,null,null,null,null,null,null,null,null,null,null,null,null,null,null,null,null,null,null,3944708.21,"FCC0590-17-07-2023"]
[{"$f":"IFERROR(VLOOKUP(C167,#REF!,9,FALSE),\"\")","v":""},{"$f":"C167&COUNTIF($C$2:C167,C167)","v":"FCS29781"},"FCS2978",null,null,10,44687,"2023-07-18",17,null,null,null,null,null,null,44687,44687,null,null,null,null,null,null,null,null,null,null,null,null,null,null,null,null,null,null,null,null,null,null,null,null,null,null,null,null,null,null,null,44687,"FCS2978-18-07-2023"]
[{"$f":"IFERROR(VLOOKUP(C168,#REF!,9,FALSE),\"\")","v":""},{"$f":"C168&COUNTIF($C$2:C168,C168)","v":"FCS29231"},"FCS2923",null,null,2,110601,"2023-07-18",17,null,null,null,null,null,null,110601,110601,null,null,null,null,null,null,null,null,null,null,null,null,null,null,null,null,null,null,null,null,null,null,null,null,null,null,null,null,null,null,null,110601,"FCS2923-18-07-2023"]
[{"$f":"IFERROR(VLOOKUP(C169,#REF!,9,FALSE),\"\")","v":""},{"$f":"C169&COUNTIF($C$2:C169,C169)","v":"FCC17801"},"FCC1780",null,null,3,67790.75,"2023-07-18",17,null,null,null,null,null,null,67790.75,67790.75,null,null,null,null,null,null,null,null,null,null,null,null,null,null,null,null,null,null,null,null,null,null,null,null,null,null,null,null,null,null,null,67790.75,"FCC1780-18-07-2023"]
[{"$f":"IFERROR(VLOOKUP(C170,#REF!,9,FALSE),\"\")","v":""},{"$f":"C170&COUNTIF($C$2:C170,C170)","v":"FCP31602"},"FCP3160",null,null,1,2674,"2023-07-18",17,null,null,null,null,null,null,2674,2674,null,null,null,null,null,null,null,null,null,null,null,null,null,null,null,null,null,null,null,null,null,null,null,null,null,null,null,null,null,null,null,2674,"FCP3160-18-07-2023"]
[{"$f":"IFERROR(VLOOKUP(C171,#REF!,9,FALSE),\"\")","v":""},{"$f":"C171&COUNTIF($C$2:C171,C171)","v":"FCS10701"},"FCS1070",null,null,4,15724,"2023-07-18",17,null,null,null,null,null,null,15724,15724,null,null,null,null,null,null,null,null,null,null,null,null,null,null,null,null,null,null,null,null,null,null,null,null,null,null,null,null,null,null,null,15724,"FCS1070-18-07-2023"]
[{"$f":"IFERROR(VLOOKUP(C172,#REF!,9,FALSE),\"\")","v":""},{"$f":"C172&COUNTIF($C$2:C172,C172)","v":"FCF26221"},"FCF2622",null,null,4,13339.6,"2023-07-18",17,null,null,null,null,null,null,13339.6,13339.6,null,null,null,null,null,null,null,null,null,null,null,null,null,null,null,null,null,null,null,null,null,null,null,null,null,null,null,null,null,null,null,13339.6,"FCF2622-18-07-2023"]
[{"$f":"IFERROR(VLOOKUP(C173,#REF!,9,FALSE),\"\")","v":""},{"$f":"C173&COUNTIF($C$2:C173,C173)","v":"FCC33801"},"FCC3380",null,null,26,245448,"2023-07-18",17,null,null,null,null,null,null,245448,245448,null,null,null,null,null,null,null,null,null,null,null,null,null,null,null,null,null,null,null,null,null,null,null,null,null,null,null,null,null,null,null,245448,"FCC3380-18-07-2023"]
[{"$f":"IFERROR(VLOOKUP(C174,#REF!,9,FALSE),\"\")","v":""},{"$f":"C174&COUNTIF($C$2:C174,C174)","v":"FCN31001"},"FCN3100",null,null,1,7580,"2023-07-18",17,null,null,null,null,null,null,7580,7580,null,null,null,null,null,null,null,null,null,null,null,null,null,null,null,null,null,null,null,null,null,null,null,null,null,null,null,null,null,null,null,7580,"FCN3100-18-07-2023"]
[{"$f":"IFERROR(VLOOKUP(C175,#REF!,9,FALSE),\"\")","v":""},{"$f":"C175&COUNTIF($C$2:C175,C175)","v":"FCC20601"},"FCC2060",null,null,2,67880,"2023-07-18",17,null,null,null,null,null,null,67880,67880,null,null,null,null,null,null,null,null,null,null,null,null,null,null,null,null,null,null,null,null,null,null,null,null,null,null,null,null,null,null,null,67880,"FCC2060-18-07-2023"]
[{"$f":"IFERROR(VLOOKUP(C176,#REF!,9,FALSE),\"\")","v":""},{"$f":"C176&COUNTIF($C$2:C176,C176)","v":"FCK25201"},"FCK2520",null,null,6,28500,"2023-07-18",17,null,null,null,null,null,null,28500,28500,null,null,null,null,null,null,null,null,null,null,null,null,null,null,null,null,null,null,null,null,null,null,null,null,null,null,null,null,null,null,null,28500,"FCK2520-18-07-2023"]
[{"$f":"IFERROR(VLOOKUP(C177,#REF!,9,FALSE),\"\")","v":""},{"$f":"C177&COUNTIF($C$2:C177,C177)","v":"FCC33501"},"FCC3350",null,null,15,179502,"2023-07-18",17,null,null,null,null,null,null,179502,179502,null,null,null,null,null,null,null,null,null,null,null,null,null,null,null,null,null,null,null,null,null,null,null,null,null,null,null,null,null,null,null,179502,"FCC3350-18-07-2023"]
[{"$f":"IFERROR(VLOOKUP(C178,#REF!,9,FALSE),\"\")","v":""},{"$f":"C178&COUNTIF($C$2:C178,C178)","v":"FCC04501"},"FCC0450",null,null,1,513.70000000000005,"2023-07-18",17,null,null,null,null,null,null,513.70000000000005,513.70000000000005,null,null,null,null,null,null,null,null,null,null,null,null,null,null,null,null,null,null,null,null,null,null,null,null,null,null,null,null,null,null,null,513.70000000000005,"FCC0450-18-07-2023"]
[{"$f":"IFERROR(VLOOKUP(C179,#REF!,9,FALSE),\"\")","v":""},{"$f":"C179&COUNTIF($C$2:C179,C179)","v":"FCS22701"},"FCS2270",null,null,1,20000,"2023-07-19",16,null,null,null,null,null,null,20000,20000,null,null,null,null,null,null,null,null,null,null,null,null,null,null,null,null,null,null,null,null,null,null,null,null,null,null,null,null,null,null,null,20000,"FCS2270-19-07-2023"]
[{"$f":"IFERROR(VLOOKUP(C180,#REF!,9,FALSE),\"\")","v":""},{"$f":"C180&COUNTIF($C$2:C180,C180)","v":"FCS29271"},"FCS2927",null,null,15,177410.23,"2023-07-19",16,null,null,null,null,null,null,177410.23,177410.23,null,null,null,null,null,null,null,null,null,null,null,null,null,null,null,null,null,null,null,null,null,null,null,null,null,null,null,null,null,null,null,177410.23,"FCS2927-19-07-2023"]
[{"$f":"IFERROR(VLOOKUP(C181,#REF!,9,FALSE),\"\")","v":""},{"$f":"C181&COUNTIF($C$2:C181,C181)","v":"FCS29141"},"FCS2914",null,null,8,38213.81,"2023-07-19",16,null,null,null,null,null,null,38213.81,38213.81,null,null,null,null,null,null,null,null,null,null,null,null,null,null,null,null,null,null,null,null,null,null,null,null,null,null,null,null,null,null,null,38213.81,"FCS2914-19-07-2023"]
[{"$f":"IFERROR(VLOOKUP(C182,#REF!,9,FALSE),\"\")","v":""},{"$f":"C182&COUNTIF($C$2:C182,C182)","v":"FCC91711"},"FCC9171",null,null,22,755459.5,"2023-07-19",16,null,null,null,null,null,null,755459.5,755459.5,null,null,null,null,null,null,null,null,null,null,null,null,null,null,null,null,null,null,null,null,null,null,null,null,null,null,null,null,null,null,null,755459.5,"FCC9171-19-07-2023"]
[{"$f":"IFERROR(VLOOKUP(C183,#REF!,9,FALSE),\"\")","v":""},{"$f":"C183&COUNTIF($C$2:C183,C183)","v":"FCU19921"},"FCU1992",null,null,7,150632.85,"2023-07-19",16,null,null,null,null,null,null,150632.85,150632.85,null,null,null,null,null,null,null,null,null,null,null,null,null,null,null,null,null,null,null,null,null,null,null,null,null,null,null,null,null,null,null,150632.85,"FCU1992-19-07-2023"]
[{"$f":"IFERROR(VLOOKUP(C184,#REF!,9,FALSE),\"\")","v":""},{"$f":"C184&COUNTIF($C$2:C184,C184)","v":"FCM27621"},"FCM2762",null,null,4,19782,"2023-07-19",16,null,null,null,null,null,null,19782,19782,null,null,null,null,null,null,null,null,null,null,null,null,null,null,null,null,null,null,null,null,null,null,null,null,null,null,null,null,null,null,null,19782,"FCM2762-19-07-2023"]
[{"$f":"IFERROR(VLOOKUP(C185,#REF!,9,FALSE),\"\")","v":""},{"$f":"C185&COUNTIF($C$2:C185,C185)","v":"FCC28701"},"FCC2870",null,null,1,5661.98,"2023-07-19",16,null,null,null,null,null,null,5661.98,5661.98,null,null,null,null,null,null,null,null,null,null,null,null,null,null,null,null,null,null,null,null,null,null,null,null,null,null,null,null,null,null,null,5661.98,"FCC2870-19-07-2023"]
[{"$f":"IFERROR(VLOOKUP(C186,#REF!,9,FALSE),\"\")","v":""},{"$f":"C186&COUNTIF($C$2:C186,C186)","v":"FCB17601"},"FCB1760",null,null,39,89915.95,"2023-07-19",16,null,null,null,null,null,null,89915.95,89915.95,null,null,null,null,null,null,null,null,null,null,null,null,null,null,null,null,null,null,null,null,null,null,null,null,null,null,null,null,null,null,null,89915.95,"FCB1760-19-07-2023"]
[{"$f":"IFERROR(VLOOKUP(C187,#REF!,9,FALSE),\"\")","v":""},{"$f":"C187&COUNTIF($C$2:C187,C187)","v":"FCC00601"},"FCC0060",null,"advance",12,163636.31,"2023-07-19",16,null,null,null,null,null,null,163636.31,163636.31,null,null,null,null,null,null,null,null,null,null,null,null,null,null,null,null,null,null,null,null,null,null,null,null,null,null,null,null,null,null,null,163636.31,"FCC0060-19-07-2023"]
[{"$f":"IFERROR(VLOOKUP(C188,#REF!,9,FALSE),\"\")","v":""},{"$f":"C188&COUNTIF($C$2:C188,C188)","v":"fcx28021"},"fcx2802",null,null,1,8512.25,"2023-07-19",16,null,null,null,null,null,null,8512.25,8512.25,null,null,null,null,null,null,null,null,null,null,null,null,null,null,null,null,null,null,null,null,null,null,null,null,null,null,null,null,null,null,null,8512.25,"fcx2802-19-07-2023"]
[{"$f":"IFERROR(VLOOKUP(C189,#REF!,9,FALSE),\"\")","v":""},{"$f":"C189&COUNTIF($C$2:C189,C189)","v":"FCC02801"},"FCC0280",null,"advance",66,1410034.41,"2023-07-19",16,null,null,null,null,null,null,1410034.41,1410034.41,null,null,null,null,null,null,null,null,null,null,null,null,null,null,null,null,null,null,null,null,null,null,null,null,null,null,null,null,null,null,null,1410034.41,"FCC0280-19-07-2023"]
[{"$f":"IFERROR(VLOOKUP(C190,#REF!,9,FALSE),\"\")","v":""},{"$f":"C190&COUNTIF($C$2:C190,C190)","v":"FCC03801"},"FCC0380",null,null,25,255784,"2023-07-19",16,null,null,null,null,null,null,255784,255784,null,null,null,null,null,null,null,null,null,null,null,null,null,null,null,null,null,null,null,null,null,null,null,null,null,null,null,null,null,null,null,255784,"FCC0380-19-07-2023"]
[{"$f":"IFERROR(VLOOKUP(C191,#REF!,9,FALSE),\"\")","v":""},{"$f":"C191&COUNTIF($C$2:C191,C191)","v":"FCC00902"},"FCC0090",null,"advance",81,3413636.13,"2023-07-19",16,null,null,null,null,null,null,3413636.13,3413636.13,null,null,null,null,null,null,null,null,null,null,null,null,null,null,null,null,null,null,null,null,null,null,null,null,null,null,null,null,null,null,null,3413636.13,"FCC0090-19-07-2023"]
[{"$f":"IFERROR(VLOOKUP(C192,#REF!,9,FALSE),\"\")","v":""},{"$f":"C192&COUNTIF($C$2:C192,C192)","v":"FCK30801"},"FCK3080",null,null,1,3069.92,"2023-07-24",11,null,null,null,null,null,null,3069.92,3069.92,null,null,null,null,null,null,null,null,null,null,null,null,null,null,null,null,null,null,null,null,null,null,null,null,null,null,null,null,null,null,null,3069.92,"FCK3080-24-07-2023"]
[{"$f":"IFERROR(VLOOKUP(C193,#REF!,9,FALSE),\"\")","v":""},{"$f":"C193&COUNTIF($C$2:C193,C193)","v":"FCK30821"},"FCK3082",null,null,12,78261,"2023-07-24",11,null,null,null,null,null,null,78261,78261,null,null,null,null,null,null,null,null,null,null,null,null,null,null,null,null,null,null,null,null,null,null,null,null,null,null,null,null,null,null,null,78261,{"$f":"CONCATENATE(C193,\"-\",TEXT(H193,\"DD-MM-YYYY\"))","v":"FCK3082-24-07-2023"}]
[{"$f":"IFERROR(VLOOKUP(C194,#REF!,9,FALSE),\"\")","v":""},{"$f":"C194&COUNTIF($C$2:C194,C194)","v":"FCK35501"},"FCK3550",null,null,4,17116.189999999999,"2023-07-24",{"$f":"+TODAY()-H194","v":11},null,null,null,null,null,null,{"$f":"+G194-K194-L194-M194-N194","v":17116.189999999999},{"$f":"+G194-R194-T194-V194-X194-Z194-AB194-AD194-AF194-AH194-AJ194-AL194-AN194-AP194-AT194-AV194","v":17116.189999999999},null,null,null,null,null,null,null,null,null,null,null,null,null,null,null,null,null,null,null,null,null,null,null,null,null,null,null,null,null,null,null,{"$f":"G194-(L194++R194+T194+V194+X194+Z194+AB194+AD194+AF194+AH194+AJ194+AL194+AN194+AP194+AR194)","v":17116.189999999999},"FCK3550-24-07-2023"]
[{"$f":"IFERROR(VLOOKUP(C195,#REF!,9,FALSE),\"\")","v":""},{"$f":"C195&COUNTIF($C$2:C195,C195)","v":"FCC14901"},"FCC1490",null,null,2,23984.13,"2023-07-24",11,null,null,null,null,null,null,23984.13,23984.13,null,null,null,null,null,null,null,null,null,null,null,null,null,null,null,null,null,null,null,null,null,null,null,null,null,null,null,null,null,null,null,23984.13,"FCC1490-24-07-2023"]
[{"$f":"IFERROR(VLOOKUP(C196,#REF!,9,FALSE),\"\")","v":""},{"$f":"C196&COUNTIF($C$2:C196,C196)","v":"FCC33502"},"FCC3350",null,null,13,146770,"2023-07-24",11,null,null,null,null,null,null,146770,146770,null,null,null,null,null,null,null,null,null,null,null,null,null,null,null,null,null,null,null,null,null,null,null,null,null,null,null,null,null,null,null,146770,"FCC3350-24-07-2023"]
[{"$f":"IFERROR(VLOOKUP(C197,#REF!,9,FALSE),\"\")","v":""},{"$f":"C197&COUNTIF($C$2:C197,C197)","v":"FCS29171"},"FCS2917",null,null,13,64746.25,"2023-07-24",11,null,null,null,null,null,null,64746.25,64746.25,null,null,null,null,null,null,null,null,null,null,null,null,null,null,null,null,null,null,null,null,null,null,null,null,null,null,null,null,null,null,null,64746.25,"FCS2917-24-07-2023"]
[{"$f":"IFERROR(VLOOKUP(C198,#REF!,9,FALSE),\"\")","v":""},{"$f":"C198&COUNTIF($C$2:C198,C198)","v":"FCS22601"},"FCS2260",null,null,16,56283.5,"2023-07-24",11,null,null,null,null,null,null,56283.5,56283.5,null,null,null,null,null,null,null,null,null,null,null,null,null,null,null,null,null,null,null,null,null,null,null,null,null,null,null,null,null,null,null,56283.5,"FCS2260-24-07-2023"]
[{"$f":"IFERROR(VLOOKUP(C199,#REF!,9,FALSE),\"\")","v":""},{"$f":"C199&COUNTIF($C$2:C199,C199)","v":"FCC17401"},"FCC1740",null,null,13,123966,"2023-07-24",11,null,null,null,null,null,null,123966,123966,null,null,null,null,null,null,null,null,null,null,null,null,null,null,null,null,null,null,null,null,null,null,null,null,null,null,null,null,null,null,null,123966,"FCC1740-24-07-2023"]
[{"$f":"IFERROR(VLOOKUP(C200,#REF!,9,FALSE),\"\")","v":""},{"$f":"C200&COUNTIF($C$2:C200,C200)","v":"FCK30841"},"FCK3084",null,null,2,17437.88,"2023-07-24",11,null,null,null,null,null,null,17437.88,17437.88,null,null,null,null,null,null,null,null,null,null,null,null,null,null,null,null,null,null,null,null,null,null,null,null,null,null,null,null,null,null,null,17437.88,"FCK3084-24-07-2023"]
[{"$f":"IFERROR(VLOOKUP(C201,#REF!,9,FALSE),\"\")","v":""},{"$f":"C201&COUNTIF($C$2:C201,C201)","v":"FCC29801"},"FCC2980",null,null,29,431674.58,"2023-07-25",10,null,null,null,null,null,null,431674.58,431674.58,null,null,null,null,null,null,null,null,null,null,null,null,null,null,null,null,null,null,null,null,null,null,null,null,null,null,null,null,null,null,null,431674.58,"FCC2980-25-07-2023"]
[{"$f":"IFERROR(VLOOKUP(C202,#REF!,9,FALSE),\"\")","v":""},{"$f":"C202&COUNTIF($C$2:C202,C202)","v":"FCB30802"},"FCB3080",null,null,1,870,"2023-07-25",10,null,null,null,null,null,null,870,870,null,null,null,null,null,null,null,null,null,null,null,null,null,null,null,null,null,null,null,null,null,null,null,null,null,null,null,null,null,null,null,870,"FCB3080-25-07-2023"]
[{"$f":"IFERROR(VLOOKUP(C203,#REF!,9,FALSE),\"\")","v":""},{"$f":"C203&COUNTIF($C$2:C203,C203)","v":"FCF23302"},"FCF2330",null,null,3,10576.52,"2023-07-25",10,null,null,null,null,null,null,10576.52,10576.52,null,null,null,null,null,null,null,null,null,null,null,null,null,null,null,null,null,null,null,null,null,null,null,null,null,null,null,null,null,null,null,10576.52,"FCF2330-25-07-2023"]
[{"$f":"IFERROR(VLOOKUP(C204,#REF!,9,FALSE),\"\")","v":""},{"$f":"C204&COUNTIF($C$2:C204,C204)","v":"FCX32201"},"FCX3220",null,null,4,82102.17,"2023-07-25",10,null,null,null,null,null,null,82102.17,82102.17,null,null,null,null,null,null,null,null,null,null,null,null,null,null,null,null,null,null,null,null,null,null,null,null,null,null,null,null,null,null,null,82102.17,"FCX3220-25-07-2023"]
[{"$f":"IFERROR(VLOOKUP(C205,#REF!,9,FALSE),\"\")","v":""},{"$f":"C205&COUNTIF($C$2:C205,C205)","v":"FCZ18301"},"FCZ1830",null,null,4,15172,"2023-07-25",10,null,null,null,null,null,null,15172,15172,null,null,null,null,null,null,null,null,null,null,null,null,null,null,null,null,null,null,null,null,null,null,null,null,null,null,null,null,null,null,null,15172,"FCZ1830-25-07-2023"]
[{"$f":"IFERROR(VLOOKUP(C206,#REF!,9,FALSE),\"\")","v":""},{"$f":"C206&COUNTIF($C$2:C206,C206)","v":"FCG30911"},"FCG3091",null,null,59,90607.42,"2023-07-25",10,null,null,null,null,null,null,90607.42,90607.42,null,null,null,null,null,null,null,null,null,null,null,null,null,null,null,null,null,null,null,null,null,null,null,null,null,null,null,null,null,null,null,90607.42,"FCG3091-25-07-2023"]
[{"$f":"IFERROR(VLOOKUP(C207,#REF!,9,FALSE),\"\")","v":""},{"$f":"C207&COUNTIF($C$2:C207,C207)","v":"FCX13101"},"FCX1310",null,null,4,13490,"2023-07-25",10,null,null,null,null,null,null,13490,13490,null,null,null,null,null,null,null,null,null,null,null,null,null,null,null,null,null,null,null,null,null,null,null,null,null,null,null,null,null,null,null,13490,"FCX1310-25-07-2023"]
[{"$f":"IFERROR(VLOOKUP(C208,#REF!,9,FALSE),\"\")","v":""},{"$f":"C208&COUNTIF($C$2:C208,C208)","v":"FCC35201"},"FCC3520",null,"advance",32,261994.87,"2023-07-25",10,null,null,null,null,null,null,261994.87,261994.87,null,null,null,null,null,null,null,null,null,null,null,null,null,null,null,null,null,null,null,null,null,null,null,null,null,null,null,null,null,null,null,261994.87,"FCC3520-25-07-2023"]
[{"$f":"IFERROR(VLOOKUP(C209,#REF!,9,FALSE),\"\")","v":""},{"$f":"C209&COUNTIF($C$2:C209,C209)","v":"FCC91921"},"FCC9192",null,null,17,240912.21,"2023-07-25",10,null,null,null,null,null,null,240912.21,240912.21,null,null,null,null,null,null,null,null,null,null,null,null,null,null,null,null,null,null,null,null,null,null,null,null,null,null,null,null,null,null,null,240912.21,"FCC9192-25-07-2023"]
[{"$f":"IFERROR(VLOOKUP(C210,#REF!,9,FALSE),\"\")","v":""},{"$f":"C210&COUNTIF($C$2:C210,C210)","v":"FCC03901"},"FCC0390",null,null,2,13323,"2023-07-25",10,null,null,null,null,null,null,13323,13323,null,null,null,null,null,null,null,null,null,null,null,null,null,null,null,null,null,null,null,null,null,null,null,null,null,null,null,null,null,null,null,13323,"FCC0390-25-07-2023"]
[{"$f":"IFERROR(VLOOKUP(C211,#REF!,9,FALSE),\"\")","v":""},{"$f":"C211&COUNTIF($C$2:C211,C211)","v":"FCC26501"},"FCC2650",null,null,4,45217.5,"2023-07-25",10,null,null,null,null,null,null,45217.5,45217.5,null,null,null,null,null,null,null,null,null,null,null,null,null,null,null,null,null,null,null,null,null,null,null,null,null,null,null,null,null,null,null,45217.5,"FCC2650-25-07-2023"]
[{"$f":"IFERROR(VLOOKUP(C212,#REF!,9,FALSE),\"\")","v":""},{"$f":"C212&COUNTIF($C$2:C212,C212)","v":"FCE01011"},"FCE0101",null,null,3,48926.9,"2023-07-25",10,null,null,null,null,null,null,48926.9,48926.9,null,null,null,null,null,null,null,null,null,null,null,null,null,null,null,null,null,null,null,null,null,null,null,null,null,null,null,null,null,null,null,48926.9,"FCE0101-25-07-2023"]
[{"$f":"IFERROR(VLOOKUP(C213,#REF!,9,FALSE),\"\")","v":""},{"$f":"C213&COUNTIF($C$2:C213,C213)","v":"FCA19101"},"FCA1910",null,null,5,10605.08,"2023-07-25",10,null,null,null,null,null,null,10605.08,10605.08,null,null,null,null,null,null,null,null,null,null,null,null,null,null,null,null,null,null,null,null,null,null,null,null,null,null,null,null,null,null,null,10605.08,"FCA1910-25-07-2023"]
[{"$f":"IFERROR(VLOOKUP(C214,#REF!,9,FALSE),\"\")","v":""},{"$f":"C214&COUNTIF($C$2:C214,C214)","v":"FCC20901"},"FCC2090",null,"advance",6,37410.51,"2023-07-25",10,null,null,null,null,null,null,37410.51,37410.51,null,null,null,null,null,null,null,null,null,null,null,null,null,null,null,null,null,null,null,null,null,null,null,null,null,null,null,null,null,null,null,37410.51,"FCC2090-25-07-2023"]
[{"$f":"IFERROR(VLOOKUP(C215,#REF!,9,FALSE),\"\")","v":""},{"$f":"C215&COUNTIF($C$2:C215,C215)","v":"FCF26121"},"FCF2612",null,null,1,1200,"2023-07-26",9,null,null,null,null,null,null,1200,1200,null,null,null,null,null,null,null,null,null,null,null,null,null,null,null,null,null,null,null,null,null,null,null,null,null,null,null,null,null,null,null,1200,"FCF2612-26-07-2023"]
[{"$f":"IFERROR(VLOOKUP(C216,#REF!,9,FALSE),\"\")","v":""},{"$f":"C216&COUNTIF($C$2:C216,C216)","v":"FCF26131"},"FCF2613",null,null,1,5483.6,"2023-07-26",9,null,null,null,null,null,null,5483.6,5483.6,null,null,null,null,null,null,null,null,null,null,null,null,null,null,null,null,null,null,null,null,null,null,null,null,null,null,null,null,null,null,null,5483.6,"FCF2613-26-07-2023"]
[{"$f":"IFERROR(VLOOKUP(C217,#REF!,9,FALSE),\"\")","v":""},{"$f":"C217&COUNTIF($C$2:C217,C217)","v":"FCE33902"},"FCE3390",null,null,3,6837,"2023-07-26",9,null,null,null,null,null,null,6837,6837,null,null,null,null,null,null,null,null,null,null,null,null,null,null,null,null,null,null,null,null,null,null,null,null,null,null,null,null,null,null,null,6837,"FCE3390-26-07-2023"]
[{"$f":"IFERROR(VLOOKUP(C218,#REF!,9,FALSE),\"\")","v":""},{"$f":"C218&COUNTIF($C$2:C218,C218)","v":"FCC06401"},"FCC0640",null,null,5,22773.03,"2023-07-26",9,null,null,null,null,null,null,22773.03,22773.03,null,null,null,null,null,null,null,null,null,null,null,null,null,null,null,null,null,null,null,null,null,null,null,null,null,null,null,null,null,null,null,22773.03,"FCC0640-26-07-2023"]
[{"$f":"IFERROR(VLOOKUP(C219,#REF!,9,FALSE),\"\")","v":""},{"$f":"C219&COUNTIF($C$2:C219,C219)","v":"FCC05801"},"FCC0580",null,"advance",74,1641122,"2023-07-26",9,null,null,null,null,null,null,1641122,1641122,null,null,null,null,null,null,null,null,null,null,null,null,null,null,null,null,null,null,null,null,null,null,null,null,null,null,null,null,null,null,null,1641122,"FCC0580-26-07-2023"]
[{"$f":"IFERROR(VLOOKUP(C220,#REF!,9,FALSE),\"\")","v":""},{"$f":"C220&COUNTIF($C$2:C220,C220)","v":"FCY13501"},"FCY1350",null,null,16,135317.37,"2023-07-26",9,null,null,null,null,null,null,135317.37,135317.37,null,null,null,null,null,null,null,null,null,null,null,null,null,null,null,null,null,null,null,null,null,null,null,null,null,null,null,null,null,null,null,135317.37,"FCY1350-26-07-2023"]
[{"$f":"IFERROR(VLOOKUP(C221,#REF!,9,FALSE),\"\")","v":""},{"$f":"C221&COUNTIF($C$2:C221,C221)","v":"FCZ27291"},"FCZ2729",null,null,9,74090.22,"2023-07-26",9,null,null,null,null,null,null,74090.22,74090.22,null,null,null,null,null,null,null,null,null,null,null,null,null,null,null,null,null,null,null,null,null,null,null,null,null,null,null,null,null,null,null,74090.22,"FCZ2729-26-07-2023"]
[{"$f":"IFERROR(VLOOKUP(C222,#REF!,9,FALSE),\"\")","v":""},{"$f":"C222&COUNTIF($C$2:C222,C222)","v":"FCF33301"},"FCF3330",null,"advance",10,180260.63,"2023-07-26",9,null,null,null,null,null,null,180260.63,180260.63,null,null,null,null,null,null,null,null,null,null,null,null,null,null,null,null,null,null,null,null,null,null,null,null,null,null,null,null,null,null,null,180260.63,"FCF3330-26-07-2023"]
[{"$f":"IFERROR(VLOOKUP(C223,#REF!,9,FALSE),\"\")","v":""},{"$f":"C223&COUNTIF($C$2:C223,C223)","v":"FCC33401"},"FCC3340",null,null,5,29838.73,"2023-07-26",9,null,null,null,null,null,null,29838.73,29838.73,null,null,null,null,null,null,null,null,null,null,null,null,null,null,null,null,null,null,null,null,null,null,null,null,null,null,null,null,null,null,null,29838.73,"FCC3340-26-07-2023"]
[{"$f":"IFERROR(VLOOKUP(C224,#REF!,9,FALSE),\"\")","v":""},{"$f":"C224&COUNTIF($C$2:C224,C224)","v":"FCX18301"},"FCX1830",null,null,12,119261.19,"2023-07-26",9,null,null,null,null,null,null,119261.19,119261.19,null,null,null,null,null,null,null,null,null,null,null,null,null,null,null,null,null,null,null,null,null,null,null,null,null,null,null,null,null,null,null,119261.19,"FCX1830-26-07-2023"]
[{"$f":"IFERROR(VLOOKUP(C225,#REF!,9,FALSE),\"\")","v":""},{"$f":"C225&COUNTIF($C$2:C225,C225)","v":"FCU19901"},"FCU1990",null,null,14,93095.95,"2023-07-26",9,null,null,null,null,null,null,93095.95,93095.95,null,null,null,null,null,null,null,null,null,null,null,null,null,null,null,null,null,null,null,null,null,null,null,null,null,null,null,null,null,null,null,93095.95,"FCU1990-26-07-2023"]
[{"$f":"IFERROR(VLOOKUP(C226,#REF!,9,FALSE),\"\")","v":""},{"$f":"C226&COUNTIF($C$2:C226,C226)","v":"FCG30921"},"FCG3092",null,null,8,46490.14,"2023-07-26",9,null,null,null,null,null,null,46490.14,46490.14,null,null,null,null,null,null,null,null,null,null,null,null,null,null,null,null,null,null,null,null,null,null,null,null,null,null,null,null,null,null,null,46490.14,"FCG3092-26-07-2023"]
[{"$f":"IFERROR(VLOOKUP(C227,#REF!,9,FALSE),\"\")","v":""},{"$f":"C227&COUNTIF($C$2:C227,C227)","v":"fcc91951"},"fcc9195",null,null,8,31549.5,"2023-07-26",9,null,null,null,null,null,null,31549.5,31549.5,null,null,null,null,null,null,null,null,null,null,null,null,null,null,null,null,null,null,null,null,null,null,null,null,null,null,null,null,null,null,null,31549.5,"fcc9195-26-07-2023"]
[{"$f":"IFERROR(VLOOKUP(C228,#REF!,9,FALSE),\"\")","v":""},{"$f":"C228&COUNTIF($C$2:C228,C228)","v":"FCC01402"},"FCC0140",null,null,12,257031.65,"2023-07-26",9,null,null,null,null,null,null,257031.65,257031.65,null,null,null,null,null,null,null,null,null,null,null,null,null,null,null,null,null,null,null,null,null,null,null,null,null,null,null,null,null,null,null,257031.65,"FCC0140-26-07-2023"]
[{"$f":"IFERROR(VLOOKUP(C229,#REF!,9,FALSE),\"\")","v":""},{"$f":"C229&COUNTIF($C$2:C229,C229)","v":"FCV11701"},"FCV1170",null,null,11,37849.519999999997,"2023-07-27",8,null,null,null,null,null,null,37849.519999999997,37849.519999999997,null,null,null,null,null,null,null,null,null,null,null,null,null,null,null,null,null,null,null,null,null,null,null,null,null,null,null,null,null,null,null,37849.519999999997,"FCV1170-27-07-2023"]
[{"$f":"IFERROR(VLOOKUP(C230,#REF!,9,FALSE),\"\")","v":""},{"$f":"C230&COUNTIF($C$2:C230,C230)","v":"FCC91831"},"FCC9183",null,null,4,94217.25,"2023-07-27",8,null,null,null,null,null,null,94217.25,94217.25,null,null,null,null,null,null,null,null,null,null,null,null,null,null,null,null,null,null,null,null,null,null,null,null,null,null,null,null,null,null,null,94217.25,"FCC9183-27-07-2023"]
[{"$f":"IFERROR(VLOOKUP(C231,#REF!,9,FALSE),\"\")","v":""},{"$f":"C231&COUNTIF($C$2:C231,C231)","v":"FCC03201"},"FCC0320",null,null,9,330229.75,"2023-07-27",8,null,null,null,null,null,null,330229.75,330229.75,null,null,null,null,null,null,null,null,null,null,null,null,null,null,null,null,null,null,null,null,null,null,null,null,null,null,null,null,null,null,null,330229.75,"FCC0320-27-07-2023"]
[{"$f":"IFERROR(VLOOKUP(C232,#REF!,9,FALSE),\"\")","v":""},{"$f":"C232&COUNTIF($C$2:C232,C232)","v":"FCZ18101"},"FCZ1810",null,null,33,36821.199999999997,"2023-07-27",8,null,null,null,null,null,null,36821.199999999997,36821.199999999997,null,null,null,null,null,null,null,null,null,null,null,null,null,null,null,null,null,null,null,null,null,null,null,null,null,null,null,null,null,null,null,36821.199999999997,"FCZ1810-27-07-2023"]
[{"$f":"IFERROR(VLOOKUP(C233,#REF!,9,FALSE),\"\")","v":""},{"$f":"C233&COUNTIF($C$2:C233,C233)","v":"FCC02701"},"FCC0270",null,"advance",23,67474,"2023-07-27",8,null,null,null,null,null,null,67474,67474,null,null,null,null,null,null,null,null,null,null,null,null,null,null,null,null,null,null,null,null,null,null,null,null,null,null,null,null,null,null,null,67474,"FCC0270-27-07-2023"]
[{"$f":"IFERROR(VLOOKUP(C234,#REF!,9,FALSE),\"\")","v":""},{"$f":"C234&COUNTIF($C$2:C234,C234)","v":"FCC91391"},"FCC9139",null,null,2,2541.5,"2023-07-30",5,null,null,null,null,null,null,2541.5,2541.5,null,null,null,null,null,null,null,null,null,null,null,null,null,null,null,null,null,null,null,null,null,null,null,null,null,null,null,null,null,null,null,2541.5,"FCC9139-30-07-2023"]
[{"$f":"IFERROR(VLOOKUP(C235,#REF!,9,FALSE),\"\")","v":""},{"$f":"C235&COUNTIF($C$2:C235,C235)","v":"FCI07301"},"FCI0730",null,null,1,11150,"2023-07-30",5,null,null,null,null,null,null,11150,11150,null,null,null,null,null,null,null,null,null,null,null,null,null,null,null,null,null,null,null,null,null,null,null,null,null,null,null,null,null,null,null,11150,"FCI0730-30-07-2023"]
[{"$f":"IFERROR(VLOOKUP(C236,#REF!,9,FALSE),\"\")","v":""},{"$f":"C236&COUNTIF($C$2:C236,C236)","v":"FCC29501"},"FCC2950",null,null,21,163195,"2023-07-30",5,null,null,null,null,null,null,163195,163195,null,null,null,null,null,null,null,null,null,null,null,null,null,null,null,null,null,null,null,null,null,null,null,null,null,null,null,null,null,null,null,163195,"FCC2950-30-07-2023"]
[{"$f":"IFERROR(VLOOKUP(C237,#REF!,9,FALSE),\"\")","v":""},{"$f":"C237&COUNTIF($C$2:C237,C237)","v":"FCC91381"},"FCC9138",null,null,3,22803,"2023-07-30",5,null,null,null,null,null,null,22803,22803,null,null,null,null,null,null,null,null,null,null,null,null,null,null,null,null,null,null,null,null,null,null,null,null,null,null,null,null,null,null,null,22803,"FCC9138-30-07-2023"]
[{"$f":"IFERROR(VLOOKUP(C238,#REF!,9,FALSE),\"\")","v":""},{"$f":"C238&COUNTIF($C$2:C238,C238)","v":"FCX12001"},"FCX1200",null,null,19,403273.79,"2023-07-30",5,null,null,null,null,null,null,403273.79,403273.79,null,null,null,null,null,null,null,null,null,null,null,null,null,null,null,null,null,null,null,null,null,null,null,null,null,null,null,null,null,null,null,403273.79,"FCX1200-30-07-2023"]
[{"$f":"IFERROR(VLOOKUP(C239,#REF!,9,FALSE),\"\")","v":""},{"$f":"C239&COUNTIF($C$2:C239,C239)","v":"FCC02301"},"FCC0230",null,null,11,73576.55,"2023-07-30",5,null,null,null,null,null,null,73576.55,73576.55,null,null,null,null,null,null,null,null,null,null,null,null,null,null,null,null,null,null,null,null,null,null,null,null,null,null,null,null,null,null,null,73576.55,"FCC0230-30-07-2023"]
[{"$f":"IFERROR(VLOOKUP(C240,#REF!,9,FALSE),\"\")","v":""},{"$f":"C240&COUNTIF($C$2:C240,C240)","v":"FCC04102"},"FCC0410",null,null,5,19889,"2023-07-31",4,null,null,null,null,null,null,19889,19889,null,null,null,null,null,null,null,null,null,null,null,null,null,null,null,null,null,null,null,null,null,null,null,null,null,null,null,null,null,null,null,19889,"FCC0410-31-07-2023"]
[{"$f":"IFERROR(VLOOKUP(C241,#REF!,9,FALSE),\"\")","v":""},{"$f":"C241&COUNTIF($C$2:C241,C241)","v":"FCK30832"},"FCK3083",null,null,2,28800,"2023-07-31",4,null,null,null,null,null,null,28800,28800,null,null,null,null,null,null,null,null,null,null,null,null,null,null,null,null,null,null,null,null,null,null,null,null,null,null,null,null,null,null,null,28800,"FCK3083-31-07-2023"]
[{"$f":"IFERROR(VLOOKUP(C242,#REF!,9,FALSE),\"\")","v":""},{"$f":"C242&COUNTIF($C$2:C242,C242)","v":"FCF26161"},"FCF2616",null,null,7,34318.199999999997,"2023-07-31",4,null,null,null,null,null,null,34318.199999999997,34318.199999999997,null,null,null,null,null,null,null,null,null,null,null,null,null,null,null,null,null,null,null,null,null,null,null,null,null,null,null,null,null,null,null,34318.199999999997,"FCF2616-31-07-2023"]
[{"$f":"IFERROR(VLOOKUP(C243,#REF!,9,FALSE),\"\")","v":""},{"$f":"C243&COUNTIF($C$2:C243,C243)","v":"FCC91911"},"FCC9191",null,null,5,15811.25,"2023-07-31",4,null,null,null,null,null,null,15811.25,15811.25,null,null,null,null,null,null,null,null,null,null,null,null,null,null,null,null,null,null,null,null,null,null,null,null,null,null,null,null,null,null,null,15811.25,"FCC9191-31-07-2023"]
[{"$f":"IFERROR(VLOOKUP(C244,#REF!,9,FALSE),\"\")","v":""},{"$f":"C244&COUNTIF($C$2:C244,C244)","v":"FCX27991"},"FCX2799",null,null,11,329766.56,"2023-07-31",{"$f":"+TODAY()-H244","v":4},null,null,null,null,null,null,329766.56,329766.56,null,null,null,null,null,null,null,null,null,null,null,null,null,null,null,null,null,null,null,null,null,null,null,null,null,null,null,null,null,null,null,{"$f":"G244-(L244++R244+T244+V244+X244+Z244+AB244+AD244+AF244+AH244+AJ244+AL244+AN244+AP244+AR244)","v":329766.56},"FCX2799-31-07-2023"]
[null,null,null,null,null,null,{"$f":"SUM(G2:G244)","v":80901108.890000001},null,null,null,null,{"$f":"SUM(L2:L244)","v":23193.26999999999},null,null,null,null,null,{"$f":"SUM(R2:R244)","v":0},null,{"$f":"SUM(T2:T244)","v":0},null,{"$f":"SUM(V2:V244)","v":0},null,{"$f":"SUM(X2:X244)","v":0},null,{"$f":"SUM(Z2:Z244)","v":0},null,{"$f":"SUM(AB2:AB244)","v":0},null,{"$f":"SUM(AD2:AD244)","v":0},null,{"$f":"SUM(AF2:AF244)","v":0},null,{"$f":"SUM(AH2:AH244)","v":0},null,{"$f":"SUM(AJ2:AJ244)","v":0},null,{"$f":"SUM(AL2:AL244)","v":0},null,{"$f":"SUM(AN2:AN244)","v":0},null,{"$f":"SUM(AP2:AP244)","v":0},null,{"$f":"SUM(AR2:AR244)","v":0},null,{"$f":"SUM(AT2:AT244)","v":0},null,{"$f":"SUM(AV2:AV244)","v":0},0]
[]
[]
[]
[]
[]
[null,null,"Total sumb",null,null,null,{"$f":"D251-D255","v":0}]
[null,null,"Total Paid"]
[null,null,"Total Rejected",null,null,null,{"$f":"D252+G251","v":0}]
[null,null,"Total Tax"]
[null,null,"Total Paid - Rejecteed - Tax"]

{"sheet":"suspended contract hospital","index":4,"n_rows":26,"n_cols":3,"rows_kept":26,"cut":false,"hidden":true,"merged":[]}
["Code","Name","Effective Date"]
["FCC9161","Islamic Medical Association - Hawamdya Hospital ","2022-02-01"]
["FCH3030","PORT GHALB HOSPITAL                               ","2022-02-01"]
["FCM2760","EL GEZERA INTERNATIONAL HOSPITAL -  EL SALLAB     ","2022-02-01"]
["FCM2760","EL GEZERA INTERNATIONAL HOSPITAL -  EL SALLAB     ","2022-02-01"]
["FCC9157","Asfour medical center                             ","2022-03-01"]
["FCC9171","NEUROESPITALIA HOSPITAL","2022-03-01"]
["FCQ0980","SAN MARY CHARITY SP. HOSPITAL                     ","2022-03-01"]
["FCS2340","EL GALAL HOSPITAL                                 ","2022-03-01"]
["FCC0140","ST. PETER INT'L HOSPITAL                          ","2022-03-01"]
["FCC0480","Al Hayat Medical Center                           ","2022-03-01"]
["FCC9157","Asfour medical center                             ","2022-03-01"]
["FCC9171","Neuro Espitalia Hospital                          ","2022-03-01"]
["FCQ0980","SAN MARY CHARITY SP. HOSPITAL                     ","2022-03-01"]
["FCS2340","EL GALAL HOSPITAL                                 ","2022-03-01"]
["FCX3480","SEMOHA PEDIATRIC CENTER                           ","2022-03-01"]
["FCK3078","AL HAYAA AL GADIDA HOSPITAL                       ","2022-04-01"]
["FCD2430","EL SHEROUK HOSPITALL                              ","2022-04-01"]
["FCK2410","EL FAYOUMY HOSPITAL                               ","2022-04-01"]
["FCC2870","Medical Planet Hospital","2022-04-01"]
["FCK3078","AL HAYAA AL GADIDA HOSPITAL                       ","2022-04-01"]
["FCC0120","NOZHA INTERNATIONAL HOSPITAL                      ","2022-05-01"]
["FCN3370","Dorra Hospital - Mahalla","2022-05-01"]
["FCC2980","MISR UNIVERSITY FOR SCIENCE & TECHNOLOGY","2022-05-01"]
["FCD3050","DAR EL HAYAH HOSPITAL                             ","2022-06-01"]
["FCX2560","EL BADRAWY HOSPITAL                               ","2022-06-01"]

{"sheet":"Sheet1","index":5,"n_rows":23,"n_cols":14,"rows_kept":23,"cut":false,"hidden":false,"merged":[]}
[]
[1226212,703.9,"VNX6013","ANDALUSIA AL SHALALAT PH armacy",null,"2023-06-15",null,0,"PHX6013",null,0,null,0,"PHX6013-15-06-2023"]
[1226214,213769.41,"VNC3380","MAGHRABI HOSPITALS AND C NETARS COMPANY",null,"2023-06-19",null,6611.39,"FCC3380",null,"001144609007                            ",null,1,"FCC3380-19-06-2023"]
[1226215,8062.64,"VNJ3172","ELTADAWI HOUSE FOR MEDIC al and Sports Investment",null,"2023-06-12",null,249.36,"FCJ3172",null,"004980880001                            ",null,1,"FCJ3172-12-06-2023"]
[1226216,2587.5,"VNQ3440","RED RESENT HOSPITAL - QE NA",null,"2023-03-26",null,0,"FCQ3440",null,"                                        ",null,1,"FCQ3440-26-03-2023"]
[1226217,81016.72,"VNS2927","HAYATT PALACE HOSPITAL ",null,"2023-05-21",null,2505.69,"FCS2927",null,"4453070479109200025                     ",null,1,"FCS2927-21-05-2023"]
[1226218,155964.37,"VNC0060","AL MOKATTAM SPECIALIZEDH OSP.",null,"2023-05-18",null,4823.93,"FCC0060",null,0,null,0,"FCC0060-18-05-2023"]
[1226219,2369.6999999999998,"VNC0130","GANZOURI SPECIALIZED HOS PIT",null,"2023-03-14",null,0,"FCC0130",null,0,null,0,"FCC0130-14-03-2023"]
[1226220,34845.81,"VNC0640","AL SHROUK HOSPITAL ",null,"2023-06-19",null,1077.69,"FCC0640",null,"                                        ",null,0,"FCC0640-19-06-2023"]
[1226221,19475,"VNC1780","EGYHEART CENTER ",null,"2023-06-22",null,602.36,"FCC1780",null,"0723070973461801016                     ",null,0,"FCC1780-22-06-2023"]
[1226222,3931.41,"VNC2200","DURRAH SPECIALIZED EYE C ENTER",null,"2023-07-04",null,121.59,"FCC2200",null,"                                        ",null,0,"FCC2200-04-07-2023"]
[1226223,528.67999999999995,"VNC2880","EL OBOUR FOR MEDICAL AND EDUCATION SERVICE",null,"2023-05-11",null,16.350000000000001,"FCC2880",null,"100022179351                            ",null,0,"FCC2880-11-05-2023"]
[1226224,169352.11,"VNC3380","MAGHRABI HOSPITALS AND C NETARS COMPANY",null,"2023-06-19",null,5237.6899999999996,"FCC3380",null,"001144609007                            ",null,0,"FCC3380-19-06-2023"]
[1226225,494.7,"VNC9162","CAIRO WEST FOR MEDICAL S ERVICES",null,"2023-03-06",null,15.3,"FCC9162",null,0,null,0,"FCC9162-06-03-2023"]
[1226226,5188.04,"VNC9169","EGYPTIAN COMPANY FOR SPE cialized Medical Service",null,"2023-06-19",null,160.46,"FCC9169",null,"0002165698001                           ",null,0,"FCC9169-19-06-2023"]
[1226227,15529.22,"VNC9192","NILE LIFE FOR MEDICAL PR ojects Management",null,"2023-06-25",null,480.3,"FCC9192",null,"100042558488                            ",null,0,"FCC9192-25-06-2023"]
[1226228,57343.81,"VNE0101","CONCORD SPECIALIZED HOSP ital",null,"2023-06-21",null,1773.75,"FCE0101",null,"100032508485                            ",null,0,"FCE0101-21-06-2023"]
[1226229,4730.79,"VNK3550","EBSAR FOR MEDICAL SERVIC ES",null,"2023-06-25",null,146.21,"FCK3550",null,"144007934001                            ",null,0,"FCK3550-25-06-2023"]
[1226230,1998.8,"VNP3281","ATAA SPECIALIZED HOSPITA L",null,"2023-03-08",null,0,"FCP3281",null,"100029466542                            ",null,0,"FCP3281-08-03-2023"]
[1226231,2930.64,"VNS2910","AL FARDOUS EYE HOSPITAL ",null,"2023-06-25",null,90.61,"FCS2910",null,"                                        ",null,0,"FCS2910-25-06-2023"]
[1226232,2313937.9300000002,"VNX1290","ANDALUSIA ALSHALALAT HOS pital",null,"2023-06-11",null,0,"FCX1290",null,0,null,0,"FCX1290-11-06-2023"]
[1226233,94285.22,"VNX1830","OQBA IBN NAFIE HOSPITAL ",null,"2023-06-25",null,2915.78,"FCX1830",null,0,null,0,"FCX1830-25-06-2023"]
[1226234,12952.96,"VNZ1830","AL CANAL INTERNATIONALHO SPITAL",null,"2023-06-26",null,400.54,"FCZ1830",null,"2097160473010017                        ",null,0,"FCZ1830-26-06-2023"]

{"sheet":"pos","index":6,"n_rows":96,"n_cols":21,"rows_kept":96,"cut":false,"hidden":false,"merged":[]}
["Adjuster","UB/HCFA","Provider Code","Vendor Code","Vendor Type","Provider name","In/Out","Date received","Batch no from","Batch no to","claim no from","claim no to","Net Requested","Batch review amount","Total Deds","Total H.H","Pending","Notes","Gulf","Underwriting","Column1"]
[null,null,"FCC1410","VNC1410","ppo",null,"IN","2023-06-11",null,null,null,null,586264.38,553260,1551.38,null,31453,null,null,null,{"$f":"CONCATENATE(Table2[[#This Row],[Provider Code]],\"-\",TEXT(Table2[[#This Row],[Date received]],\"DD-MM-YYYY\"))","v":"FCC1410-11-06-2023"}]
[null,null,"FCC3380","VNC3380","ppo",null,"IN","2023-06-19",null,null,null,null,237061,214169,3,null,22889,null,null,null,{"$f":"CONCATENATE(Table2[[#This Row],[Provider Code]],\"-\",TEXT(Table2[[#This Row],[Date received]],\"DD-MM-YYYY\"))","v":"FCC3380-19-06-2023"}]
[null,null,"FCJ3172","Vnj3172","ppo",null,"IN","2023-06-12",null,null,null,null,10811,8312,"                        -  ",null,2499,null,null,null,{"$f":"CONCATENATE(Table2[[#This Row],[Provider Code]],\"-\",TEXT(Table2[[#This Row],[Date received]],\"DD-MM-YYYY\"))","v":"FCJ3172-12-06-2023"}]
[null,null,"fcq3440","VNQ3440","ppo",null,"IN","2023-03-26",null,null,null,null,10153,8323,1830,null,null,null,null,null,{"$f":"CONCATENATE(Table2[[#This Row],[Provider Code]],\"-\",TEXT(Table2[[#This Row],[Date received]],\"DD-MM-YYYY\"))","v":"fcq3440-26-03-2023"}]
[null,null,"fcc9188","VNC9188","ppo",null,"in","2023-05-23",null,null,null,null,397506.05,314599.95,102.06,null,82804.039999999994,null,null,null,{"$f":"CONCATENATE(Table2[[#This Row],[Provider Code]],\"-\",TEXT(Table2[[#This Row],[Date received]],\"DD-MM-YYYY\"))","v":"fcc9188-23-05-2023"}]
[null,null,"fcs2927","VNS2927","ppo",null,"in","2023-05-21",null,null,null,null,95426.12,95426.11,0.01,null,null,null,null,null,{"$f":"CONCATENATE(Table2[[#This Row],[Provider Code]],\"-\",TEXT(Table2[[#This Row],[Date received]],\"DD-MM-YYYY\"))","v":"fcs2927-21-05-2023"}]
[null,null,null,null,null,null,null,null,null,null,null,null,null,null,null,null,null,null,null,null,{"$f":"CONCATENATE(Table2[[#This Row],[Provider Code]],\"-\",TEXT(Table2[[#This Row],[Date received]],\"DD-MM-YYYY\"))","v":"-00-01-1900"}]
[null,null,null,null,null,null,null,null,null,null,null,null,null,null,null,null,null,null,null,null,{"$f":"CONCATENATE(Table2[[#This Row],[Provider Code]],\"-\",TEXT(Table2[[#This Row],[Date received]],\"DD-MM-YYYY\"))","v":"-00-01-1900"}]
[null,null,null,null,null,null,null,null,null,null,null,null,null,null,null,null,null,null,null,null,{"$f":"CONCATENATE(Table2[[#This Row],[Provider Code]],\"-\",TEXT(Table2[[#This Row],[Date received]],\"DD-MM-YYYY\"))","v":"-00-01-1900"}]
[null,null,null,null,null,null,null,null,null,null,null,null,null,null,null,null,null,null,null,null,{"$f":"CONCATENATE(Table2[[#This Row],[Provider Code]],\"-\",TEXT(Table2[[#This Row],[Date received]],\"DD-MM-YYYY\"))","v":"-00-01-1900"}]
[null,null,null,null,null,null,null,null,null,null,null,null,null,null,null,null,null,null,null,null,{"$f":"CONCATENATE(Table2[[#This Row],[Provider Code]],\"-\",TEXT(Table2[[#This Row],[Date received]],\"DD-MM-YYYY\"))","v":"-00-01-1900"}]
[null,null,null,null,null,null,null,null,null,null,null,null,null,null,null,null,null,null,null,null,{"$f":"CONCATENATE(Table2[[#This Row],[Provider Code]],\"-\",TEXT(Table2[[#This Row],[Date received]],\"DD-MM-YYYY\"))","v":"-00-01-1900"}]
[null,null,null,null,null,null,null,null,null,null,null,null,null,null,null,null,null,null,null,null,{"$f":"CONCATENATE(Table2[[#This Row],[Provider Code]],\"-\",TEXT(Table2[[#This Row],[Date received]],\"DD-MM-YYYY\"))","v":"-00-01-1900"}]
[null,null,null,null,null,null,null,null,null,null,null,null,null,null,null,null,null,null,null,null,{"$f":"CONCATENATE(Table2[[#This Row],[Provider Code]],\"-\",TEXT(Table2[[#This Row],[Date received]],\"DD-MM-YYYY\"))","v":"-00-01-1900"}]
[null,null,null,null,null,null,null,null,null,null,null,null,null,null,null,null,null,null,null,null,{"$f":"CONCATENATE(Table2[[#This Row],[Provider Code]],\"-\",TEXT(Table2[[#This Row],[Date received]],\"DD-MM-YYYY\"))","v":"-00-01-1900"}]
[null,null,null,null,null,null,null,null,null,null,null,null,null,null,null,null,null,null,null,null,{"$f":"CONCATENATE(Table2[[#This Row],[Provider Code]],\"-\",TEXT(Table2[[#This Row],[Date received]],\"DD-MM-YYYY\"))","v":"-00-01-1900"}]
[null,null,null,null,null,null,null,null,null,null,null,null,null,null,null,null,null,null,null,null,{"$f":"CONCATENATE(Table2[[#This Row],[Provider Code]],\"-\",TEXT(Table2[[#This Row],[Date received]],\"DD-MM-YYYY\"))","v":"-00-01-1900"}]
[null,null,null,null,null,null,null,null,null,null,null,null,null,null,null,null,null,null,null,null,{"$f":"CONCATENATE(Table2[[#This Row],[Provider Code]],\"-\",TEXT(Table2[[#This Row],[Date received]],\"DD-MM-YYYY\"))","v":"-00-01-1900"}]
[null,null,null,null,null,null,null,null,null,null,null,null,null,null,null,null,null,null,null,null,{"$f":"CONCATENATE(Table2[[#This Row],[Provider Code]],\"-\",TEXT(Table2[[#This Row],[Date received]],\"DD-MM-YYYY\"))","v":"-00-01-1900"}]
[null,null,null,null,null,null,null,null,null,null,null,null,null,null,null,null,null,null,null,null,{"$f":"CONCATENATE(Table2[[#This Row],[Provider Code]],\"-\",TEXT(Table2[[#This Row],[Date received]],\"DD-MM-YYYY\"))","v":"-00-01-1900"}]
[null,null,null,null,null,null,null,null,null,null,null,null,null,null,null,null,null,null,null,null,{"$f":"CONCATENATE(Table2[[#This Row],[Provider Code]],\"-\",TEXT(Table2[[#This Row],[Date received]],\"DD-MM-YYYY\"))","v":"-00-01-1900"}]
[null,null,null,null,null,null,null,null,null,null,null,null,null,null,null,null,null,null,null,null,{"$f":"CONCATENATE(Table2[[#This Row],[Provider Code]],\"-\",TEXT(Table2[[#This Row],[Date received]],\"DD-MM-YYYY\"))","v":"-00-01-1900"}]
[null,null,null,null,null,null,null,null,null,null,null,null,null,null,null,null,null,null,null,null,{"$f":"CONCATENATE(Table2[[#This Row],[Provider Code]],\"-\",TEXT(Table2[[#This Row],[Date received]],\"DD-MM-YYYY\"))","v":"-00-01-1900"}]
[null,null,null,null,null,null,null,null,null,null,null,null,null,null,null,null,null,null,null,null,{"$f":"CONCATENATE(Table2[[#This Row],[Provider Code]],\"-\",TEXT(Table2[[#This Row],[Date received]],\"DD-MM-YYYY\"))","v":"-00-01-1900"}]
[null,null,null,null,null,null,null,null,null,null,null,null,null,null,null,null,null,null,null,null,{"$f":"CONCATENATE(Table2[[#This Row],[Provider Code]],\"-\",TEXT(Table2[[#This Row],[Date received]],\"DD-MM-YYYY\"))","v":"-00-01-1900"}]
[null,null,null,null,null,null,null,null,null,null,null,null,null,null,null,null,null,null,null,null,{"$f":"CONCATENATE(Table2[[#This Row],[Provider Code]],\"-\",TEXT(Table2[[#This Row],[Date received]],\"DD-MM-YYYY\"))","v":"-00-01-1900"}]
[null,null,null,null,null,null,null,null,null,null,null,null,null,null,null,null,null,null,null,null,{"$f":"CONCATENATE(Table2[[#This Row],[Provider Code]],\"-\",TEXT(Table2[[#This Row],[Date received]],\"DD-MM-YYYY\"))","v":"-00-01-1900"}]
[null,null,null,null,null,null,null,null,null,null,null,null,null,null,null,null,null,null,null,null,{"$f":"CONCATENATE(Table2[[#This Row],[Provider Code]],\"-\",TEXT(Table2[[#This Row],[Date received]],\"DD-MM-YYYY\"))","v":"-00-01-1900"}]
[null,null,null,null,null,null,null,null,null,null,null,null,null,null,null,null,null,null,null,null,{"$f":"CONCATENATE(Table2[[#This Row],[Provider Code]],\"-\",TEXT(Table2[[#This Row],[Date received]],\"DD-MM-YYYY\"))","v":"-00-01-1900"}]
[null,null,null,null,null,null,null,null,null,null,null,null,null,null,null,null,null,null,null,null,{"$f":"CONCATENATE(Table2[[#This Row],[Provider Code]],\"-\",TEXT(Table2[[#This Row],[Date received]],\"DD-MM-YYYY\"))","v":"-00-01-1900"}]
[null,null,null,null,null,null,null,null,null,null,null,null,null,null,null,null,null,null,null,null,{"$f":"CONCATENATE(Table2[[#This Row],[Provider Code]],\"-\",TEXT(Table2[[#This Row],[Date received]],\"DD-MM-YYYY\"))","v":"-00-01-1900"}]
[null,null,null,null,null,null,null,null,null,null,null,null,null,null,null,null,null,null,null,null,{"$f":"CONCATENATE(Table2[[#This Row],[Provider Code]],\"-\",TEXT(Table2[[#This Row],[Date received]],\"DD-MM-YYYY\"))","v":"-00-01-1900"}]
[null,null,null,null,null,null,null,null,null,null,null,null,null,null,null,null,null,null,null,null,{"$f":"CONCATENATE(Table2[[#This Row],[Provider Code]],\"-\",TEXT(Table2[[#This Row],[Date received]],\"DD-MM-YYYY\"))","v":"-00-01-1900"}]
[null,null,null,null,null,null,null,null,null,null,null,null,null,null,null,null,null,null,null,null,{"$f":"CONCATENATE(Table2[[#This Row],[Provider Code]],\"-\",TEXT(Table2[[#This Row],[Date received]],\"DD-MM-YYYY\"))","v":"-00-01-1900"}]
[null,null,null,null,null,null,null,null,null,null,null,null,null,null,null,null,null,null,null,null,{"$f":"CONCATENATE(Table2[[#This Row],[Provider Code]],\"-\",TEXT(Table2[[#This Row],[Date received]],\"DD-MM-YYYY\"))","v":"-00-01-1900"}]
[null,null,null,null,null,null,null,null,null,null,null,null,null,null,null,null,null,null,null,null,{"$f":"CONCATENATE(Table2[[#This Row],[Provider Code]],\"-\",TEXT(Table2[[#This Row],[Date received]],\"DD-MM-YYYY\"))","v":"-00-01-1900"}]
[null,null,null,null,null,null,null,null,null,null,null,null,null,null,null,null,null,null,null,null,{"$f":"CONCATENATE(Table2[[#This Row],[Provider Code]],\"-\",TEXT(Table2[[#This Row],[Date received]],\"DD-MM-YYYY\"))","v":"-00-01-1900"}]
[null,null,null,null,null,null,null,null,null,null,null,null,null,null,null,null,null,null,null,null,{"$f":"CONCATENATE(Table2[[#This Row],[Provider Code]],\"-\",TEXT(Table2[[#This Row],[Date received]],\"DD-MM-YYYY\"))","v":"-00-01-1900"}]
[null,null,null,null,null,null,null,null,null,null,null,null,null,null,null,null,null,null,null,null,{"$f":"CONCATENATE(Table2[[#This Row],[Provider Code]],\"-\",TEXT(Table2[[#This Row],[Date received]],\"DD-MM-YYYY\"))","v":"-00-01-1900"}]
[null,null,null,null,null,null,null,null,null,null,null,null,null,null,null,null,null,null,null,null,{"$f":"CONCATENATE(Table2[[#This Row],[Provider Code]],\"-\",TEXT(Table2[[#This Row],[Date received]],\"DD-MM-YYYY\"))","v":"-00-01-1900"}]
[null,null,null,null,null,null,null,null,null,null,null,null,null,null,null,null,null,null,null,null,{"$f":"CONCATENATE(Table2[[#This Row],[Provider Code]],\"-\",TEXT(Table2[[#This Row],[Date received]],\"DD-MM-YYYY\"))","v":"-00-01-1900"}]
[null,null,null,null,null,null,null,null,null,null,null,null,null,null,null,null,null,null,null,null,{"$f":"CONCATENATE(Table2[[#This Row],[Provider Code]],\"-\",TEXT(Table2[[#This Row],[Date received]],\"DD-MM-YYYY\"))","v":"-00-01-1900"}]
[null,null,null,null,null,null,null,null,null,null,null,null,null,null,null,null,null,null,null,null,{"$f":"CONCATENATE(Table2[[#This Row],[Provider Code]],\"-\",TEXT(Table2[[#This Row],[Date received]],\"DD-MM-YYYY\"))","v":"-00-01-1900"}]
[null,null,null,null,null,null,null,null,null,null,null,null,null,null,null,null,null,null,null,null,{"$f":"CONCATENATE(Table2[[#This Row],[Provider Code]],\"-\",TEXT(Table2[[#This Row],[Date received]],\"DD-MM-YYYY\"))","v":"-00-01-1900"}]
[null,null,null,null,null,null,null,null,null,null,null,null,null,null,null,null,null,null,null,null,{"$f":"CONCATENATE(Table2[[#This Row],[Provider Code]],\"-\",TEXT(Table2[[#This Row],[Date received]],\"DD-MM-YYYY\"))","v":"-00-01-1900"}]
[null,null,null,null,null,null,null,null,null,null,null,null,null,null,null,null,null,null,null,null,{"$f":"CONCATENATE(Table2[[#This Row],[Provider Code]],\"-\",TEXT(Table2[[#This Row],[Date received]],\"DD-MM-YYYY\"))","v":"-00-01-1900"}]
[null,null,null,null,null,null,null,null,null,null,null,null,null,null,null,null,null,null,null,null,{"$f":"CONCATENATE(Table2[[#This Row],[Provider Code]],\"-\",TEXT(Table2[[#This Row],[Date received]],\"DD-MM-YYYY\"))","v":"-00-01-1900"}]
[null,null,null,null,null,null,null,null,null,null,null,null,null,null,null,null,null,null,null,null,{"$f":"CONCATENATE(Table2[[#This Row],[Provider Code]],\"-\",TEXT(Table2[[#This Row],[Date received]],\"DD-MM-YYYY\"))","v":"-00-01-1900"}]
[null,null,null,null,null,null,null,null,null,null,null,null,null,null,null,null,null,null,null,null,{"$f":"CONCATENATE(Table2[[#This Row],[Provider Code]],\"-\",TEXT(Table2[[#This Row],[Date received]],\"DD-MM-YYYY\"))","v":"-00-01-1900"}]
[null,null,null,null,null,null,null,null,null,null,null,null,null,null,null,null,null,null,null,null,{"$f":"CONCATENATE(Table2[[#This Row],[Provider Code]],\"-\",TEXT(Table2[[#This Row],[Date received]],\"DD-MM-YYYY\"))","v":"-00-01-1900"}]
[null,null,null,null,null,null,null,null,null,null,null,null,null,null,null,null,null,null,null,null,{"$f":"CONCATENATE(Table2[[#This Row],[Provider Code]],\"-\",TEXT(Table2[[#This Row],[Date received]],\"DD-MM-YYYY\"))","v":"-00-01-1900"}]
[null,null,null,null,null,null,null,null,null,null,null,null,null,null,null,null,null,null,null,null,{"$f":"CONCATENATE(Table2[[#This Row],[Provider Code]],\"-\",TEXT(Table2[[#This Row],[Date received]],\"DD-MM-YYYY\"))","v":"-00-01-1900"}]
[null,null,null,null,null,null,null,null,null,null,null,null,null,null,null,null,null,null,null,null,{"$f":"CONCATENATE(Table2[[#This Row],[Provider Code]],\"-\",TEXT(Table2[[#This Row],[Date received]],\"DD-MM-YYYY\"))","v":"-00-01-1900"}]
[null,null,null,null,null,null,null,null,null,null,null,null,null,null,null,null,null,null,null,null,{"$f":"CONCATENATE(Table2[[#This Row],[Provider Code]],\"-\",TEXT(Table2[[#This Row],[Date received]],\"DD-MM-YYYY\"))","v":"-00-01-1900"}]
[null,null,null,null,null,null,null,null,null,null,null,null,null,null,null,null,null,null,null,null,{"$f":"CONCATENATE(Table2[[#This Row],[Provider Code]],\"-\",TEXT(Table2[[#This Row],[Date received]],\"DD-MM-YYYY\"))","v":"-00-01-1900"}]
[null,null,null,null,null,null,null,null,null,null,null,null,null,null,null,null,null,null,null,null,{"$f":"CONCATENATE(Table2[[#This Row],[Provider Code]],\"-\",TEXT(Table2[[#This Row],[Date received]],\"DD-MM-YYYY\"))","v":"-00-01-1900"}]
[null,null,null,null,null,null,null,null,null,null,null,null,null,null,null,null,null,null,null,null,{"$f":"CONCATENATE(Table2[[#This Row],[Provider Code]],\"-\",TEXT(Table2[[#This Row],[Date received]],\"DD-MM-YYYY\"))","v":"-00-01-1900"}]
[null,null,null,null,null,null,null,null,null,null,null,null,null,null,null,null,null,null,null,null,{"$f":"CONCATENATE(Table2[[#This Row],[Provider Code]],\"-\",TEXT(Table2[[#This Row],[Date received]],\"DD-MM-YYYY\"))","v":"-00-01-1900"}]
[null,null,null,null,null,null,null,null,null,null,null,null,null,null,null,null,null,null,null,null,{"$f":"CONCATENATE(Table2[[#This Row],[Provider Code]],\"-\",TEXT(Table2[[#This Row],[Date received]],\"DD-MM-YYYY\"))","v":"-00-01-1900"}]
[null,null,null,null,null,null,null,null,null,null,null,null,null,null,null,null,null,null,null,null,{"$f":"CONCATENATE(Table2[[#This Row],[Provider Code]],\"-\",TEXT(Table2[[#This Row],[Date received]],\"DD-MM-YYYY\"))","v":"-00-01-1900"}]
[null,null,null,null,null,null,null,null,null,null,null,null,null,null,null,null,null,null,null,null,{"$f":"CONCATENATE(Table2[[#This Row],[Provider Code]],\"-\",TEXT(Table2[[#This Row],[Date received]],\"DD-MM-YYYY\"))","v":"-00-01-1900"}]
[null,null,null,null,null,null,null,null,null,null,null,null,null,null,null,null,null,null,null,null,{"$f":"CONCATENATE(Table2[[#This Row],[Provider Code]],\"-\",TEXT(Table2[[#This Row],[Date received]],\"DD-MM-YYYY\"))","v":"-00-01-1900"}]
[null,null,null,null,null,null,null,null,null,null,null,null,null,null,null,null,null,null,null,null,{"$f":"CONCATENATE(Table2[[#This Row],[Provider Code]],\"-\",TEXT(Table2[[#This Row],[Date received]],\"DD-MM-YYYY\"))","v":"-00-01-1900"}]
[null,null,null,null,null,null,null,null,null,null,null,null,null,null,null,null,null,null,null,null,{"$f":"CONCATENATE(Table2[[#This Row],[Provider Code]],\"-\",TEXT(Table2[[#This Row],[Date received]],\"DD-MM-YYYY\"))","v":"-00-01-1900"}]
[null,null,null,null,null,null,null,null,null,null,null,null,null,null,null,null,null,null,null,null,{"$f":"CONCATENATE(Table2[[#This Row],[Provider Code]],\"-\",TEXT(Table2[[#This Row],[Date received]],\"DD-MM-YYYY\"))","v":"-00-01-1900"}]
[null,null,null,null,null,null,null,null,null,null,null,null,null,null,null,null,null,null,null,null,{"$f":"CONCATENATE(Table2[[#This Row],[Provider Code]],\"-\",TEXT(Table2[[#This Row],[Date received]],\"DD-MM-YYYY\"))","v":"-00-01-1900"}]
[null,null,null,null,null,null,null,null,null,null,null,null,null,null,null,null,null,null,null,null,{"$f":"CONCATENATE(Table2[[#This Row],[Provider Code]],\"-\",TEXT(Table2[[#This Row],[Date received]],\"DD-MM-YYYY\"))","v":"-00-01-1900"}]
[null,null,null,null,null,null,null,null,null,null,null,null,null,null,null,null,null,null,null,null,{"$f":"CONCATENATE(Table2[[#This Row],[Provider Code]],\"-\",TEXT(Table2[[#This Row],[Date received]],\"DD-MM-YYYY\"))","v":"-00-01-1900"}]
[null,null,null,null,null,null,null,null,null,null,null,null,null,null,null,null,null,null,null,null,{"$f":"CONCATENATE(Table2[[#This Row],[Provider Code]],\"-\",TEXT(Table2[[#This Row],[Date received]],\"DD-MM-YYYY\"))","v":"-00-01-1900"}]
[null,null,null,null,null,null,null,null,null,null,null,null,null,null,null,null,null,null,null,null,{"$f":"CONCATENATE(Table2[[#This Row],[Provider Code]],\"-\",TEXT(Table2[[#This Row],[Date received]],\"DD-MM-YYYY\"))","v":"-00-01-1900"}]
[null,null,null,null,null,null,null,null,null,null,null,null,null,null,null,null,null,null,null,null,{"$f":"CONCATENATE(Table2[[#This Row],[Provider Code]],\"-\",TEXT(Table2[[#This Row],[Date received]],\"DD-MM-YYYY\"))","v":"-00-01-1900"}]
[null,null,null,null,null,null,null,null,null,null,null,null,null,null,null,null,null,null,null,null,{"$f":"CONCATENATE(Table2[[#This Row],[Provider Code]],\"-\",TEXT(Table2[[#This Row],[Date received]],\"DD-MM-YYYY\"))","v":"-00-01-1900"}]
[null,null,null,null,null,null,null,null,null,null,null,null,null,null,null,null,null,null,null,null,{"$f":"CONCATENATE(Table2[[#This Row],[Provider Code]],\"-\",TEXT(Table2[[#This Row],[Date received]],\"DD-MM-YYYY\"))","v":"-00-01-1900"}]
[null,null,null,null,null,null,null,null,null,null,null,null,null,null,null,null,null,null,null,null,{"$f":"CONCATENATE(Table2[[#This Row],[Provider Code]],\"-\",TEXT(Table2[[#This Row],[Date received]],\"DD-MM-YYYY\"))","v":"-00-01-1900"}]
[null,null,null,null,null,null,null,null,null,null,null,null,null,null,null,null,null,null,null,null,{"$f":"CONCATENATE(Table2[[#This Row],[Provider Code]],\"-\",TEXT(Table2[[#This Row],[Date received]],\"DD-MM-YYYY\"))","v":"-00-01-1900"}]
[null,null,null,null,null,null,null,null,null,null,null,null,null,null,null,null,null,null,null,null,{"$f":"CONCATENATE(Table2[[#This Row],[Provider Code]],\"-\",TEXT(Table2[[#This Row],[Date received]],\"DD-MM-YYYY\"))","v":"-00-01-1900"}]
[null,null,null,null,null,null,null,null,null,null,null,null,null,null,null,null,null,null,null,null,{"$f":"CONCATENATE(Table2[[#This Row],[Provider Code]],\"-\",TEXT(Table2[[#This Row],[Date received]],\"DD-MM-YYYY\"))","v":"-00-01-1900"}]
[null,null,null,null,null,null,null,null,null,null,null,null,null,null,null,null,null,null,null,null,{"$f":"CONCATENATE(Table2[[#This Row],[Provider Code]],\"-\",TEXT(Table2[[#This Row],[Date received]],\"DD-MM-YYYY\"))","v":"-00-01-1900"}]
[null,null,null,null,null,null,null,null,null,null,null,null,null,null,null,null,null,null,null,null,{"$f":"CONCATENATE(Table2[[#This Row],[Provider Code]],\"-\",TEXT(Table2[[#This Row],[Date received]],\"DD-MM-YYYY\"))","v":"-00-01-1900"}]
[null,null,null,null,null,null,null,null,null,null,null,null,null,null,null,null,null,null,null,null,{"$f":"CONCATENATE(Table2[[#This Row],[Provider Code]],\"-\",TEXT(Table2[[#This Row],[Date received]],\"DD-MM-YYYY\"))","v":"-00-01-1900"}]
[null,null,null,null,null,null,null,null,null,null,null,null,null,null,null,null,null,null,null,null,{"$f":"CONCATENATE(Table2[[#This Row],[Provider Code]],\"-\",TEXT(Table2[[#This Row],[Date received]],\"DD-MM-YYYY\"))","v":"-00-01-1900"}]
[null,null,null,null,null,null,null,null,null,null,null,null,null,null,null,null,null,null,null,null,{"$f":"CONCATENATE(Table2[[#This Row],[Provider Code]],\"-\",TEXT(Table2[[#This Row],[Date received]],\"DD-MM-YYYY\"))","v":"-00-01-1900"}]
[null,null,null,null,null,null,null,null,null,null,null,null,null,null,null,null,null,null,null,null,{"$f":"CONCATENATE(Table2[[#This Row],[Provider Code]],\"-\",TEXT(Table2[[#This Row],[Date received]],\"DD-MM-YYYY\"))","v":"-00-01-1900"}]
[null,null,null,null,null,null,null,null,null,null,null,null,null,null,null,null,null,null,null,null,{"$f":"CONCATENATE(Table2[[#This Row],[Provider Code]],\"-\",TEXT(Table2[[#This Row],[Date received]],\"DD-MM-YYYY\"))","v":"-00-01-1900"}]
[null,null,null,null,null,null,null,null,null,null,null,null,null,null,null,null,null,null,null,null,{"$f":"CONCATENATE(Table2[[#This Row],[Provider Code]],\"-\",TEXT(Table2[[#This Row],[Date received]],\"DD-MM-YYYY\"))","v":"-00-01-1900"}]
[null,null,null,null,null,null,null,null,null,null,null,null,null,null,null,null,null,null,null,null,{"$f":"CONCATENATE(Table2[[#This Row],[Provider Code]],\"-\",TEXT(Table2[[#This Row],[Date received]],\"DD-MM-YYYY\"))","v":"-00-01-1900"}]
[null,null,null,null,null,null,null,null,null,null,null,null,null,null,null,null,null,null,null,null,{"$f":"CONCATENATE(Table2[[#This Row],[Provider Code]],\"-\",TEXT(Table2[[#This Row],[Date received]],\"DD-MM-YYYY\"))","v":"-00-01-1900"}]
[null,null,null,null,null,null,null,null,null,null,null,null,null,null,null,null,null,null,null,null,{"$f":"CONCATENATE(Table2[[#This Row],[Provider Code]],\"-\",TEXT(Table2[[#This Row],[Date received]],\"DD-MM-YYYY\"))","v":"-00-01-1900"}]
[null,null,null,null,null,null,null,null,null,null,null,null,null,null,null,null,null,null,null,null,{"$f":"CONCATENATE(Table2[[#This Row],[Provider Code]],\"-\",TEXT(Table2[[#This Row],[Date received]],\"DD-MM-YYYY\"))","v":"-00-01-1900"}]
[null,null,null,null,null,null,null,null,null,null,null,null,null,null,null,null,null,null,null,null,{"$f":"CONCATENATE(Table2[[#This Row],[Provider Code]],\"-\",TEXT(Table2[[#This Row],[Date received]],\"DD-MM-YYYY\"))","v":"-00-01-1900"}]
[null,null,null,null,null,null,null,null,null,null,null,null,null,null,null,null,null,null,null,null,{"$f":"CONCATENATE(Table2[[#This Row],[Provider Code]],\"-\",TEXT(Table2[[#This Row],[Date received]],\"DD-MM-YYYY\"))","v":"-00-01-1900"}]
[null,null,null,null,null,null,null,null,null,null,null,null,null,null,null,null,null,null,null,null,{"$f":"CONCATENATE(Table2[[#This Row],[Provider Code]],\"-\",TEXT(Table2[[#This Row],[Date received]],\"DD-MM-YYYY\"))","v":"-00-01-1900"}]
[null,null,null,null,null,null,null,null,null,null,null,null,null,null,null,null,null,null,null,null,{"$f":"CONCATENATE(Table2[[#This Row],[Provider Code]],\"-\",TEXT(Table2[[#This Row],[Date received]],\"DD-MM-YYYY\"))","v":"-00-01-1900"}]
[null,null,null,null,null,null,null,null,null,null,null,null,null,null,null,null,null,null,null,null,{"$f":"CONCATENATE(Table2[[#This Row],[Provider Code]],\"-\",TEXT(Table2[[#This Row],[Date received]],\"DD-MM-YYYY\"))","v":"-00-01-1900"}]
[null,null,null,null,null,null,null,null,null,null,null,null,null,null,null,null,null,null,null,null,{"$f":"CONCATENATE(Table2[[#This Row],[Provider Code]],\"-\",TEXT(Table2[[#This Row],[Date received]],\"DD-MM-YYYY\"))","v":"-00-01-1900"}]