{"text_format":"1","workbook":"xlsx","n_sheets":3,"sheets":["Sheet1","Sheet2","Sheet3"],"not_rendered":{"charts":0,"images":0,"macros":1,"external_links":0,"defined_names":0,"comments":0,"pivot_tables":0},"unopened":[],"bounds":{"document_bytes":16777216,"sheet_cells":100000,"rows_first":2000,"rows_last":500,"rows_between":2000,"halvings":0,"cell_chars":16384,"cell_head_chars":4096},"cells_cut":0,"cells_raw":0,"read":"whole","date_system":"1900"}

{"sheet":"Sheet1","index":0,"n_rows":14,"n_cols":3,"rows_kept":14,"cut":false,"hidden":false,"merged":[]}
[]
[null,"الاسم","التاريخ"]
[null,"Officena1","2023-09-14"]
[null,"Officena2","2023-05-11"]
[null,"Officena3","2023-09-16"]
[null,"Officena4","2023-09-17"]
[null,"Officena5","2023-09-18"]
[null,"Officena6","2020-04-14"]
[null,"Officena7","2023-09-20"]
[null,"Officena8","2022-06-08"]
[null,"Officena9","2021-06-17"]
[null,"Officena10","2023-09-23"]
[null,"Officena11","2023-09-24"]
[null,"Officena12","2023-09-25"]

{"sheet":"Sheet2","index":1,"n_rows":14,"n_cols":3,"rows_kept":14,"cut":false,"hidden":false,"merged":[]}
[]
[null,"الاسم","التاريخ"]
[null,"Officena8",{"$f":"IFERROR(INDEX(Sheet1!$C$3:$C$14,   MATCH(B3, Sheet1!$B$3:$B$14, 0),1),\"\")","v":"2022-06-08"}]
[null,"Officena9",{"$f":"IFERROR(INDEX(Sheet1!$C$3:$C$14,   MATCH(B4, Sheet1!$B$3:$B$14, 0),1),\"\")","v":"2021-06-17"}]
[null,"Officena10",{"$f":"IFERROR(INDEX(Sheet1!$C$3:$C$14,   MATCH(B5, Sheet1!$B$3:$B$14, 0),1),\"\")","v":"2023-09-23"}]
[null,"Officena11",{"$f":"IFERROR(INDEX(Sheet1!$C$3:$C$14,   MATCH(B6, Sheet1!$B$3:$B$14, 0),1),\"\")","v":"2023-09-24"}]
[null,"Officena12",{"$f":"IFERROR(INDEX(Sheet1!$C$3:$C$14,   MATCH(B7, Sheet1!$B$3:$B$14, 0),1),\"\")","v":"2023-09-25"}]
[null,"Officena1",{"$f":"IFERROR(INDEX(Sheet1!$C$3:$C$14,   MATCH(B8, Sheet1!$B$3:$B$14, 0),1),\"\")","v":"2023-09-14"}]
[null,"Officena2",{"$f":"IFERROR(INDEX(Sheet1!$C$3:$C$14,   MATCH(B9, Sheet1!$B$3:$B$14, 0),1),\"\")","v":"2023-05-11"}]
[null,"Officena3",{"$f":"IFERROR(INDEX(Sheet1!$C$3:$C$14,   MATCH(B10, Sheet1!$B$3:$B$14, 0),1),\"\")","v":"2023-09-16"}]
[null,"Officena4",{"$f":"IFERROR(INDEX(Sheet1!$C$3:$C$14,   MATCH(B11, Sheet1!$B$3:$B$14, 0),1),\"\")","v":"2023-09-17"}]
[null,"Officena5",{"$f":"IFERROR(INDEX(Sheet1!$C$3:$C$14,   MATCH(B12, Sheet1!$B$3:$B$14, 0),1),\"\")","v":"2023-09-18"}]
[null,"Officena6",{"$f":"IFERROR(INDEX(Sheet1!$C$3:$C$14,   MATCH(B13, Sheet1!$B$3:$B$14, 0),1),\"\")","v":"2020-04-14"}]
[null,"Officena7",{"$f":"IFERROR(INDEX(Sheet1!$C$3:$C$14,   MATCH(B14, Sheet1!$B$3:$B$14, 0),1),\"\")","v":"2023-09-20"}]

{"sheet":"Sheet3","index":2,"n_rows":0,"n_cols":0,"rows_kept":0,"cut":false,"hidden":false,"merged":[]}