{"text_format":"1","workbook":"xlsx","n_sheets":4,"sheets":["BASE","TI3DAD","SAISIE","DATA ELV"],"not_rendered":{"charts":0,"images":7,"macros":1,"external_links":0,"defined_names":52,"comments":0,"pivot_tables":0},"unopened":[],"bounds":{"document_bytes":16777216,"sheet_cells":100000,"rows_first":2000,"rows_last":500,"rows_between":2000,"halvings":0,"cell_chars":16384,"cell_head_chars":4096},"cells_cut":0,"cells_raw":0,"read":"whole","date_system":"1900"}

{"sheet":"BASE","index":0,"n_rows":89,"n_cols":20,"rows_kept":89,"cut":false,"hidden":false,"merged":[[2,7,2,10],[3,7,4,7],[3,8,4,8],[3,9,4,9],[3,10,4,10]]}
[]
[]
[null,null,null,null,null,null,null,"الحجم الساعي اليــــــومي"]
[null,"ترقيم تلقائي","الأقسام",null,"اسم الأستاذ","التخصص",null,"الأيـــــــام ","سنة أولى ","سنة ثانية ","سنة ثالثة"]
[null,{"$f":"IF($C5=\"\",\"\",ROW($A1))","v":1},"3ت ر/هم",null,null,"رياضيات",null,null,null,null,null,"الأقسام ","المواد","الجنس","الصفة ","ملاحظات","تبرير الغياب","الأيام ","الشـــعب","السنوات"]
[null,{"$f":"IF($C6=\"\",\"\",ROW($A2))","v":2},"3ت ر/هك",null,null,"رياضيات",null,"الأحد",73,49,50,"3ت ر/هم","رياضيات","ذكر","D1","نصف داخلي ذكر","ندوة خارجية","الأحد","تقني رياضي هندسة مدنية ","الأولى "]
[null,3,"3ت إ01",null,null,"رياضيات",null,"الإثنين",67,60,46,"3ت ر/هك","فيزياء","أنثى","D2","نصف داخلي أنثى ","إضراب","الإثنين","تقني رياضي هندسة كهربائية ","الثانية "]
[null,4,"3ع ت01",null,null,"رياضيات",null,"الثلاثاء",71,47,43,"3ت ر/ه طرائق","علوم ط",null,"E1","خارجي ذكر","وفاة أحد الأقارب","الثلاثاء","تقني رياضي هندسة ميكانيكية ","الثالثة"]
[null,5,"3ع ت02",null,null,"رياضيات",null,"الأربعاء",55,56,52,"3ت ر/ه ميكا","أدب عربي",null,"E2","خارجي أنثى ","اجتماع ","الأربعاء","تقني رياضي هندسة الطرائق"]
[null,{"$f":"IF($C11=\"\",\"\",ROW($A6))","v":6},"3ع ت03",null,null,"فيزياء",null,"الخميس",62,43,54,"3ع ت01","لغة فرنسية ",null,null,null,"شهادة طبية ","الخميس","علـــــوم تجريبيــة "]
[null,{"$f":"IF($C12=\"\",\"\",ROW($A7))","v":7},"3أ ف01",null,null,"فيزياء",null,null,null,null,null,"3ع ت02","لغة إنجليزية ",null,null,null,"طلب غياب",null,"تسييـــر و إقتصــــــاد"]
[null,{"$f":"IF($C13=\"\",\"\",ROW($A8))","v":8},"3أ ف02",null,null,"فيزياء",null,null,null,null,null,"3ع ت03","إسبانية ",null,null,null,"بترخيص",null,"أداب و فلســــفة "]
[null,{"$f":"IF($C14=\"\",\"\",ROW($A9))","v":9},"3لغات /إسبا",null,null,"فيزياء",null,null,"أشهر السنة ",null,null,"3ع ت04","إجتماعيات",null,null,null,"مسابقة ترقية",null,"لغـــات أجنبيــــة ألمانية"]
[null,{"$f":"IF($C15=\"\",\"\",ROW($A10))","v":10},"2ت ر/هم",null,null,"فيزياء",null,null,"سبتمبر  2021",null,null,"3ع ت05","فلسفة",null,null,null,"مرض الابن",null,"لغات أجنبية إيطالية "]
[null,{"$f":"IF($C16=\"\",\"\",ROW($A11))","v":11},"2ت ر/هك",null,null,"علوم ط",null,null,"أكتوبر  2021",null,null,"3ع ت06","معلوماتية ",null,null,null,"لجنة تثبيت",null,"لغـــات أجنبيـة إسبانيــة "]
[null,{"$f":"IF($C17=\"\",\"\",ROW($A12))","v":12},"2ت إ01",null,null,"علوم ط",null,null,"نوفمبر  2021",null,null,"3ع ت07","تكنولوجيا",null,null,null,"مرض ",null,"جدع مشترك علوم و تكنولوجيا "]
[null,{"$f":"IF($C18=\"\",\"\",ROW($A13))","v":13},"2ع ت01",null,null,"علوم ط",null,null,"ديسمبر  2021",null,null,"3ع ت08","رياضة بدنية ",null,null,null,"عطلة مرضية",null,"جـــدع مشتـــرك أداب"]
[null,{"$f":"IF($C19=\"\",\"\",ROW($A14))","v":14},"2ع ت02",null,null,"علوم ط",null,null,"جانفي  2022",null,null,"3ت إ01","إقتصاد",null,null,null,"عطلة أمومة"]
[null,{"$f":"IF($C20=\"\",\"\",ROW($A15))","v":15},"2ع ت03",null,null,"علوم ط",null,null,"فبراير 2021",null,null,"3ت إ02","ع,إسلامية"]
[null,{"$f":"IF($C21=\"\",\"\",ROW($A16))","v":16},"2أ ف01",null,null,"ع,إسلامية",null,null,"مارس 2021",null,null,"3ت إ03"]
[null,{"$f":"IF($C22=\"\",\"\",ROW($A17))","v":17},"2أ ف02",null,null,"ع,إسلامية",null,null,"أبريل 2021",null,null,"3ت إ04"]
[null,18,"2لغات /إسبا",null,null,"ع,إسلامية",null,null,"ماي 2021",null,null,"3أ ف01"]
[null,19,"ج م ع تك01",null,null,"أدب عربي",null,null,"جوان 2021",null,null,"3أ ف02"]
[null,20,"ج م ع تك02",null,null,"أدب عربي",null,null,null,null,null,"3أ ف03"]
[null,21,"ج م ع تك03",null,null,"أدب عربي",null,null,null,null,null,"3أ ف04"]
[null,22,"ج م ع تك04",null,null,"أدب عربي",null,null,null,null,null,"3أ ف05"]
[null,23,"ج م ع تك05",null,null,"أدب عربي",null,null,null,null,null,"3لغات"]
[null,24,"ج م أ01",null,null,"أدب عربي",null,null,null,null,null,"3لغات /إسبا"]
[null,25,"ج م أ02",null,null,"إجتماعيات",null,null,null,null,null,"3لغات /ألما"]
[null,26,"ج م أ03",null,null,"إجتماعيات",null,null,null,null,null,"3لغات /إيطا"]
[null,"",null,null,null,"إجتماعيات",null,null,null,null,null,"2ت ر/هم"]
[null,"",null,null,null,"إجتماعيات",null,null,null,null,null,"2ت ر/هك"]
[null,"",null,null,null,"فلسفة",null,null,null,null,null,"2ت ر/ه طرائق"]
[null,"",null,null,null,"فلسفة",null,null,null,null,null,"2ت ر/ه ميكا"]
[null,"",null,null,null,"لغة إنجليزية ",null,null,null,null,null,"2ع ت01"]
[null,"",null,null,null,"لغة إنجليزية ",null,null,null,null,null,"2ع ت02"]
[null,"",null,null,null,"لغة إنجليزية ",null,null,null,null,null,"2ع ت03"]
[null,"",null,null,null,"لغة إنجليزية ",null,null,null,null,null,"2ع ت04"]
[null,"",null,null,null,"لغة فرنسية ",null,null,null,null,null,"2ع ت05"]
[null,"",null,null,null,"لغة فرنسية ",null,null,null,null,null,"2ع ت06"]
[null,"",null,null,null,"لغة فرنسية ",null,null,null,null,null,"2ع ت07"]
[null,"",null,null,null,"لغة فرنسية ",null,null,null,null,null,"2ع ت08"]
[null,"",null,null,null,"لغة فرنسية ",null,null,null,null,null,"2ت إ01"]
[null,"",null,null,null,"إسبانية ",null,null,null,null,null,"2ت إ02"]
[null,"",null,null,null,"إقتصاد",null,null,null,null,null,"2ت إ03"]
[null,"",null,null,null,"إقتصاد",null,null,null,null,null,"2ت إ04"]
[null,"",null,null,null,"تكنولوجيا",null,null,null,null,null,"2أ ف01"]
[null,"",null,null,null,"تكنولوجيا",null,null,null,null,null,"2أ ف02"]
[null,"",null,null,null,"تكنولوجيا",null,null,null,null,null,"2أ ف03"]
[null,"",null,null,null,"رياضة بدنية ",null,null,null,null,null,"2أ ف04"]
[null,"",null,null,null,"رياضة بدنية ",null,null,null,null,null,"2أ ف05"]
[null,"",null,null,null,"رياضة بدنية ",null,null,null,null,null,"2لغات"]
[null,"",null,null,null,null,null,null,null,null,null,"2لغات /إسبا"]
[null,"",null,null,null,null,null,null,null,null,null,"2لغات /ألما"]
[null,"",null,null,null,null,null,null,null,null,null,"2لغات /إيطا"]
[null,"",null,null,null,null,null,null,null,null,null,"ج م ع تك01"]
[null,"",null,null,null,null,null,null,null,null,null,"ج م ع تك02"]
[null,"",null,null,null,null,null,null,null,null,null,"ج م ع تك03"]
[null,"",null,null,null,null,null,null,null,null,null,"ج م ع تك04"]
[null,"",null,null,null,null,null,null,null,null,null,"ج م ع تك05"]
[null,"",null,null,null,null,null,null,null,null,null,"ج م ع تك06"]
[null,"",null,null,null,null,null,null,null,null,null,"ج م ع تك07"]
[null,"",null,null,null,null,null,null,null,null,null,"ج م ع تك08"]
[null,"",null,null,null,null,null,null,null,null,null,"ج م ع تك09"]
[null,"",null,null,null,null,null,null,null,null,null,"ج م ع تك10"]
[null,"",null,null,null,null,null,null,null,null,null,"ج م ع تك11"]
[null,"",null,null,null,null,null,null,null,null,null,"ج م أ01"]
[null,"",null,null,null,null,null,null,null,null,null,"ج م أ02"]
[null,"",null,null,null,null,null,null,null,null,null,"ج م أ03"]
[null,{"$f":"IF($C70=\"\",\"\",ROW($A66))","v":""},null,null,null,null,null,null,null,null,null,"ج م أ04"]
[null,{"$f":"IF($C71=\"\",\"\",ROW($A67))","v":""},null,null,null,null,null,null,null,null,null,"ج م أ05"]
[null,null,null,null,null,null,null,null,null,null,null,"ج م أ06"]
[null,null,null,null,null,null,null,null,null,null,null,"ج م أ07"]
[null,null,null,null,null,null,null,null,null,null,null,"ج م أ08"]
[null,null,null,null,null,null,null,null,null,null,null,"ج م أ09"]
[null,null,null,null,null,null,null,null,null,null,null,"ج م أ10"]
[]
[]
[]
[]
[]
[]
[]
[]
[]
[]
[]
[]
[null,null,null,null,"الحجم الساعي"]

{"sheet":"TI3DAD","index":1,"n_rows":47,"n_cols":47,"rows_kept":47,"cut":false,"hidden":false,"merged":[[4,1,5,1],[1,12,2,12],[1,23,2,23],[1,13,1,15],[1,16,1,18],[1,19,1,21],[4,2,4,4],[4,5,4,7],[4,8,4,10],[37,13,37,14],[38,13,38,14],[39,13,39,14],[1,24,1,26],[1,41,1,43],[1,27,1,29],[1,30,1,32],[1,34,2,34],[1,35,1,37],[1,38,1,40],[31,13,31,14],[32,13,32,14]]}
[]
[]
[]
[]
[null,"القسم ","نصف داخلي ",null,null,"الخارجيون",null,null,"المجموع العام "]
[null,null,"ذ","إ","مج","ذ","إ","مج","ذ","إ","مج"]
[null,{"$f":"BASE!C5","v":"3ت ر/هم"},{"$f":"COUNTIFS(قسم,B7,sifa,\"D1\")","v":5},{"$f":"COUNTIFS(قسم,B7,sifa,\"D2\")","v":5},{"$f":"SUM(C7:D7)","v":10},{"$f":"COUNTIFS(قسم,B7,sifa,\"E1\")","v":5},{"$f":"COUNTIFS(قسم,B7,sifa,\"E2\")","v":0},{"$f":"SUM(F7:G7)","v":5},{"$f":"C7+F7","v":10},{"$f":"D7+G7","v":5},{"$f":"SUM(I7:J7)","v":15}]
[null,{"$f":"BASE!C6","v":"3ت ر/هك"},7,2,{"$f":"SUM(C8:D8)","v":9},0,0,{"$f":"SUM(F8:G8)","v":0},{"$f":"C8+F8","v":7},{"$f":"D8+G8","v":2},{"$f":"SUM(I8:J8)","v":9}]
[null,{"$f":"BASE!C7","v":"3ت إ01"},8,13,21,5,3,8,13,16,29]
[null,{"$f":"BASE!C8","v":"3ع ت01"},9,19,28,3,2,5,12,21,33]
[null,{"$f":"BASE!C9","v":"3ع ت02"},8,18,26,2,4,6,10,22,32]
[null,{"$f":"BASE!C11","v":"3أ ف01"},5,19,24,5,5,10,10,24,34]
[null,{"$f":"BASE!C12","v":"3أ ف02"},3,18,21,4,4,8,7,22,29]
[null,{"$f":"BASE!C13","v":"3لغات /إسبا"},5,18,23,2,5,7,7,23,30]
[null,{"$f":"BASE!C14","v":"2ت ر/هم"},8,6,14,6,1,7,14,7,21]
[null,{"$f":"BASE!C15","v":"2ت ر/هك"},0,0,0,0,0,0,0,0,0]
[null,{"$f":"BASE!C16","v":"2ت إ01"},10,16,26,5,3,8,15,19,34,null," "]
[null,{"$f":"BASE!C17","v":"2ع ت01"},8,7,15,9,6,15,17,13,30]
[null,{"$f":"BASE!C18","v":"2ع ت02"},10,13,23,3,4,7,13,17,30]
[null,{"$f":"BASE!C19","v":"2ع ت03"},6,15,21,4,6,10,10,21,31]
[null,{"$f":"BASE!C20","v":"2أ ف01"},14,11,25,5,6,11,19,17,36]
[null,{"$f":"BASE!C21","v":"2أ ف02"},10,15,25,2,5,7,12,20,32]
[null,{"$f":"BASE!#REF!","v":{"$error":"#REF!"}},0,0,0,0,0,0,0,0,0,null,"المجموع العام",{"$f":"SUM(N4:N22)","v":0},{"$f":"SUM(O4:O22)","v":0},0,0,0,0,0,0,0,null,"المجموع العام",{"$f":"SUM(Y4:Y22)","v":0},{"$f":"SUM(Z4:Z22)","v":0},0,0,0,0,0,0,0,null,"المجموع العام",{"$f":"SUM(AJ4:AJ22)","v":0},{"$f":"SUM(AK4:AK22)","v":0},0,0,0,0,0,0,0]
[null,{"$f":"BASE!C22","v":"2لغات /إسبا"},3,7,10,3,5,8,6,12,18]
[null,{"$f":"BASE!C23","v":"ج م ع تك01"},13,12,25,6,4,10,19,16,35]
[null,{"$f":"BASE!C24","v":"ج م ع تك02"},12,17,29,6,3,9,18,20,38]
[null,{"$f":"BASE!C25","v":"ج م ع تك03"},10,19,29,2,4,6,12,23,35]
[null,{"$f":"BASE!C26","v":"ج م ع تك04"},9,18,27,1,5,6,10,23,33,null,null,null,null,null,null,null,null,null,null,null,null,null,null,null,null,null,null,null,null,null,null,null,null,null,null,null,null,null,null,null,null,null,null,"المجموع العام","0"]
[null,{"$f":"BASE!C27","v":"ج م ع تك05"},14,12,26,4,3,7,18,15,33,null,null,null,null,null,null,null,null,null,null,null,null,"السنة الثالثة",{"$f":"N23","v":0},0,0,0,0,0,0,0,0]
[null,{"$f":"BASE!C28","v":"ج م أ01"},10,18,28,4,2,6,14,20,34,null,null,null,null,null,null,null,null,null,null,null,null,"السنة الثانية",{"$f":"Y23","v":0},0,0,0,0,0,0,0,0]
[null,{"$f":"IFERROR(BASE!C29,\" \")","v":"ج م أ02"},6,18,24,5,5,10,11,23,34,null,null,null,null,null,null,null,null,null,null,null,null,"السنة الأولى ",{"$f":"AJ23","v":0},0,0,0,0,0,0,0,0]
[null,{"$f":"BASE!C30","v":"ج م أ03"},7,16,23,5,5,10,12,21,33,null,"نسبة الذكور ",{"$f":"AE32/AG32","v":{"$error":"#DIV/0!"}},null,null,1,null,null,null,null,null,null,"المجموع العام",{"$f":"SUM(Y29:Y31)","v":0},{"$f":"SUM(Z29:Z31)","v":0},0,0,0,0,0,0,0]
[null,{"$f":"BASE!C31","v":0},0,0,0,0,0,0,0,0,0,null,"نسبة الإناث",{"$f":"AF32/AG32","v":{"$error":"#DIV/0!"}},null,null,1]
[null,{"$f":"BASE!C32","v":0},0,0,0,0,0,0,0,0,0]
[null,{"$f":"BASE!C33","v":0},0,0,0,0,0,0,0,0,0,null," نصف داخلي",{"$f":"AA32/AG32","v":{"$error":"#DIV/0!"}}]
[null,{"$f":"BASE!C34","v":0},0,0,0,0,0,0,0,0,0,null,"خارجي",{"$f":"AD32/AG32","v":{"$error":"#DIV/0!"}}]
[null,{"$f":"BASE!C35","v":0},0,0,0,0,0,0,0,0,0]
[null,{"$f":"BASE!C36","v":0},0,0,0,0,0,0,0,0,0,null,"عدد تلاميذ س1",{"$f":"AG31","v":0}]
[null,{"$f":"BASE!C37","v":0},0,0,0,0,0,0,0,0,0,null,"عدد تلاميذ س2",{"$f":"AG30","v":0}]
[null,{"$f":"BASE!C38","v":0},0,0,0,0,0,0,0,0,0,null,"عدد تلاميذ س3",{"$f":"AG29","v":0}]
[null,{"$f":"BASE!C39","v":0},0,0,0,0,0,0,0,0,0]
[null,{"$f":"BASE!C40","v":0},0,0,0,0,0,0,0,0,0]
[null,{"$f":"BASE!C41","v":0},0,0,0,0,0,0,0,0,0]
[null,{"$f":"BASE!C42","v":0},0,0,0,0,0,0,0,0,0]
[null,{"$f":"BASE!C43","v":0},0,0,0,0,0,0,0,0,0]
[null,{"$f":"BASE!C44","v":0},0,0,0,0,0,0,0,0,0]
[null,"المجموع العام",{"$f":"SUM(C7:C46)","v":200},{"$f":"SUM(D7:D46)","v":332},532,96,90,186,296,422,718]

{"sheet":"SAISIE","index":2,"n_rows":20,"n_cols":5,"rows_kept":20,"cut":false,"hidden":true,"merged":[]}
[]
[]
[]
[null,"رقم التعريف المدرسي:",null,null,"رقم القســـــم : "]
[]
[null,"اللقــــــــب   :",null,null,"رقم القيـــــد :"]
[]
[null,"الإســـــــــم : ",null,null,"الصفــــــــــة :"]
[]
[null,"الجنــــــس   : ",null,null,"اسم و لقب الولي : "]
[]
[null,"تاريخ الإزدياد : ",null,null,"العنـــــــوان   : "]
[]
[null,"مكان الإزدياد : ",null,null,"Nom & Prénom"]
[]
[null,"القسم المختصر :",null,null,"تاريخ الخروج : "]
[]
[null,"السـنــــنة  :",null,null,"تاريخ الدخول : "]
[]
[null,"الشعبـــــــــة : "]

{"sheet":"DATA ELV","index":3,"n_rows":1822,"n_cols":35,"rows_kept":1822,"cut":false,"hidden":false,"merged":[]}
[]
[null,null,null,null,null,null,null,null,null,null,null,null,null,null,null,null,null,null,null,null,null,null,null,"بوبكر يسرى"]
[]
[]
[]
[]
[1,2,3,4,5,6,7,8,9,10,11,12,13,14,15,16,17,18,19,20,21,22,23,24,25]
["الرقم","الاسم و اللقب كاملا","رقم التعريف المدرسي","اللقب","الاسم","الجنس","تاريخ الازدياد","مكان الازدياد","الصفة ","القسم المختصر","إعادة س1","إعادة س2","إعادة س3","السنة ","الشعبة","رقم القسم","رقم القيد","الصفة","اسم الولي","العنوان ","الاسم و اللقب بالكتابة اللاتينية","تاريخ الدخول","تاريخ الخروج","دخول ","خروخ","ملاحظات"]
[5,{"$f":"D9& \" \" &E9","v":" "},1100513270108400,null,null,"أنثى","2005-05-10","مغنية","نصف داخلي","3ت ر/هم",null,null,null,"ثالثة","تقني رياضي هندسة مدنية",1,5,"D2",null,"قرية العقيد عباس مغنية ",null,null,null,null,null,null,{"$f":"IF($J9=\"\",\"\",MATCH($J9,OFFSET(BASE!$C$5,,,MAX(BASE!$B:$B)),0))","v":1},{"$f":"IF($AA9=\"\",\"\",60*($AA9-1)+COUNTIF($AA$9:$AA9,$AA9))","v":1},{"$f":"AE9&AD9","v":"D2"},{"$f":"IF(F9=\"أنثى\",2,1)","v":2},{"$f":"IF(I9=\"نصف داخلي\",\"D\",\"E\")","v":"D"},null,"نعيمي ",null,{"$f":"D9 & \" \" & AG9","v":" نعيمي "}]
[6," ",1100313270128600,null,null,"أنثى","2003-06-17","مغنية","نصف داخلي","3ت ر/هم",null,null,null,"ثالثة","تقني رياضي هندسة مدنية",1,6,"D2",null,"قرية البطيم مغنية ",null,null,null,null,null,null,{"$f":"IF($J10=\"\",\"\",MATCH($J10,OFFSET(BASE!$C$5,,,MAX(BASE!$B:$B)),0))","v":1},{"$f":"IF($AA10=\"\",\"\",60*($AA10-1)+COUNTIF($AA$9:$AA10,$AA10))","v":2},{"$f":"AE10&AD10","v":"D2"},{"$f":"IF(F10=\"أنثى\",2,1)","v":2},{"$f":"IF(I10=\"نصف داخلي\",\"D\",\"E\")","v":"D"},null,"بن اعمر ",null,{"$f":"D10 & \" \" & AG10","v":" بن اعمر "}]
[7," ",1100513270133200,null,null,"أنثى","2005-06-01","مغنية","نصف داخلي","3ت ر/هم",null,null,null,"ثالثة","تقني رياضي هندسة مدنية",1,7,"D2",null,"أولاد الشارف - مغنية - ",null,null,null,null,null,null,{"$f":"IF($J11=\"\",\"\",MATCH($J11,OFFSET(BASE!$C$5,,,MAX(BASE!$B:$B)),0))","v":1},{"$f":"IF($AA11=\"\",\"\",60*($AA11-1)+COUNTIF($AA$9:$AA11,$AA11))","v":3},"D2",2,"D",null,"واسيني ",null," واسيني "]
[8,"بوزي عبير",1000513270121600,null,null,"ذكر","2005-05-22","مغنية","نصف داخلي","3ت ر/هم",null,null,null,"ثالثة","تقني رياضي هندسة مدنية",1,8,"D1",null,"مسجد الرحمة باب العسة ",null,null,null,null,null,null,{"$f":"IF($J12=\"\",\"\",MATCH($J12,OFFSET(BASE!$C$5,,,MAX(BASE!$B:$B)),0))","v":1},{"$f":"IF($AA12=\"\",\"\",60*($AA12-1)+COUNTIF($AA$9:$AA12,$AA12))","v":4},"D1",1,"D",null,"ميلود ",null," ميلود "]
[9,{"$f":"D13& \" \" &E13","v":" "},1000513270043200,null,null,"ذكر","2005-02-20","مغنية","نصف داخلي","3ت ر/هم",null,null,null,"ثالثة","تقني رياضي هندسة مدنية",1,9,"D1",null,"أولاد الشارف مغنية ",null,null,null,null,null,null,{"$f":"IF($J13=\"\",\"\",MATCH($J13,OFFSET(BASE!$C$5,,,MAX(BASE!$B:$B)),0))","v":1},{"$f":"IF($AA13=\"\",\"\",60*($AA13-1)+COUNTIF($AA$9:$AA13,$AA13))","v":5},"D1",1,"D",null,"محمد ",null," محمد "]
[10," ",1000213270269300,null,null,"ذكر","2002-11-27","مغنية","نصف داخلي","3ت ر/هم",null,null,null,"ثالثة","تقني رياضي هندسة مدنية",1,10,"D1",null,"قرية اولاد قدور الكبار مغنية ",null,null,null,null,null,null,{"$f":"IF($J14=\"\",\"\",MATCH($J14,OFFSET(BASE!$C$5,,,MAX(BASE!$B:$B)),0))","v":1},{"$f":"IF($AA14=\"\",\"\",60*($AA14-1)+COUNTIF($AA$9:$AA14,$AA14))","v":6},"D1",1,"D",null,"عبد الحفيظ ",null," عبد الحفيظ "]
[11," ",1100513270261200,null,null,"أنثى","2005-09-03","مغنية","نصف داخلي","3ت ر/هم",null,null,null,"ثالثة","تقني رياضي هندسة مدنية",1,11,"D2",null,"قرية أولاد الشارف - مغنية - ",null,null,null,null,null,null,{"$f":"IF($J15=\"\",\"\",MATCH($J15,OFFSET(BASE!$C$5,,,MAX(BASE!$B:$B)),0))","v":1},{"$f":"IF($AA15=\"\",\"\",60*($AA15-1)+COUNTIF($AA$9:$AA15,$AA15))","v":7},"D2",2,"D",null,"عمر ",null," عمر "]
[12," ",1000513270150700,null,null,"ذكر","2005-06-14","مغنية","نصف داخلي","3ت ر/هم",null,null,null,"ثالثة","تقني رياضي هندسة مدنية",1,12,"D1",null,"بلدية حمام بوغرارة 13036 تلمسان ",null,null,null,null,null,null,{"$f":"IF($J16=\"\",\"\",MATCH($J16,OFFSET(BASE!$C$5,,,MAX(BASE!$B:$B)),0))","v":1},{"$f":"IF($AA16=\"\",\"\",60*($AA16-1)+COUNTIF($AA$9:$AA16,$AA16))","v":8},"D1",1,"D",null,"نور الدين ",null," نور الدين "]
[13," ",1100313270259700,null,null,"أنثى","2003-11-06","مغنية","نصف داخلي","3ت ر/هم",null,null,null,"ثالثة","تقني رياضي هندسة مدنية",1,13,"D2",null,"اولاد الشارف مغنية ",null,null,null,null,null,null,{"$f":"IF($J17=\"\",\"\",MATCH($J17,OFFSET(BASE!$C$5,,,MAX(BASE!$B:$B)),0))","v":1},{"$f":"IF($AA17=\"\",\"\",60*($AA17-1)+COUNTIF($AA$9:$AA17,$AA17))","v":9},"D2",2,"D",null,"عبد القادر ",null," عبد القادر "]
[14," ",1000513270091800,null,null,"ذكر","2005-04-23","مغنية","نصف داخلي","3ت ر/هم",null,null,null,"ثالثة","تقني رياضي هندسة مدنية",1,14,"D1",null,"قرية البطيم ",null,null,null,null,null,null,{"$f":"IF($J18=\"\",\"\",MATCH($J18,OFFSET(BASE!$C$5,,,MAX(BASE!$B:$B)),0))","v":1},{"$f":"IF($AA18=\"\",\"\",60*($AA18-1)+COUNTIF($AA$9:$AA18,$AA18))","v":10},"D1",1,"D",null,"الواسيني ",null," الواسيني "]
[15," ",1000246010161000,null,null,"ذكر","2002-07-13","عين تموشنت","خارجي","3ت ر/هم",null,null,null,"ثالثة","تقني رياضي هندسة مدنية",1,15,"E1",null,null,null,null,null,null,null,null,{"$f":"IF($J19=\"\",\"\",MATCH($J19,OFFSET(BASE!$C$5,,,MAX(BASE!$B:$B)),0))","v":1},{"$f":"IF($AA19=\"\",\"\",60*($AA19-1)+COUNTIF($AA$9:$AA19,$AA19))","v":11},"E1",1,"E",null,null,null," "]
[16," ",1000413270098600,null,null,"ذكر","2004-07-06","مغنية","خارجي","3ت ر/هم",null,null,null,"ثالثة","تقني رياضي هندسة مدنية",1,16,"E1",null,"درب 4 منزل 16 حي الشهداء ",null,null,null,null,null,null,{"$f":"IF($J20=\"\",\"\",MATCH($J20,OFFSET(BASE!$C$5,,,MAX(BASE!$B:$B)),0))","v":1},{"$f":"IF($AA20=\"\",\"\",60*($AA20-1)+COUNTIF($AA$9:$AA20,$AA20))","v":12},"E1",1,"E",null,"موسى ",null," موسى "]
[17," ",1000313270127100,null,null,"ذكر","2003-06-16","مغنية","خارجي","3ت ر/هم",null,null,null,"ثالثة","تقني رياضي هندسة مدنية",1,17,"E1",null,"قرية اولاد الشارف مغنية ",null,null,null,null,null,null,{"$f":"IF($J21=\"\",\"\",MATCH($J21,OFFSET(BASE!$C$5,,,MAX(BASE!$B:$B)),0))","v":1},{"$f":"IF($AA21=\"\",\"\",60*($AA21-1)+COUNTIF($AA$9:$AA21,$AA21))","v":13},"E1",1,"E",null,"عبد الحميد ",null," عبد الحميد "]
[18," ",1000213270295100,null,null,"ذكر","2002-12-25","مغنية","خارجي","3ت ر/هم",null,null,null,"ثالثة","تقني رياضي هندسة مدنية",1,18,"E1",null,"قرية راس العصفور المصامدة  مغنية ",null,null,null,null,null,null,{"$f":"IF($J22=\"\",\"\",MATCH($J22,OFFSET(BASE!$C$5,,,MAX(BASE!$B:$B)),0))","v":1},{"$f":"IF($AA22=\"\",\"\",60*($AA22-1)+COUNTIF($AA$9:$AA22,$AA22))","v":14},"E1",1,"E",null,"محمد ",null," محمد "]
[19," ",1400513270205100,null,null,"ذكر","2005-07-22","مغنية","خارجي","3ت ر/هم",null,null,null,"ثالثة","تقني رياضي هندسة مدنية",1,19,"E1",null,null,null,null,null,null,null,null,{"$f":"IF($J23=\"\",\"\",MATCH($J23,OFFSET(BASE!$C$5,,,MAX(BASE!$B:$B)),0))","v":1},{"$f":"IF($AA23=\"\",\"\",60*($AA23-1)+COUNTIF($AA$9:$AA23,$AA23))","v":15},"E1",1,"E",null,null,null," "]
[20," ",1100513270277900,null,null,"أنثى","2005-09-20","مغنية","نصف داخلي","3ت ر/هك",null,null,null,"ثالثة","تقني رياضي هندسة كهربائية",1,20,"D2",null,"قرية أولاد الشارف - مغنية - ",null,null,null,null,"E1",null,{"$f":"IF($J24=\"\",\"\",MATCH($J24,OFFSET(BASE!$C$5,,,MAX(BASE!$B:$B)),0))","v":2},{"$f":"IF($AA24=\"\",\"\",60*($AA24-1)+COUNTIF($AA$9:$AA24,$AA24))","v":61},"D2",2,"D",null,"عبد الكريم ",null," عبد الكريم "]
[21," ",1000531010465600,null,null,"ذكر","2005-04-24","وهران","نصف داخلي","3ت ر/هك",null,null,null,"ثالثة","تقني رياضي هندسة كهربائية",1,21,"D1",null,"قرية العقيد لطفي مغنية ",null,null,null,null,null,null,{"$f":"IF($J25=\"\",\"\",MATCH($J25,OFFSET(BASE!$C$5,,,MAX(BASE!$B:$B)),0))","v":2},{"$f":"IF($AA25=\"\",\"\",60*($AA25-1)+COUNTIF($AA$9:$AA25,$AA25))","v":62},"D1",1,"D",null,"حامة ",null," حامة "]
[22," ",1100513270167600,null,null,"أنثى","2005-06-24","مغنية","نصف داخلي","3ت ر/هك",null,null,null,"ثالثة","تقني رياضي هندسة كهربائية",1,22,"D2",null,"حي الشهداء - مغنية -  ",null,null,null,null,null,null,{"$f":"IF($J26=\"\",\"\",MATCH($J26,OFFSET(BASE!$C$5,,,MAX(BASE!$B:$B)),0))","v":2},{"$f":"IF($AA26=\"\",\"\",60*($AA26-1)+COUNTIF($AA$9:$AA26,$AA26))","v":63},"D2",2,"D",null,"عبد الرحيم ",null," عبد الرحيم "]
[23," ",1000513270232200,null,null,"ذكر","2005-08-13","مغنية","نصف داخلي","3ت ر/هك",null,null,null,"ثالثة","تقني رياضي هندسة كهربائية",1,23,"D1",null,"قرية البطيم-مغنية- ",null,null,null,null,null,null,{"$f":"IF($J27=\"\",\"\",MATCH($J27,OFFSET(BASE!$C$5,,,MAX(BASE!$B:$B)),0))","v":2},{"$f":"IF($AA27=\"\",\"\",60*($AA27-1)+COUNTIF($AA$9:$AA27,$AA27))","v":64},"D1",1,"D",null,"فيصل ",null," فيصل "]
[24," ",1000313270107100,null,null,"ذكر","2003-05-25","مغنية","نصف داخلي","3ت ر/هك",null,null,null,"ثالثة","تقني رياضي هندسة كهربائية",1,24,"D1",null,"قرية الكفاف مغنية ",null,null,null,null,null,null,{"$f":"IF($J28=\"\",\"\",MATCH($J28,OFFSET(BASE!$C$5,,,MAX(BASE!$B:$B)),0))","v":2},{"$f":"IF($AA28=\"\",\"\",60*($AA28-1)+COUNTIF($AA$9:$AA28,$AA28))","v":65},"D1",1,"D",null,"خالد ",null," خالد "]
[25," ",1000513270247700,null,null,"ذكر","2005-08-24","مغنية","نصف داخلي","3ت ر/هك",null,null,null,"ثالثة","تقني رياضي هندسة كهربائية",1,25,"D1",null,"قرية أولاد الشارف - مغنية - ",null,null,null,null,null,null,{"$f":"IF($J29=\"\",\"\",MATCH($J29,OFFSET(BASE!$C$5,,,MAX(BASE!$B:$B)),0))","v":2},{"$f":"IF($AA29=\"\",\"\",60*($AA29-1)+COUNTIF($AA$9:$AA29,$AA29))","v":66},"D1",1,"D",null,"عبد الوهاب ",null," عبد الوهاب "]
[26," ",1000513270140100,null,null,"ذكر","2005-06-06","مغنية","نصف داخلي","3ت ر/هك",null,null,null,"ثالثة","تقني رياضي هندسة كهربائية",1,26,"D1",null,"حمام بوغرارة ",null,null,null,null,null,null,{"$f":"IF($J30=\"\",\"\",MATCH($J30,OFFSET(BASE!$C$5,,,MAX(BASE!$B:$B)),0))","v":2},{"$f":"IF($AA30=\"\",\"\",60*($AA30-1)+COUNTIF($AA$9:$AA30,$AA30))","v":67},"D1",1,"D",null,"سعيد ",null," سعيد "]
[27," ",1000522010131700,null,null,"ذكر","2005-03-10","سيدي بلعباس","نصف داخلي","3ت ر/هك",null,null,null,"ثالثة","تقني رياضي هندسة كهربائية",1,27,"D1",null,"حي 60مسكن مكمن بن عمار ",null,null,null,null,null,null,{"$f":"IF($J31=\"\",\"\",MATCH($J31,OFFSET(BASE!$C$5,,,MAX(BASE!$B:$B)),0))","v":2},{"$f":"IF($AA31=\"\",\"\",60*($AA31-1)+COUNTIF($AA$9:$AA31,$AA31))","v":68},"D1",1,"D",null,"بن عمر ",null," بن عمر "]
[28," ",1100413270338000,null,null,"ذكر","2004-12-07","مغنية","نصف داخلي","3ت ر/هك",null,null,null,"ثالثة","تقني رياضي هندسة كهربائية",1,28,"D1",null,"أولاد قدور الكبار مغنية ",null,null,null,null,null,null,{"$f":"IF($J32=\"\",\"\",MATCH($J32,OFFSET(BASE!$C$5,,,MAX(BASE!$B:$B)),0))","v":2},{"$f":"IF($AA32=\"\",\"\",60*($AA32-1)+COUNTIF($AA$9:$AA32,$AA32))","v":69},"D1",1,"D",null,"لخضر ",null," لخضر "]
[30," ",1100513270139200,null,null,"أنثى","2005-06-05","مغنية","نصف داخلي","3ت إ01",null,null,null,"ثالثة","تسيير واقتصاد ",1,30,"D2",null,"دوار المرازقة  مغنية ",null,null,null,null,null,null,{"$f":"IF($J33=\"\",\"\",MATCH($J33,OFFSET(BASE!$C$5,,,MAX(BASE!$B:$B)),0))","v":3},{"$f":"IF($AA33=\"\",\"\",60*($AA33-1)+COUNTIF($AA$9:$AA33,$AA33))","v":121},"D2",2,"D",null,"العربي ",null," العربي "]
[31," ",1000513270233400,null,null,"ذكر","2005-08-13","مغنية","نصف داخلي","3ت إ01",null,null,null,"ثالثة","تسيير واقتصاد ",1,31,"D1",null," ",null,null,null,null,null,null,{"$f":"IF($J34=\"\",\"\",MATCH($J34,OFFSET(BASE!$C$5,,,MAX(BASE!$B:$B)),0))","v":3},{"$f":"IF($AA34=\"\",\"\",60*($AA34-1)+COUNTIF($AA$9:$AA34,$AA34))","v":122},"D1",1,"D",null,"ميمون ",null," ميمون "]
[32," ",1100413270092900,null,null,"أنثى","2004-04-25","مغنية","نصف داخلي","3ت إ01",null,null,null,"ثالثة","تسيير واقتصاد ",1,32,"D2",null,"قرية البطيم مغنية ",null,null,null,null,null,null,{"$f":"IF($J35=\"\",\"\",MATCH($J35,OFFSET(BASE!$C$5,,,MAX(BASE!$B:$B)),0))","v":3},{"$f":"IF($AA35=\"\",\"\",60*($AA35-1)+COUNTIF($AA$9:$AA35,$AA35))","v":123},"D2",2,"D",null,"أحمد ",null," أحمد "]
[33," ",1100513270370400,null,null,"أنثى","2005-12-21","مغنية","نصف داخلي","3ت إ01",null,null,null,"ثالثة","تسيير واقتصاد ",1,33,"D2",null,"قرية اولاد الشارف  - مغنية - ",null,null,null,null,null,null,{"$f":"IF($J36=\"\",\"\",MATCH($J36,OFFSET(BASE!$C$5,,,MAX(BASE!$B:$B)),0))","v":3},{"$f":"IF($AA36=\"\",\"\",60*($AA36-1)+COUNTIF($AA$9:$AA36,$AA36))","v":124},"D2",2,"D",null,"علي ",null," علي "]
[34," ",1000413270200000,null,null,"ذكر","2004-07-27","مغنية","نصف داخلي","3ت إ01",null,null,null,"ثالثة","تسيير واقتصاد ",1,34,"D1",null,"الجرابعة مغنية ",null,null,null,null,null,null,{"$f":"IF($J37=\"\",\"\",MATCH($J37,OFFSET(BASE!$C$5,,,MAX(BASE!$B:$B)),0))","v":3},{"$f":"IF($AA37=\"\",\"\",60*($AA37-1)+COUNTIF($AA$9:$AA37,$AA37))","v":125},"D1",1,"D",null,"محمد صغير ",null," محمد صغير "]
[35," ",1000413270277000,null,null,"ذكر","2004-10-09","مغنية","نصف داخلي","3ت إ01",null,null,null,"ثالثة","تسيير واقتصاد ",1,35,"D1",null," ",null,null,null,null,null,null,{"$f":"IF($J38=\"\",\"\",MATCH($J38,OFFSET(BASE!$C$5,,,MAX(BASE!$B:$B)),0))","v":3},{"$f":"IF($AA38=\"\",\"\",60*($AA38-1)+COUNTIF($AA$9:$AA38,$AA38))","v":126},"D1",1,"D",null,"عبد الرحمن ",null," عبد الرحمن "]
[36," ",1100513270007600,null,null,"أنثى","2005-01-08","مغنية","نصف داخلي","3ت إ01",null,null,null,"ثالثة","تسيير واقتصاد ",1,36,"D2",null,"التلالسة ",null,null,null,null,null,null,{"$f":"IF($J39=\"\",\"\",MATCH($J39,OFFSET(BASE!$C$5,,,MAX(BASE!$B:$B)),0))","v":3},{"$f":"IF($AA39=\"\",\"\",60*($AA39-1)+COUNTIF($AA$9:$AA39,$AA39))","v":127},"D2",2,"D",null,"مصطفى ",null," مصطفى "]
[37," ",1100613270013900,null,null,"أنثى","2006-01-15","مغنية","نصف داخلي","3ت إ01",null,null,null,"ثالثة","تسيير واقتصاد ",1,37,"D2",null,"محطة البنزين بلدية حمام بوغرارة ",null,null,null,null,null,null,{"$f":"IF($J40=\"\",\"\",MATCH($J40,OFFSET(BASE!$C$5,,,MAX(BASE!$B:$B)),0))","v":3},{"$f":"IF($AA40=\"\",\"\",60*($AA40-1)+COUNTIF($AA$9:$AA40,$AA40))","v":128},"D2",2,"D",null,"لخضر ",null," لخضر "]
[38," ",1100413270250600,null,null,"أنثى","2004-09-14","مغنية","نصف داخلي","3ت إ01",null,null,null,"ثالثة","تسيير واقتصاد ",1,38,"D2",null,"قرية بوسدرة - البخاتة ",null,null,null,null,null,null,{"$f":"IF($J41=\"\",\"\",MATCH($J41,OFFSET(BASE!$C$5,,,MAX(BASE!$B:$B)),0))","v":3},{"$f":"IF($AA41=\"\",\"\",60*($AA41-1)+COUNTIF($AA$9:$AA41,$AA41))","v":129},"D2",2,"D",null,"ابراهيم ",null," ابراهيم "]
[39," ",1000413270122200,null,null,"ذكر","2004-05-27","مغنية","نصف داخلي","3ت إ01",null,null,null,"ثالثة","تسيير واقتصاد ",1,39,"D1",null,"قرية المصامدة مغنية ",null,null,null,null,null,null,{"$f":"IF($J42=\"\",\"\",MATCH($J42,OFFSET(BASE!$C$5,,,MAX(BASE!$B:$B)),0))","v":3},{"$f":"IF($AA42=\"\",\"\",60*($AA42-1)+COUNTIF($AA$9:$AA42,$AA42))","v":130},"D1",1,"D",null,"فريد ",null," فريد "]
[40," ",1100513270297000,null,null,"أنثى","2005-10-07","مغنية","نصف داخلي","3ت إ01",null,null,null,"ثالثة","تسيير واقتصاد ",1,40,"D2",null,"قرية اولاد الشارف - مغنية - ",null,null,null,null,null,null,{"$f":"IF($J43=\"\",\"\",MATCH($J43,OFFSET(BASE!$C$5,,,MAX(BASE!$B:$B)),0))","v":3},{"$f":"IF($AA43=\"\",\"\",60*($AA43-1)+COUNTIF($AA$9:$AA43,$AA43))","v":131},"D2",2,"D",null,"مصطفى ",null," مصطفى "]
[41,{"$f":"D44& \" \" &E44","v":" "},1100413270347200,null,null,"أنثى","2004-12-18","مغنية","نصف داخلي","3ت إ01",null,null,null,"ثالثة","تسيير واقتصاد ",1,41,"D2",null,"قرية المصامدة  - مغنية - ",null,null,null,null,null,null,{"$f":"IF($J44=\"\",\"\",MATCH($J44,OFFSET(BASE!$C$5,,,MAX(BASE!$B:$B)),0))","v":3},{"$f":"IF($AA44=\"\",\"\",60*($AA44-1)+COUNTIF($AA$9:$AA44,$AA44))","v":132},"D2",2,"D",null,"أحمد ",null," أحمد "]
[42," ",1100413270098500,null,null,"أنثى","2004-05-02","مغنية","نصف داخلي","3ت إ01",null,null,null,"ثالثة","تسيير واقتصاد ",1,42,"D2",null,null,null,null,null,null,null,null,{"$f":"IF($J45=\"\",\"\",MATCH($J45,OFFSET(BASE!$C$5,,,MAX(BASE!$B:$B)),0))","v":3},{"$f":"IF($AA45=\"\",\"\",60*($AA45-1)+COUNTIF($AA$9:$AA45,$AA45))","v":133},"D2",2,"D",null,null,null," "]
[43," ",1100513270017600,null,null,"أنثى","2005-01-19","مغنية","نصف داخلي","3ت إ01",null,null,null,"ثالثة","تسيير واقتصاد ",1,43,"D2",null,"قرية البطيم-مغنية- ",null,null,null,null,null,null,{"$f":"IF($J46=\"\",\"\",MATCH($J46,OFFSET(BASE!$C$5,,,MAX(BASE!$B:$B)),0))","v":3},{"$f":"IF($AA46=\"\",\"\",60*($AA46-1)+COUNTIF($AA$9:$AA46,$AA46))","v":134},"D2",2,"D",null,"محمد ",null," محمد "]
[44," ",1000513270257300,null,null,"ذكر","2005-08-31","مغنية","نصف داخلي","3ت إ01",null,null,null,"ثالثة","تسيير واقتصاد ",1,44,"D1",null,"قرية المصامدة - مغنية - تلمسان ",null,null,null,null,null,null,{"$f":"IF($J47=\"\",\"\",MATCH($J47,OFFSET(BASE!$C$5,,,MAX(BASE!$B:$B)),0))","v":3},{"$f":"IF($AA47=\"\",\"\",60*($AA47-1)+COUNTIF($AA$9:$AA47,$AA47))","v":135},"D1",1,"D",null,"هبري ",null," هبري "]
[45," ",1000522010076400,null,null,"ذكر","2004-02-07","سيدي بلعباس","نصف داخلي","3ت إ01",null,null,null,"ثالثة","تسيير واقتصاد ",1,45,"D1",null,"قرية البطيم مغنية ",null,null,null,null,null,null,{"$f":"IF($J48=\"\",\"\",MATCH($J48,OFFSET(BASE!$C$5,,,MAX(BASE!$B:$B)),0))","v":3},{"$f":"IF($AA48=\"\",\"\",60*($AA48-1)+COUNTIF($AA$9:$AA48,$AA48))","v":136},"D1",1,"D",null,"لخضر ",null," لخضر "]
[46," ",1000413270187400,null,null,"ذكر","2004-07-17","مغنية","نصف داخلي","3ت إ01",null,null,null,"ثالثة","تسيير واقتصاد ",1,46,"D1",null,"قرية البطيم مغنية ",null,null,null,null,null,null,{"$f":"IF($J49=\"\",\"\",MATCH($J49,OFFSET(BASE!$C$5,,,MAX(BASE!$B:$B)),0))","v":3},{"$f":"IF($AA49=\"\",\"\",60*($AA49-1)+COUNTIF($AA$9:$AA49,$AA49))","v":137},"D1",1,"D",null,"حمدون ",null," حمدون "]
[47," ",1100513270976400,null,null,"أنثى","2005-10-26","مغنية","نصف داخلي","3ت إ01",null,null,null,"ثالثة","تسيير واقتصاد ",1,47,"D2",null,"قرية اولاد الشارف - مغنية -  ",null,null,null,null,null,null,{"$f":"IF($J50=\"\",\"\",MATCH($J50,OFFSET(BASE!$C$5,,,MAX(BASE!$B:$B)),0))","v":3},{"$f":"IF($AA50=\"\",\"\",60*($AA50-1)+COUNTIF($AA$9:$AA50,$AA50))","v":138},"D2",2,"D",null,"علي ",null," علي "]
[48," ",1000513270255900,null,null,"ذكر","2005-08-30","مغنية","نصف داخلي","3ت إ01",null,null,null,"ثالثة","تسيير واقتصاد ",1,48,"D1",null,"قرية المصامدة - مغنية - تلمسان ",null,null,null,null,null,null,{"$f":"IF($J51=\"\",\"\",MATCH($J51,OFFSET(BASE!$C$5,,,MAX(BASE!$B:$B)),0))","v":3},{"$f":"IF($AA51=\"\",\"\",60*($AA51-1)+COUNTIF($AA$9:$AA51,$AA51))","v":139},"D1",1,"D",null,"محمد ",null," محمد "]
[49," ",1100413270228600,null,null,"أنثى","2004-08-22","مغنية","نصف داخلي","3ت إ01",null,null,null,"ثالثة","تسيير واقتصاد ",1,null,"D2",null,"اولاد الشارف ",null,null,null,null,null,null,{"$f":"IF($J52=\"\",\"\",MATCH($J52,OFFSET(BASE!$C$5,,,MAX(BASE!$B:$B)),0))","v":3},{"$f":"IF($AA52=\"\",\"\",60*($AA52-1)+COUNTIF($AA$9:$AA52,$AA52))","v":140},"D2",2,"D",null,"عبد الرحيم ",null," عبد الرحيم "]
[50," ",1100413270129100,null,null,"أنثى","2004-06-01","مغنية","نصف داخلي","3ت إ01",null,null,null,"ثالثة","تسيير واقتصاد ",1,50,"D2",null,"المصامدة ",null,null,null,null,null,null,{"$f":"IF($J53=\"\",\"\",MATCH($J53,OFFSET(BASE!$C$5,,,MAX(BASE!$B:$B)),0))","v":3},{"$f":"IF($AA53=\"\",\"\",60*($AA53-1)+COUNTIF($AA$9:$AA53,$AA53))","v":141},"D2",2,"D",null,"محمد عبد الباسط ",null," محمد عبد الباسط "]
[51," ",1100413270486200,null,null,"أنثى","2004-09-18","مغنية","خارجي","3ت إ01",null,null,null,"ثالثة","تسيير واقتصاد ",1,51,"E2",null,null,null,null,null,null,null,null,{"$f":"IF($J54=\"\",\"\",MATCH($J54,OFFSET(BASE!$C$5,,,MAX(BASE!$B:$B)),0))","v":3},{"$f":"IF($AA54=\"\",\"\",60*($AA54-1)+COUNTIF($AA$9:$AA54,$AA54))","v":142},"E2",2,"E",null,null,null," "]
[52," ",1000216170224300,null,null,"ذكر","2002-06-27","حسين داي","خارجي","3ت إ01",null,null,null,"ثالثة","تسيير واقتصاد ",1,52,"E1",null,"رقم 06 حي الشهداء مغنية ",null,null,null,null,null,null,{"$f":"IF($J55=\"\",\"\",MATCH($J55,OFFSET(BASE!$C$5,,,MAX(BASE!$B:$B)),0))","v":3},{"$f":"IF($AA55=\"\",\"\",60*($AA55-1)+COUNTIF($AA$9:$AA55,$AA55))","v":143},"E1",1,"E",null,"احمد ",null," احمد "]
[53," ",1000513270251800,null,null,"ذكر","2005-08-28","مغنية","خارجي","3ت إ01",null,null,null,"ثالثة","تسيير واقتصاد ",1,53,"E1",null,"شارع  رقم 05 حي الشهداء - مغنية -  ",null,null,null,null,null,null,{"$f":"IF($J56=\"\",\"\",MATCH($J56,OFFSET(BASE!$C$5,,,MAX(BASE!$B:$B)),0))","v":3},{"$f":"IF($AA56=\"\",\"\",60*($AA56-1)+COUNTIF($AA$9:$AA56,$AA56))","v":144},"E1",1,"E",null,"محمد ",null," محمد "]
[54," ",1000213270167800,null,null,"ذكر","2002-05-05","مغنية","خارجي","3ت إ01",null,null,null,"ثالثة","تسيير واقتصاد ",1,54,"E1",null,"قرية البخاتة مغنية ",null,null,null,null,null,null,{"$f":"IF($J57=\"\",\"\",MATCH($J57,OFFSET(BASE!$C$5,,,MAX(BASE!$B:$B)),0))","v":3},{"$f":"IF($AA57=\"\",\"\",60*($AA57-1)+COUNTIF($AA$9:$AA57,$AA57))","v":145},"E1",1,"E",null,"عبدالقادر ",null," عبدالقادر "]
[55," ",1100413270252400,null,null,"أنثى","2004-09-16","مغنية","خارجي","3ت إ01",null,null,null,"ثالثة","تسيير واقتصاد ",1,55,"E2",null,"شارع 25 رقم04حي الشهداء ",null,null,null,null,null,null,{"$f":"IF($J58=\"\",\"\",MATCH($J58,OFFSET(BASE!$C$5,,,MAX(BASE!$B:$B)),0))","v":3},{"$f":"IF($AA58=\"\",\"\",60*($AA58-1)+COUNTIF($AA$9:$AA58,$AA58))","v":146},"E2",2,"E",null,"مصطفى ",null," مصطفى "]
[56," ",1000313270130100,null,null,"ذكر","2003-06-18","مغنية","خارجي","3ت إ01",null,null,null,"ثالثة","تسيير واقتصاد ",1,56,"E1",null,"قرية أولاد الشارف مغنية ",null,null,null,null,null,null,{"$f":"IF($J59=\"\",\"\",MATCH($J59,OFFSET(BASE!$C$5,,,MAX(BASE!$B:$B)),0))","v":3},{"$f":"IF($AA59=\"\",\"\",60*($AA59-1)+COUNTIF($AA$9:$AA59,$AA59))","v":147},"E1",1,"E",null,"عثمان ",null," عثمان "]
[57," ",1000313270289100,null,null,"ذكر","2003-12-14","مغنية","خارجي","3ت إ01",null,null,null,"ثالثة","تسيير واقتصاد ",1,57,"E1",null,"طريق تلمسان رقم 16 حي بلال مغنية ",null,null,null,null,null,null,{"$f":"IF($J60=\"\",\"\",MATCH($J60,OFFSET(BASE!$C$5,,,MAX(BASE!$B:$B)),0))","v":3},{"$f":"IF($AA60=\"\",\"\",60*($AA60-1)+COUNTIF($AA$9:$AA60,$AA60))","v":148},"E1",1,"E",null,"ميمون ",null," ميمون "]
[58," ",1100413270320500,null,null,"أنثى","2004-11-21","مغنية","خارجي","3ت إ01",null,null,null,"ثالثة","تسيير واقتصاد ",1,58,"E2",null,"قرية لكفاف مغنية ",null,null,null,null,null,null,{"$f":"IF($J61=\"\",\"\",MATCH($J61,OFFSET(BASE!$C$5,,,MAX(BASE!$B:$B)),0))","v":3},{"$f":"IF($AA61=\"\",\"\",60*($AA61-1)+COUNTIF($AA$9:$AA61,$AA61))","v":149},"E2",2,"E",null,"نور الدين ",null," نور الدين "]
[59," ",1100522010403600,null,null,"أنثى","2005-07-01","سيدي بلعباس","نصف داخلي","3ع ت01",null,null,null,"ثالثة","علوم تجريبية ",1,59,"D2",null,"بلحاجي بوسيف ",null,null,null,null,null,null,{"$f":"IF($J62=\"\",\"\",MATCH($J62,OFFSET(BASE!$C$5,,,MAX(BASE!$B:$B)),0))","v":4},{"$f":"IF($AA62=\"\",\"\",60*($AA62-1)+COUNTIF($AA$9:$AA62,$AA62))","v":181},"D2",2,"D",null,"قدور ",null," قدور "]
[60," ",1100513270086900,null,null,"أنثى","2005-04-18","مغنية","نصف داخلي","3ع ت01",null,null,null,"ثالثة","علوم تجريبية ",1,60,"D2",null,"دوار المرازقة  - مغنية - ",null,null,null,null,null,null,{"$f":"IF($J63=\"\",\"\",MATCH($J63,OFFSET(BASE!$C$5,,,MAX(BASE!$B:$B)),0))","v":4},{"$f":"IF($AA63=\"\",\"\",60*($AA63-1)+COUNTIF($AA$9:$AA63,$AA63))","v":182},"D2",2,"D",null,"يزيد ",null," يزيد "]
[61," ",1100613270069400,null,null,"أنثى","2006-03-23","مغنية","نصف داخلي","3ع ت01",null,null,null,"ثالثة","علوم تجريبية ",1,61,"D2",null,"قرية البطيم-مغنية- ",null,null,null,null,null,null,{"$f":"IF($J64=\"\",\"\",MATCH($J64,OFFSET(BASE!$C$5,,,MAX(BASE!$B:$B)),0))","v":4},{"$f":"IF($AA64=\"\",\"\",60*($AA64-1)+COUNTIF($AA$9:$AA64,$AA64))","v":183},"D2",2,"D",null,"عبد المجيد ",null," عبد المجيد "]
[62," ",1100513270104900,null,null,"أنثى","2005-05-03","مغنية","نصف داخلي","3ع ت01",null,null,null,"ثالثة","علوم تجريبية ",1,62,"D2",null,"قرية أولاد الشارف -مغنية- ",null,null,null,null,null,null,{"$f":"IF($J65=\"\",\"\",MATCH($J65,OFFSET(BASE!$C$5,,,MAX(BASE!$B:$B)),0))","v":4},{"$f":"IF($AA65=\"\",\"\",60*($AA65-1)+COUNTIF($AA$9:$AA65,$AA65))","v":184},"D2",2,"D",null,"حليم ",null," حليم "]
[63," ",1000613270001700,null,null,"ذكر","2006-01-02","مغنية","نصف داخلي","3ع ت01",null,null,null,"ثالثة","علوم تجريبية ",1,63,"D1",null,"قرية أولاد الشارف - مغنية - ",null,null,null,null,null,null,{"$f":"IF($J66=\"\",\"\",MATCH($J66,OFFSET(BASE!$C$5,,,MAX(BASE!$B:$B)),0))","v":4},{"$f":"IF($AA66=\"\",\"\",60*($AA66-1)+COUNTIF($AA$9:$AA66,$AA66))","v":185},"D1",1,"D",null,"عبد القادر ",null," عبد القادر "]
[64," ",1100613010079100,null,null,"أنثى","2006-02-02","تلمسان","نصف داخلي","3ع ت01",null,null,null,"ثالثة","علوم تجريبية ",1,64,"D2",null,"قرية أولاد الشارف  - مغنية -  ",null,null,null,null,null,null,{"$f":"IF($J67=\"\",\"\",MATCH($J67,OFFSET(BASE!$C$5,,,MAX(BASE!$B:$B)),0))","v":4},{"$f":"IF($AA67=\"\",\"\",60*($AA67-1)+COUNTIF($AA$9:$AA67,$AA67))","v":186},"D2",2,"D",null,"عبد القادر ",null," عبد القادر "]
[65," ",1100513010209200,null,null,"أنثى","2005-04-11","تلمسان","نصف داخلي","3ع ت01",null,null,null,"ثالثة","علوم تجريبية ",1,65,"D2",null,"قرية البطيم مغنية ",null,null,null,null,null,null,{"$f":"IF($J68=\"\",\"\",MATCH($J68,OFFSET(BASE!$C$5,,,MAX(BASE!$B:$B)),0))","v":4},{"$f":"IF($AA68=\"\",\"\",60*($AA68-1)+COUNTIF($AA$9:$AA68,$AA68))","v":187},"D2",2,"D",null,"عيسى ",null," عيسى "]
[66," ",1000513270267900,null,null,"ذكر","2005-09-11","مغنية","نصف داخلي","3ع ت01",null,null,null,"ثالثة","علوم تجريبية ",1,66,"D1",null,"قرية المصامدة - مغنية - تلمسان ",null,null,null,null,null,null,{"$f":"IF($J69=\"\",\"\",MATCH($J69,OFFSET(BASE!$C$5,,,MAX(BASE!$B:$B)),0))","v":4},{"$f":"IF($AA69=\"\",\"\",60*($AA69-1)+COUNTIF($AA$9:$AA69,$AA69))","v":188},"D1",1,"D",null,"عبد القادر ",null," عبد القادر "]
[67," ",1100313270266700,null,null,"أنثى","2003-11-15","مغنية","نصف داخلي","3ع ت01",null,null,null,"ثالثة","علوم تجريبية ",1,67,"D2",null,"قري ال ",null,null,null,null,null,null,{"$f":"IF($J70=\"\",\"\",MATCH($J70,OFFSET(BASE!$C$5,,,MAX(BASE!$B:$B)),0))","v":4},{"$f":"IF($AA70=\"\",\"\",60*($AA70-1)+COUNTIF($AA$9:$AA70,$AA70))","v":189},"D2",2,"D",null,"يحيى ",null," يحيى "]
[68," ",1000513270218100,null,null,"ذكر","2005-07-31","مغنية","نصف داخلي","3ع ت01",null,null,null,"ثالثة","علوم تجريبية ",1,68,"D1",null,"حمام بوغرارة  ",null,null,null,null,null,null,{"$f":"IF($J71=\"\",\"\",MATCH($J71,OFFSET(BASE!$C$5,,,MAX(BASE!$B:$B)),0))","v":4},{"$f":"IF($AA71=\"\",\"\",60*($AA71-1)+COUNTIF($AA$9:$AA71,$AA71))","v":190},"D1",1,"D",null,"بشير ",null," بشير "]
[69," ",1100513270303700,null,null,"أنثى","2005-10-13","مغنية","نصف داخلي","3ع ت01",null,null,null,"ثالثة","علوم تجريبية ",1,69,"D2",null,"قرية المصامدة - مغنية - تلمسان ",null,null,null,null,null,null,{"$f":"IF($J72=\"\",\"\",MATCH($J72,OFFSET(BASE!$C$5,,,MAX(BASE!$B:$B)),0))","v":4},{"$f":"IF($AA72=\"\",\"\",60*($AA72-1)+COUNTIF($AA$9:$AA72,$AA72))","v":191},"D2",2,"D",null,"عبد القادر ",null," عبد القادر "]
[70," ",1000513270341800,null,null,"ذكر","2005-11-20","مغنية","نصف داخلي","3ع ت01",null,null,null,"ثالثة","علوم تجريبية ",1,70,"D1",null,"قرية العقيد لطفي ",null,null,null,null,null,null,{"$f":"IF($J73=\"\",\"\",MATCH($J73,OFFSET(BASE!$C$5,,,MAX(BASE!$B:$B)),0))","v":4},{"$f":"IF($AA73=\"\",\"\",60*($AA73-1)+COUNTIF($AA$9:$AA73,$AA73))","v":192},"D1",1,"D",null,"محمد ",null,{"$f":"D73 & \" \" & AG73","v":" محمد "}]
[71," ",1000413270242400,null,null,"ذكر","2004-09-06","مغنية","نصف داخلي","3ع ت01",null,null,null,"ثالثة","علوم تجريبية ",1,71,"D1",null,"قرية العقيد عباس مغنية تلمسان ",null,null,null,null,null,null,{"$f":"IF($J74=\"\",\"\",MATCH($J74,OFFSET(BASE!$C$5,,,MAX(BASE!$B:$B)),0))","v":4},{"$f":"IF($AA74=\"\",\"\",60*($AA74-1)+COUNTIF($AA$9:$AA74,$AA74))","v":193},{"$f":"AE74&AD74","v":"D1"},{"$f":"IF(F74=\"أنثى\",2,1)","v":1},{"$f":"IF(I74=\"نصف داخلي\",\"D\",\"E\")","v":"D"},null,"عبد القادر ",null," عبد القادر "]
[72," ",1100513270334500,null,null,"أنثى","2004-07-02","مغنية","نصف داخلي","3ع ت01",null,null,null,"ثالثة","علوم تجريبية ",1,72,"D2",null,"رقم 01 شارع 109حي الأمير عبد القادر مغنية ",null,null,null,null,null,null,{"$f":"IF($J75=\"\",\"\",MATCH($J75,OFFSET(BASE!$C$5,,,MAX(BASE!$B:$B)),0))","v":4},{"$f":"IF($AA75=\"\",\"\",60*($AA75-1)+COUNTIF($AA$9:$AA75,$AA75))","v":194},"D2",2,"D",null,"سوداني ",null," سوداني "]
[73,{"$f":"D76& \" \" &E76","v":" "},1100413270166400,null,null,"أنثى","2005-11-13","مغنية","نصف داخلي","3ع ت01",null,null,null,"ثالثة","علوم تجريبية ",1,73,"D2",null,"الشارع رقم 09 منزل 1 حي الأمير عبد القادر ",null,null,null,null,null,null,{"$f":"IF($J76=\"\",\"\",MATCH($J76,OFFSET(BASE!$C$5,,,MAX(BASE!$B:$B)),0))","v":4},{"$f":"IF($AA76=\"\",\"\",60*($AA76-1)+COUNTIF($AA$9:$AA76,$AA76))","v":195},"D2",2,"D",null,"نور الدين ",null," نور الدين "]
[74," ",1100413270308300,null,null,"أنثى","2004-11-08","مغنية","نصف داخلي","3ع ت01",null,null,null,"ثالثة","علوم تجريبية ",1,74,"D2",null,"أولاد الشارف مغنية ",null,null,null,null,null,null,{"$f":"IF($J77=\"\",\"\",MATCH($J77,OFFSET(BASE!$C$5,,,MAX(BASE!$B:$B)),0))","v":4},{"$f":"IF($AA77=\"\",\"\",60*($AA77-1)+COUNTIF($AA$9:$AA77,$AA77))","v":196},"D2",2,"D",null,"زيان ",null," زيان "]
[75," ",1100413270089600,null,null,"أنثى","2004-04-20","مغنية","نصف داخلي","3ع ت01",null,null,null,"ثالثة","علوم تجريبية ",1,75,"D2",null,"قرية البخاتة مغنية ",null,null,null,null,null,null,{"$f":"IF($J78=\"\",\"\",MATCH($J78,OFFSET(BASE!$C$5,,,MAX(BASE!$B:$B)),0))","v":4},{"$f":"IF($AA78=\"\",\"\",60*($AA78-1)+COUNTIF($AA$9:$AA78,$AA78))","v":197},"D2",2,"D",null,"محمد ",null," محمد "]
[76," ",1100513270049700,null,null,"أنثى","2005-02-27","مغنية","نصف داخلي","3ع ت01",null,null,null,"ثالثة","علوم تجريبية ",1,76,"D2",null,"بونعايم ",null,null,null,null,null,null,{"$f":"IF($J79=\"\",\"\",MATCH($J79,OFFSET(BASE!$C$5,,,MAX(BASE!$B:$B)),0))","v":4},{"$f":"IF($AA79=\"\",\"\",60*($AA79-1)+COUNTIF($AA$9:$AA79,$AA79))","v":198},"D2",2,"D",null,"عبد القادر ",null," عبد القادر "]
[77," ",1100513270792600,null,null,"أنثى","2005-08-08","مغنية","نصف داخلي","3ع ت01",null,null,null,"ثالثة","علوم تجريبية ",1,77,"D2",null,"قرية اولاد الشارف - مغنية -  ",null,null,null,null,null,null,{"$f":"IF($J80=\"\",\"\",MATCH($J80,OFFSET(BASE!$C$5,,,MAX(BASE!$B:$B)),0))","v":4},{"$f":"IF($AA80=\"\",\"\",60*($AA80-1)+COUNTIF($AA$9:$AA80,$AA80))","v":199},"D2",2,"D",null,"محمد ",null," محمد "]
[78," ",1100513270122400,null,null,"أنثى","2005-05-23","مغنية","نصف داخلي","3ع ت01",null,null,null,"ثالثة","علوم تجريبية ",1,78,"D2",null,"قرية البخاتة - مغنية -  ",null,null,null,null,null,null,{"$f":"IF($J81=\"\",\"\",MATCH($J81,OFFSET(BASE!$C$5,,,MAX(BASE!$B:$B)),0))","v":4},{"$f":"IF($AA81=\"\",\"\",60*($AA81-1)+COUNTIF($AA$9:$AA81,$AA81))","v":200},"D2",2,"D",null,"بن اعمر ",null," بن اعمر "]
[79," ",1100513270017300,null,null,"أنثى","2005-01-19","مغنية","نصف داخلي","3ع ت01",null,null,null,"ثالثة","علوم تجريبية ",1,79,"D2",null,"أولاد الشارف مغنية ",null,null,null,null,null,null,{"$f":"IF($J82=\"\",\"\",MATCH($J82,OFFSET(BASE!$C$5,,,MAX(BASE!$B:$B)),0))","v":4},{"$f":"IF($AA82=\"\",\"\",60*($AA82-1)+COUNTIF($AA$9:$AA82,$AA82))","v":201},"D2",2,"D",null,"أحمد ",null," أحمد "]
[80," ",1000531011588700,null,null,"ذكر","2005-12-26","وهران","نصف داخلي","3ع ت01",null,null,null,"ثالثة","علوم تجريبية ",1,80,"D1",null,"قرية البطيم-مغنية- ",null,null,null,null,null,null,{"$f":"IF($J83=\"\",\"\",MATCH($J83,OFFSET(BASE!$C$5,,,MAX(BASE!$B:$B)),0))","v":4},{"$f":"IF($AA83=\"\",\"\",60*($AA83-1)+COUNTIF($AA$9:$AA83,$AA83))","v":202},"D1",1,"D",null,"سفبان ",null," سفبان "]
[81," ",1000413270116800,null,null,"ذكر","2004-05-22","مغنية","نصف داخلي","3ع ت01",null,null,null,"ثالثة","علوم تجريبية ",1,81,"D1",null,"أولاد الشارف مغنية ",null,null,null,null,null,null,{"$f":"IF($J84=\"\",\"\",MATCH($J84,OFFSET(BASE!$C$5,,,MAX(BASE!$B:$B)),0))","v":4},{"$f":"IF($AA84=\"\",\"\",60*($AA84-1)+COUNTIF($AA$9:$AA84,$AA84))","v":203},"D1",1,"D",null,"جواد ",null," جواد "]
[82," ",1000513270298600,null,null,"ذكر","2005-10-09","مغنية","نصف داخلي","3ع ت01",null,null,null,"ثالثة","علوم تجريبية ",1,82,"D1",null,"قرية البطيم-مغنية- ",null,null,null,null,null,null,{"$f":"IF($J85=\"\",\"\",MATCH($J85,OFFSET(BASE!$C$5,,,MAX(BASE!$B:$B)),0))","v":4},{"$f":"IF($AA85=\"\",\"\",60*($AA85-1)+COUNTIF($AA$9:$AA85,$AA85))","v":204},"D1",1,"D",null,"أحمد ",null," أحمد "]
[83," ",1100513270206100,null,null,"أنثى","2005-07-23","مغنية","نصف داخلي","3ع ت01",null,null,null,"ثالثة","علوم تجريبية ",1,83,"D2",null,"حي القاضي ",null,null,null,null,null,null,{"$f":"IF($J86=\"\",\"\",MATCH($J86,OFFSET(BASE!$C$5,,,MAX(BASE!$B:$B)),0))","v":4},{"$f":"IF($AA86=\"\",\"\",60*($AA86-1)+COUNTIF($AA$9:$AA86,$AA86))","v":205},"D2",2,"D",null,"محمد ",null," محمد "]
[84," ",1100513270022100,null,null,"أنثى","2005-01-25","مغنية","نصف داخلي","3ع ت01",null,null,null,"ثالثة","علوم تجريبية ",1,84,"D2",null,"قرية البطيم-مغنية- ",null,null,null,null,null,null,{"$f":"IF($J87=\"\",\"\",MATCH($J87,OFFSET(BASE!$C$5,,,MAX(BASE!$B:$B)),0))","v":4},{"$f":"IF($AA87=\"\",\"\",60*($AA87-1)+COUNTIF($AA$9:$AA87,$AA87))","v":206},"D2",2,"D",null,"مصطفى ",null," مصطفى "]
[85," ",1000513270147400,null,null,"ذكر","2005-06-11","مغنية","نصف داخلي","3ع ت01",null,null,null,"ثالثة","علوم تجريبية ",1,85,"D1",null,"قرية البطيم مغنية ",null,null,null,null,null,null,{"$f":"IF($J88=\"\",\"\",MATCH($J88,OFFSET(BASE!$C$5,,,MAX(BASE!$B:$B)),0))","v":4},{"$f":"IF($AA88=\"\",\"\",60*($AA88-1)+COUNTIF($AA$9:$AA88,$AA88))","v":207},"D1",1,"D",null,"بن أعمر ",null," بن أعمر "]
[86," ",1100514150063900,null,null,"أنثى","2005-05-31","مهدية","نصف داخلي","3ع ت01",null,null,null,"ثالثة","علوم تجريبية ",1,86,"D2",null,"قرية العقيد عباس - مغنية -  ",null,null,null,null,null,null,{"$f":"IF($J89=\"\",\"\",MATCH($J89,OFFSET(BASE!$C$5,,,MAX(BASE!$B:$B)),0))","v":4},{"$f":"IF($AA89=\"\",\"\",60*($AA89-1)+COUNTIF($AA$9:$AA89,$AA89))","v":208},"D2",2,"D",null,"امحمد ",null," امحمد "]
[87," ",1100413270311600,null,null,"أنثى","2004-11-13","مغنية","خارجي","3ع ت01",null,null,null,"ثالثة","علوم تجريبية ",1,87,"E2",null,"41 حي بلال مغنية ",null,null,null,null,null,null,{"$f":"IF($J90=\"\",\"\",MATCH($J90,OFFSET(BASE!$C$5,,,MAX(BASE!$B:$B)),0))","v":4},{"$f":"IF($AA90=\"\",\"\",60*($AA90-1)+COUNTIF($AA$9:$AA90,$AA90))","v":209},"E2",2,"E",null,"عبد القادر ",null," عبد القادر "]
[88," ",1000313270214800,null,null,"ذكر","2003-09-15","مغنية","خارجي","3ع ت01",null,null,null,"ثالثة","علوم تجريبية ",1,88,"E1",null,"حي الشهداء مغنية ",null,null,null,null,null,null,{"$f":"IF($J91=\"\",\"\",MATCH($J91,OFFSET(BASE!$C$5,,,MAX(BASE!$B:$B)),0))","v":4},{"$f":"IF($AA91=\"\",\"\",60*($AA91-1)+COUNTIF($AA$9:$AA91,$AA91))","v":210},"E1",1,"E",null,"عبدالقادر ",null," عبدالقادر "]
[89," ",1100513270256700,null,null,"أنثى","2005-08-31","مغنية","خارجي","3ع ت01",null,null,null,"ثالثة","علوم تجريبية ",1,89,"E2",null,"طريق المسبح البلدي - حي الشهداء - مغنية -  ",null,null,null,null,null,null,{"$f":"IF($J92=\"\",\"\",MATCH($J92,OFFSET(BASE!$C$5,,,MAX(BASE!$B:$B)),0))","v":4},{"$f":"IF($AA92=\"\",\"\",60*($AA92-1)+COUNTIF($AA$9:$AA92,$AA92))","v":211},"E2",2,"E",null,"احمد ",null," احمد "]
[90," ",1000513270337600,null,null,"ذكر","2005-11-16","مغنية","خارجي","3ع ت01",null,null,null,"ثالثة","علوم تجريبية ",1,90,"E1",null,"قرية المصامدة - مغنية - تلمسان ",null,null,null,null,null,null,{"$f":"IF($J93=\"\",\"\",MATCH($J93,OFFSET(BASE!$C$5,,,MAX(BASE!$B:$B)),0))","v":4},{"$f":"IF($AA93=\"\",\"\",60*($AA93-1)+COUNTIF($AA$9:$AA93,$AA93))","v":212},"E1",1,"E",null,"ميلود ",null," ميلود "]
[91," ",1000413270111200,null,null,"ذكر","2004-05-17","مغنية","خارجي","3ع ت01",null,null,null,"ثالثة","علوم تجريبية ",1,91,"E1",null,"حي بلال مغنية ",null,null,null,null,null,null,{"$f":"IF($J94=\"\",\"\",MATCH($J94,OFFSET(BASE!$C$5,,,MAX(BASE!$B:$B)),0))","v":4},{"$f":"IF($AA94=\"\",\"\",60*($AA94-1)+COUNTIF($AA$9:$AA94,$AA94))","v":213},"E1",1,"E",null,"نصرالدين ",null," نصرالدين "]
[92," ",1000513270546900,null,null,"ذكر","2005-04-30","مغنية","نصف داخلي","3ع ت02",null,null,null,"ثالثة","علوم تجريبية ",2,92,"D1",null,"قرية العقيد عباس - مغنية -  ",null,null,null,null,null,null,{"$f":"IF($J95=\"\",\"\",MATCH($J95,OFFSET(BASE!$C$5,,,MAX(BASE!$B:$B)),0))","v":5},{"$f":"IF($AA95=\"\",\"\",60*($AA95-1)+COUNTIF($AA$9:$AA95,$AA95))","v":241},"D1",1,"D",null,"بوشارب  ",null," بوشارب  "]
[93," ",1000513270291000,null,null,"ذكر","2005-10-02","مغنية","نصف داخلي","3ع ت02",null,null,null,"ثالثة","علوم تجريبية ",2,93,"D1",null,"قرية العقيد عباس -  مغنية -  ",null,null,null,null,null,null,{"$f":"IF($J96=\"\",\"\",MATCH($J96,OFFSET(BASE!$C$5,,,MAX(BASE!$B:$B)),0))","v":5},{"$f":"IF($AA96=\"\",\"\",60*($AA96-1)+COUNTIF($AA$9:$AA96,$AA96))","v":242},"D1",1,"D",null,"مصطفى ",null," مصطفى "]
[94," ",1100513270196000,null,null,"أنثى","2005-07-14","مغنية","نصف داخلي","3ع ت02",null,null,null,"ثالثة","علوم تجريبية ",2,94,"D2",null,"قرية البطيم-مغنية- ",null,null,null,null,null,null,{"$f":"IF($J97=\"\",\"\",MATCH($J97,OFFSET(BASE!$C$5,,,MAX(BASE!$B:$B)),0))","v":5},{"$f":"IF($AA97=\"\",\"\",60*($AA97-1)+COUNTIF($AA$9:$AA97,$AA97))","v":243},"D2",2,"D",null,"عبد الرحيم ",null," عبد الرحيم "]
[95," ",1100513270254800,null,null,"أنثى","2005-08-29","مغنية","نصف داخلي","3ع ت02",null,null,null,"ثالثة","علوم تجريبية ",2,95,"D2",null,"قرية البطيم-مغنية- ",null,null,null,null,null,null,{"$f":"IF($J98=\"\",\"\",MATCH($J98,OFFSET(BASE!$C$5,,,MAX(BASE!$B:$B)),0))","v":5},{"$f":"IF($AA98=\"\",\"\",60*($AA98-1)+COUNTIF($AA$9:$AA98,$AA98))","v":244},"D2",2,"D",null,"بلخير ",null," بلخير "]
[96," ",1100513270083600,null,null,"أنثى","2005-04-13","مغنية","نصف داخلي","3ع ت02",null,null,null,"ثالثة","علوم تجريبية ",2,96,"D2",null,"حي العمارات البريقي مغنية ",null,null,null,null,null,null,{"$f":"IF($J99=\"\",\"\",MATCH($J99,OFFSET(BASE!$C$5,,,MAX(BASE!$B:$B)),0))","v":5},{"$f":"IF($AA99=\"\",\"\",60*($AA99-1)+COUNTIF($AA$9:$AA99,$AA99))","v":245},"D2",2,"D",null,"حميدي ",null," حميدي "]
[97," ",1100513010194600,null,null,"أنثى","2005-01-27","تلمسان","نصف داخلي","3ع ت02",null,null,null,"ثالثة","علوم تجريبية ",2,97,"D2",null,"قرية العقيد عباس - مغنية -  ",null,null,null,null,null,null,{"$f":"IF($J100=\"\",\"\",MATCH($J100,OFFSET(BASE!$C$5,,,MAX(BASE!$B:$B)),0))","v":5},{"$f":"IF($AA100=\"\",\"\",60*($AA100-1)+COUNTIF($AA$9:$AA100,$AA100))","v":246},"D2",2,"D",null,"محمد ",null," محمد "]
[98," ",1100413270140700,null,null,"أنثى","2004-06-13","مغنية","نصف داخلي","3ع ت02",null,null,null,"ثالثة","علوم تجريبية ",2,98,"D2",null,"قرية المصامدة مغنية ",null,null,null,null,null,null,{"$f":"IF($J101=\"\",\"\",MATCH($J101,OFFSET(BASE!$C$5,,,MAX(BASE!$B:$B)),0))","v":5},{"$f":"IF($AA101=\"\",\"\",60*($AA101-1)+COUNTIF($AA$9:$AA101,$AA101))","v":247},"D2",2,"D",null,"محمد ",null," محمد "]
[99," ",1000613270012700,null,null,"ذكر","2006-01-13","مغنية","نصف داخلي","3ع ت02",null,null,null,"ثالثة","علوم تجريبية ",2,99,"D1",null,"قرية أولاد الشارف - مغنية -  ",null,null,null,null,null,null,{"$f":"IF($J102=\"\",\"\",MATCH($J102,OFFSET(BASE!$C$5,,,MAX(BASE!$B:$B)),0))","v":5},{"$f":"IF($AA102=\"\",\"\",60*($AA102-1)+COUNTIF($AA$9:$AA102,$AA102))","v":248},"D1",1,"D",null,"عبد القادر ",null," عبد القادر "]
[100," ",1100213270074000,null,null,"أنثى","2002-04-20","مغنية","نصف داخلي","3ع ت02",null,null,null,"ثالثة","علوم تجريبية ",2,100,"D2",null,"أولاد الشارف مغنية ",null,null,null,null,null,null,{"$f":"IF($J103=\"\",\"\",MATCH($J103,OFFSET(BASE!$C$5,,,MAX(BASE!$B:$B)),0))","v":5},{"$f":"IF($AA103=\"\",\"\",60*($AA103-1)+COUNTIF($AA$9:$AA103,$AA103))","v":249},"D2",2,"D",null,"جمال ",null," جمال "]
[101," ",1100513270213300,null,null,"أنثى","2005-07-28","مغنية","نصف داخلي","3ع ت02",null,null,null,"ثالثة","علوم تجريبية ",2,101,"D2",null,"قرية العقيد عباس مغنية ",null,null,null,null,null,null,{"$f":"IF($J104=\"\",\"\",MATCH($J104,OFFSET(BASE!$C$5,,,MAX(BASE!$B:$B)),0))","v":5},{"$f":"IF($AA104=\"\",\"\",60*($AA104-1)+COUNTIF($AA$9:$AA104,$AA104))","v":250},"D2",2,"D",null,"فؤاد ",null," فؤاد "]
[102," ",1100513270355400,null,null,"أنثى","2005-12-06","مغنية","نصف داخلي","3ع ت02",null,null,null,"ثالثة","علوم تجريبية ",2,102,"D2",null,"قرية البطيم مغنية ",null,null,null,null,null,null,{"$f":"IF($J105=\"\",\"\",MATCH($J105,OFFSET(BASE!$C$5,,,MAX(BASE!$B:$B)),0))","v":5},{"$f":"IF($AA105=\"\",\"\",60*($AA105-1)+COUNTIF($AA$9:$AA105,$AA105))","v":251},"D2",2,"D",null,"يوسف ",null," يوسف "]
[103," ",1000422010809300,null,null,"ذكر","2004-12-20","سيدي بلعباس","نصف داخلي","3ع ت02",null,null,null,"ثالثة","علوم تجريبية ",2,103,"D1",null,"قرية البطيم مغنية ",null,null,null,null,null,null,{"$f":"IF($J106=\"\",\"\",MATCH($J106,OFFSET(BASE!$C$5,,,MAX(BASE!$B:$B)),0))","v":5},{"$f":"IF($AA106=\"\",\"\",60*($AA106-1)+COUNTIF($AA$9:$AA106,$AA106))","v":252},"D1",1,"D",null,"سباع ",null," سباع "]
[104," ",1100413270003000,null,null,"أنثى","2004-01-05","مغنية","نصف داخلي","3ع ت02",null,null,null,"ثالثة","علوم تجريبية ",2,104,"D2",null,"أولاد الشارف مغنية ",null,null,null,null,null,null,{"$f":"IF($J107=\"\",\"\",MATCH($J107,OFFSET(BASE!$C$5,,,MAX(BASE!$B:$B)),0))","v":5},{"$f":"IF($AA107=\"\",\"\",60*($AA107-1)+COUNTIF($AA$9:$AA107,$AA107))","v":253},"D2",2,"D",null,"بلخير ",null," بلخير "]
[105,{"$f":"D108& \" \" &E108","v":" "},1100513270163800,null,null,"أنثى","2005-06-22","مغنية","نصف داخلي","3ع ت02",null,null,null,"ثالثة","علوم تجريبية ",2,105,"D2",null,"حي اولاد معيدر ",null,null,null,null,null,null,{"$f":"IF($J108=\"\",\"\",MATCH($J108,OFFSET(BASE!$C$5,,,MAX(BASE!$B:$B)),0))","v":5},{"$f":"IF($AA108=\"\",\"\",60*($AA108-1)+COUNTIF($AA$9:$AA108,$AA108))","v":254},"D2",2,"D",null,"عبد الحكيم ",null," عبد الحكيم "]
[106," ",1000513270161500,null,null,"ذكر","2005-06-20","مغنية","نصف داخلي","3ع ت02",null,null,null,"ثالثة","علوم تجريبية ",2,106,"D1",null,"مزرعة شرقاوي العيد - مغنية - ",null,null,null,null,null,null,{"$f":"IF($J109=\"\",\"\",MATCH($J109,OFFSET(BASE!$C$5,,,MAX(BASE!$B:$B)),0))","v":5},{"$f":"IF($AA109=\"\",\"\",60*($AA109-1)+COUNTIF($AA$9:$AA109,$AA109))","v":255},"D1",1,"D",null,"نصر الدين ",null," نصر الدين "]
[107," ",1100513270364100,null,null,"أنثى","2005-12-14","مغنية","نصف داخلي","3ع ت02",null,null,null,"ثالثة","علوم تجريبية ",2,107,"D2",null,"قرية أولاد الشارف - مغنية - ",null,null,null,null,null,null,{"$f":"IF($J110=\"\",\"\",MATCH($J110,OFFSET(BASE!$C$5,,,MAX(BASE!$B:$B)),0))","v":5},{"$f":"IF($AA110=\"\",\"\",60*($AA110-1)+COUNTIF($AA$9:$AA110,$AA110))","v":256},"D2",2,"D",null,"يوسف ",null," يوسف "]
[108," ",1000513270273000,null,null,"ذكر","2005-09-15","مغنية","نصف داخلي","3ع ت02",null,null,null,"ثالثة","علوم تجريبية ",2,108,"D1",null,"قرية اولاد الشارف  - مغنية - ",null,null,null,null,null,null,{"$f":"IF($J111=\"\",\"\",MATCH($J111,OFFSET(BASE!$C$5,,,MAX(BASE!$B:$B)),0))","v":5},{"$f":"IF($AA111=\"\",\"\",60*($AA111-1)+COUNTIF($AA$9:$AA111,$AA111))","v":257},"D1",1,"D",null,"عبد القادر ",null," عبد القادر "]
[109," ",1100413270253400,null,null,"أنثى","2005-05-19","مغنية","نصف داخلي","3ع ت02",null,null,null,"ثالثة","علوم تجريبية ",2,109,"D2",null,"قرية المصامدة - مغنية -  ",null,null,null,null,null,null,{"$f":"IF($J112=\"\",\"\",MATCH($J112,OFFSET(BASE!$C$5,,,MAX(BASE!$B:$B)),0))","v":5},{"$f":"IF($AA112=\"\",\"\",60*($AA112-1)+COUNTIF($AA$9:$AA112,$AA112))","v":258},"D2",2,"D",null,"محمد ",null," محمد "]
[110," ",1100513270117800,null,null,"أنثى","2004-09-16","مغنية","نصف داخلي","3ع ت02",null,null,null,"ثالثة","علوم تجريبية ",2,110,"D2",null,"قرية المصامدة مغنية ",null,null,null,null,null,null,{"$f":"IF($J113=\"\",\"\",MATCH($J113,OFFSET(BASE!$C$5,,,MAX(BASE!$B:$B)),0))","v":5},{"$f":"IF($AA113=\"\",\"\",60*($AA113-1)+COUNTIF($AA$9:$AA113,$AA113))","v":259},"D2",2,"D",null,"أحمد ",null," أحمد "]
[111," ",1100413270221000,null,null,"أنثى","2004-04-18","تلمسان","نصف داخلي","3ع ت02",null,null,null,"ثالثة","علوم تجريبية ",2,111,"D2",null,"أولاد الشارف مغنية ",null,null,null,null,null,null,{"$f":"IF($J114=\"\",\"\",MATCH($J114,OFFSET(BASE!$C$5,,,MAX(BASE!$B:$B)),0))","v":5},{"$f":"IF($AA114=\"\",\"\",60*($AA114-1)+COUNTIF($AA$9:$AA114,$AA114))","v":260},"D2",2,"D",null,"رشيد ",null," رشيد "]
[112," ",1000513270199900,null,null,"ذكر","2005-07-18","مغنية","نصف داخلي","3ع ت02",null,null,null,"ثالثة","علوم تجريبية ",2,112,"D1",null,"قرية البطيم-مغنية- ",null,null,null,null,null,null,{"$f":"IF($J115=\"\",\"\",MATCH($J115,OFFSET(BASE!$C$5,,,MAX(BASE!$B:$B)),0))","v":5},{"$f":"IF($AA115=\"\",\"\",60*($AA115-1)+COUNTIF($AA$9:$AA115,$AA115))","v":261},"D1",1,"D",null,"عبد القادر ",null," عبد القادر "]
[113," ",1100413270194200,null,null,"أنثى","2004-07-22","مغنية","نصف داخلي","3ع ت02",null,null,null,"ثالثة","علوم تجريبية ",2,113,"D2",null,"قرية المصامدة مغنية ",null,null,null,null,null,null,{"$f":"IF($J116=\"\",\"\",MATCH($J116,OFFSET(BASE!$C$5,,,MAX(BASE!$B:$B)),0))","v":5},{"$f":"IF($AA116=\"\",\"\",60*($AA116-1)+COUNTIF($AA$9:$AA116,$AA116))","v":262},"D2",2,"D",null,"محمد ",null," محمد "]
[114," ",1100513270308400,null,null,"أنثى","2005-10-19","مغنية","نصف داخلي","3ع ت02",null,null,null,"ثالثة","علوم تجريبية ",2,114,"D2",null,"مزرعة شعبان حمدون -- مغنية - ",null,null,null,null,null,null,{"$f":"IF($J117=\"\",\"\",MATCH($J117,OFFSET(BASE!$C$5,,,MAX(BASE!$B:$B)),0))","v":5},{"$f":"IF($AA117=\"\",\"\",60*($AA117-1)+COUNTIF($AA$9:$AA117,$AA117))","v":263},"D2",2,"D",null,"حبيب ",null," حبيب "]
[115," ",1100513270304900,null,null,"أنثى","2005-10-14","مغنية","نصف داخلي","3ع ت02",null,null,null,"ثالثة","علوم تجريبية ",2,115,"D2",null,"قرية البطيم مغنية ",null,null,null,null,null,null,{"$f":"IF($J118=\"\",\"\",MATCH($J118,OFFSET(BASE!$C$5,,,MAX(BASE!$B:$B)),0))","v":5},{"$f":"IF($AA118=\"\",\"\",60*($AA118-1)+COUNTIF($AA$9:$AA118,$AA118))","v":264},"D2",2,"D",null,"مصطفى ",null," مصطفى "]
[116," ",1000413270193800,null,null,"ذكر","2004-07-22","مغنية","نصف داخلي","3ع ت02",null,null,null,"ثالثة","علوم تجريبية ",2,116,"D1",null,"قرية البطيم مغنية ",null,null,null,null,null,null,{"$f":"IF($J119=\"\",\"\",MATCH($J119,OFFSET(BASE!$C$5,,,MAX(BASE!$B:$B)),0))","v":5},{"$f":"IF($AA119=\"\",\"\",60*($AA119-1)+COUNTIF($AA$9:$AA119,$AA119))","v":265},"D1",1,"D",null,"لخضر ",null," لخضر "]
[117," ",1100513270138100,null,null,"أنثى","2005-06-05","مغنية","نصف داخلي","3ع ت02",null,null,null,"ثالثة","علوم تجريبية ",2,117,"D2",null,"حي الشهداء - مغنية -  ",null,null,null,null,null,null,{"$f":"IF($J120=\"\",\"\",MATCH($J120,OFFSET(BASE!$C$5,,,MAX(BASE!$B:$B)),0))","v":5},{"$f":"IF($AA120=\"\",\"\",60*($AA120-1)+COUNTIF($AA$9:$AA120,$AA120))","v":266},"D2",2,"D",null,"بن يونس ",null," بن يونس "]
[118," ",1100513270195700,null,null,"أنثى","2005-07-14","مغنية","خارجي","3ع ت02",null,null,null,"ثالثة","علوم تجريبية ",2,118,"E2",null," ",null,null,null,null,null,null,{"$f":"IF($J121=\"\",\"\",MATCH($J121,OFFSET(BASE!$C$5,,,MAX(BASE!$B:$B)),0))","v":5},{"$f":"IF($AA121=\"\",\"\",60*($AA121-1)+COUNTIF($AA$9:$AA121,$AA121))","v":267},"E2",2,"E",null,"جيلالي ",null," جيلالي "]
[119," ",1100513270233300,null,null,"أنثى","2005-08-13","مغنية","خارجي","3ع ت02",null,null,null,"ثالثة","علوم تجريبية ",2,119,"E2",null,"درب 01 رقم 08 حي الشهداء - مغنية - ",null,null,null,null,null,null,{"$f":"IF($J122=\"\",\"\",MATCH($J122,OFFSET(BASE!$C$5,,,MAX(BASE!$B:$B)),0))","v":5},{"$f":"IF($AA122=\"\",\"\",60*($AA122-1)+COUNTIF($AA$9:$AA122,$AA122))","v":268},"E2",2,"E",null,"يوسف ",null," يوسف "]
[120," ",1100413270193900,null,null,"أنثى","2004-07-22","مغنية","خارجي","3ع ت02",null,null,null,"ثالثة","علوم تجريبية ",2,120,"E2",null,"حي بلال مغنية ",null,null,null,null,null,null,{"$f":"IF($J123=\"\",\"\",MATCH($J123,OFFSET(BASE!$C$5,,,MAX(BASE!$B:$B)),0))","v":5},{"$f":"IF($AA123=\"\",\"\",60*($AA123-1)+COUNTIF($AA$9:$AA123,$AA123))","v":269},"E2",2,"E",null,"محمد ",null," محمد "]
[121," ",1000613270019800,null,null,"ذكر","2006-01-22","مغنية","خارجي","3ع ت02",null,null,null,"ثالثة","علوم تجريبية ",2,121,"E1",null,"حي البريقي مغنية ",null,null,null,null,null,null,{"$f":"IF($J124=\"\",\"\",MATCH($J124,OFFSET(BASE!$C$5,,,MAX(BASE!$B:$B)),0))","v":5},{"$f":"IF($AA124=\"\",\"\",60*($AA124-1)+COUNTIF($AA$9:$AA124,$AA124))","v":270},"E1",1,"E",null,"رشيد ",null," رشيد "]
[122," ",1000513270367800,null,null,"ذكر","2005-12-18","مغنية","خارجي","3ع ت02",null,null,null,"ثالثة","علوم تجريبية ",2,122,"E1",null,"رقم 01 حي الشهداء - مغنية - ",null,null,null,null,null,null,{"$f":"IF($J125=\"\",\"\",MATCH($J125,OFFSET(BASE!$C$5,,,MAX(BASE!$B:$B)),0))","v":5},{"$f":"IF($AA125=\"\",\"\",60*($AA125-1)+COUNTIF($AA$9:$AA125,$AA125))","v":271},"E1",1,"E",null,"احمد ",null," احمد "]
[123," ",1100513270287000,null,null,"أنثى","2005-09-27","مغنية","خارجي","3ع ت02",null,null,null,"ثالثة","علوم تجريبية ",2,123,"E2",null,"حي الشهداء - مغنية - ",null,null,null,null,null,null,{"$f":"IF($J126=\"\",\"\",MATCH($J126,OFFSET(BASE!$C$5,,,MAX(BASE!$B:$B)),0))","v":5},{"$f":"IF($AA126=\"\",\"\",60*($AA126-1)+COUNTIF($AA$9:$AA126,$AA126))","v":272},"E2",2,"E",null,"محمد ",null," محمد "]
[124," ",1100413270204600,null,null,"أنثى","2004-07-31","مغنية","نصف داخلي","3أ ف01",null,null,null,"ثالثة","آداب وفلسفة ",1,124,"D2",null,"قرية العقيد عباس مغنية تلمسان ",null,null,null,null,null,null,{"$f":"IF($J127=\"\",\"\",MATCH($J127,OFFSET(BASE!$C$5,,,MAX(BASE!$B:$B)),0))","v":7},{"$f":"IF($AA127=\"\",\"\",60*($AA127-1)+COUNTIF($AA$9:$AA127,$AA127))","v":361},"D2",2,"D",null,"محمود ",null," محمود "]
[125," ",1100413270038000,null,null,"أنثى","2004-02-12","مغنية","نصف داخلي","3أ ف01",null,null,null,"ثالثة","آداب وفلسفة ",1,125,"D2",null,"قرية العقيد عباس - مغنية -  ",null,null,null,null,null,null,{"$f":"IF($J128=\"\",\"\",MATCH($J128,OFFSET(BASE!$C$5,,,MAX(BASE!$B:$B)),0))","v":7},{"$f":"IF($AA128=\"\",\"\",60*($AA128-1)+COUNTIF($AA$9:$AA128,$AA128))","v":362},"D2",2,"D",null,"بن عمر ",null," بن عمر "]
[126," ",1000513270852300,null,null,"ذكر","2005-06-02","مغنية","نصف داخلي","3أ ف01",null,null,null,"ثالثة","آداب وفلسفة ",1,126,"D1",null,"قرية العقيد عباس - مغنية -  ",null,null,null,null,null,null,{"$f":"IF($J129=\"\",\"\",MATCH($J129,OFFSET(BASE!$C$5,,,MAX(BASE!$B:$B)),0))","v":7},{"$f":"IF($AA129=\"\",\"\",60*($AA129-1)+COUNTIF($AA$9:$AA129,$AA129))","v":363},"D1",1,"D",null,"عبد العزيز ",null," عبد العزيز "]
[127," ",1000213270101000,null,null,"ذكر","2002-05-26","مغنية","نصف داخلي","3أ ف01",null,null,null,"ثالثة","آداب وفلسفة ",1,127,"D1",null,"قرية البطيم مغنية ",null,null,null,null,null,null,{"$f":"IF($J130=\"\",\"\",MATCH($J130,OFFSET(BASE!$C$5,,,MAX(BASE!$B:$B)),0))","v":7},{"$f":"IF($AA130=\"\",\"\",60*($AA130-1)+COUNTIF($AA$9:$AA130,$AA130))","v":364},"D1",1,"D",null,"بومدين ",null," بومدين "]
[128," ",1100413270206200,null,null,"أنثى","2004-07-30","مغنية","نصف داخلي","3أ ف01",null,null,null,"ثالثة","آداب وفلسفة ",1,128,"D2",null,"قرية البطيم مغنية ",null,null,null,null,null,null,{"$f":"IF($J131=\"\",\"\",MATCH($J131,OFFSET(BASE!$C$5,,,MAX(BASE!$B:$B)),0))","v":7},{"$f":"IF($AA131=\"\",\"\",60*($AA131-1)+COUNTIF($AA$9:$AA131,$AA131))","v":365},"D2",2,"D",null,"عبد القادر ",null," عبد القادر "]
[129," ",1100513270257200,null,null,"أنثى","2005-08-31","مغنية","نصف داخلي","3أ ف01",null,null,null,"ثالثة","آداب وفلسفة ",1,129,"D2",null,"قرية أولاد الشارف - مغنية -  ",null,null,null,null,null,null,{"$f":"IF($J132=\"\",\"\",MATCH($J132,OFFSET(BASE!$C$5,,,MAX(BASE!$B:$B)),0))","v":7},{"$f":"IF($AA132=\"\",\"\",60*($AA132-1)+COUNTIF($AA$9:$AA132,$AA132))","v":366},"D2",2,"D",null,"ميلود ",null," ميلود "]
[130," ",1100513270312600,null,null,"أنثى","2005-10-24","مغنية","نصف داخلي","3أ ف01",null,null,null,"ثالثة","آداب وفلسفة ",1,130,"D2",null,"قرية البطيم مغنية ",null,null,null,null,null,null,{"$f":"IF($J133=\"\",\"\",MATCH($J133,OFFSET(BASE!$C$5,,,MAX(BASE!$B:$B)),0))","v":7},{"$f":"IF($AA133=\"\",\"\",60*($AA133-1)+COUNTIF($AA$9:$AA133,$AA133))","v":367},"D2",2,"D",null,"فايق ",null," فايق "]
[131," ",1100313270092800,null,null,"أنثى","2003-05-10","مغنية","نصف داخلي","3أ ف01",null,null,null,"ثالثة","آداب وفلسفة ",1,131,"D2",null,"حي الشهداء ",null,null,null,null,null,null,{"$f":"IF($J134=\"\",\"\",MATCH($J134,OFFSET(BASE!$C$5,,,MAX(BASE!$B:$B)),0))","v":7},{"$f":"IF($AA134=\"\",\"\",60*($AA134-1)+COUNTIF($AA$9:$AA134,$AA134))","v":368},"D2",2,"D",null,"بن عمر ",null," بن عمر "]
[132," ",1100513270144100,null,null,"أنثى","2005-06-08","مغنية","نصف داخلي","3أ ف01",null,null,null,"ثالثة","آداب وفلسفة ",1,132,"D2",null,"اولاد معيدر ",null,null,null,null,null,null,{"$f":"IF($J135=\"\",\"\",MATCH($J135,OFFSET(BASE!$C$5,,,MAX(BASE!$B:$B)),0))","v":7},{"$f":"IF($AA135=\"\",\"\",60*($AA135-1)+COUNTIF($AA$9:$AA135,$AA135))","v":369},"D2",2,"D",null,"عبدالرزاق ",null," عبدالرزاق "]
[133," ",1100413270067100,null,null,"أنثى","2004-03-20","مغنية","نصف داخلي","3أ ف01",null,null,null,"ثالثة","آداب وفلسفة ",1,133,"D2",null,"قرية البخاتة مغنية ",null,null,null,null,null,null,{"$f":"IF($J136=\"\",\"\",MATCH($J136,OFFSET(BASE!$C$5,,,MAX(BASE!$B:$B)),0))","v":7},{"$f":"IF($AA136=\"\",\"\",60*($AA136-1)+COUNTIF($AA$9:$AA136,$AA136))","v":370},"D2",2,"D",null,"محمد ",null," محمد "]
[134," ",1100513270326900,null,null,"أنثى","2005-11-05","مغنية","نصف داخلي","3أ ف01",null,null,null,"ثالثة","آداب وفلسفة ",1,134,"D2",null,"قرية البطيم- مغنية- ",null,null,null,null,null,null,{"$f":"IF($J137=\"\",\"\",MATCH($J137,OFFSET(BASE!$C$5,,,MAX(BASE!$B:$B)),0))","v":7},{"$f":"IF($AA137=\"\",\"\",60*($AA137-1)+COUNTIF($AA$9:$AA137,$AA137))","v":371},"D2",2,"D",null,"عبد الرحمن ",null,{"$f":"D137 & \" \" & AG137","v":" عبد الرحمن "}]
[135," ",1100513270231800,null,null,"أنثى","2005-08-12","مغنية","نصف داخلي","3أ ف01",null,null,null,"ثالثة","آداب وفلسفة ",1,135,"D2",null,"قرية البطيم-مغنية- ",null,null,null,null,null,null,{"$f":"IF($J138=\"\",\"\",MATCH($J138,OFFSET(BASE!$C$5,,,MAX(BASE!$B:$B)),0))","v":7},{"$f":"IF($AA138=\"\",\"\",60*($AA138-1)+COUNTIF($AA$9:$AA138,$AA138))","v":372},{"$f":"AE138&AD138","v":"D2"},{"$f":"IF(F138=\"أنثى\",2,1)","v":2},{"$f":"IF(I138=\"نصف داخلي\",\"D\",\"E\")","v":"D"},null,"احمد ",null," احمد "]
[136," ",1100413270202200,null,null,"أنثى","2004-07-28","مغنية","نصف داخلي","3أ ف01",null,null,null,"ثالثة","آداب وفلسفة ",1,136,"D2",null,"قرية المصامدة  - مغنية -  ",null,null,null,null,null,null,{"$f":"IF($J139=\"\",\"\",MATCH($J139,OFFSET(BASE!$C$5,,,MAX(BASE!$B:$B)),0))","v":7},{"$f":"IF($AA139=\"\",\"\",60*($AA139-1)+COUNTIF($AA$9:$AA139,$AA139))","v":373},"D2",2,"D",null,"محمد ",null," محمد "]
[137,{"$f":"D140& \" \" &E140","v":" "},1100513270361100,null,null,"أنثى","2005-12-12","مغنية","نصف داخلي","3أ ف01",null,null,null,"ثالثة","آداب وفلسفة ",1,137,"D2",null,"أولاد الشارف - مغنية - ",null,null,null,null,null,null,{"$f":"IF($J140=\"\",\"\",MATCH($J140,OFFSET(BASE!$C$5,,,MAX(BASE!$B:$B)),0))","v":7},{"$f":"IF($AA140=\"\",\"\",60*($AA140-1)+COUNTIF($AA$9:$AA140,$AA140))","v":374},"D2",2,"D",null,"علي ",null," علي "]
[138," ",1100513270068000,null,null,"أنثى","2005-03-21","مغنية","نصف داخلي","3أ ف01",null,null,null,"ثالثة","آداب وفلسفة ",1,138,"D2",null,"قرية البطيم مغنية ",null,null,null,null,null,null,{"$f":"IF($J141=\"\",\"\",MATCH($J141,OFFSET(BASE!$C$5,,,MAX(BASE!$B:$B)),0))","v":7},{"$f":"IF($AA141=\"\",\"\",60*($AA141-1)+COUNTIF($AA$9:$AA141,$AA141))","v":375},"D2",2,"D",null,"محمد ",null," محمد "]
[139," ",1000513270041800,null,null,"ذكر","2005-02-17","مغنية","نصف داخلي","3أ ف01",null,null,null,"ثالثة","آداب وفلسفة ",1,139,"D1",null,"قرية المصامدة مغنية ",null,null,null,null,null,null,{"$f":"IF($J142=\"\",\"\",MATCH($J142,OFFSET(BASE!$C$5,,,MAX(BASE!$B:$B)),0))","v":7},{"$f":"IF($AA142=\"\",\"\",60*($AA142-1)+COUNTIF($AA$9:$AA142,$AA142))","v":376},"D1",1,"D",null,"نور الدين ",null," نور الدين "]
[140," ",1100613270216400,null,null,"أنثى","2006-08-01","مغنية","نصف داخلي","3أ ف01",null,null,null,"ثالثة","آداب وفلسفة ",1,140,"D2",null,"ص . ب . 440 - مغنية -  ",null,null,null,null,null,null,{"$f":"IF($J143=\"\",\"\",MATCH($J143,OFFSET(BASE!$C$5,,,MAX(BASE!$B:$B)),0))","v":7},{"$f":"IF($AA143=\"\",\"\",60*($AA143-1)+COUNTIF($AA$9:$AA143,$AA143))","v":377},"D2",2,"D",null,"محمد ",null," محمد "]
[141," ",1000414010238600,null,null,"ذكر","2004-05-29","تيارت","نصف داخلي","3أ ف01",null,null,null,"ثالثة","آداب وفلسفة ",1,141,"D1",null,"دوار المرازقة - مغنية -  ",null,null,null,null,null,null,{"$f":"IF($J144=\"\",\"\",MATCH($J144,OFFSET(BASE!$C$5,,,MAX(BASE!$B:$B)),0))","v":7},{"$f":"IF($AA144=\"\",\"\",60*($AA144-1)+COUNTIF($AA$9:$AA144,$AA144))","v":378},"D1",1,"D",null,"حاج ",null," حاج "]
[142," ",1100513270116500,null,null,"أنثى","2005-05-18","مغنية","نصف داخلي","3أ ف01",null,null,null,"ثالثة","آداب وفلسفة ",1,142,"D2",null,"قرية المصامدة - مغنية -  ",null,null,null,null,null,null,{"$f":"IF($J145=\"\",\"\",MATCH($J145,OFFSET(BASE!$C$5,,,MAX(BASE!$B:$B)),0))","v":7},{"$f":"IF($AA145=\"\",\"\",60*($AA145-1)+COUNTIF($AA$9:$AA145,$AA145))","v":379},"D2",2,"D",null,"يحي ",null," يحي "]
[143," ",1100513270101500,null,null,"أنثى","2005-05-02","مغنية","نصف داخلي","3أ ف01",null,null,null,"ثالثة","آداب وفلسفة ",1,143,"D2",null,"قرية أولاد الشارف -مغنية - ",null,null,null,null,null,null,{"$f":"IF($J146=\"\",\"\",MATCH($J146,OFFSET(BASE!$C$5,,,MAX(BASE!$B:$B)),0))","v":7},{"$f":"IF($AA146=\"\",\"\",60*($AA146-1)+COUNTIF($AA$9:$AA146,$AA146))","v":380},"D2",2,"D",null,"محمد ",null," محمد "]
[144," ",1000413270119600,null,null,"ذكر","2004-05-25","مغنية","نصف داخلي","3أ ف01",null,null,null,"ثالثة","آداب وفلسفة ",1,144,"D1",null,"قرية العقيد عباس مغنية تلمسان ",null,null,null,null,null,null,{"$f":"IF($J147=\"\",\"\",MATCH($J147,OFFSET(BASE!$C$5,,,MAX(BASE!$B:$B)),0))","v":7},{"$f":"IF($AA147=\"\",\"\",60*($AA147-1)+COUNTIF($AA$9:$AA147,$AA147))","v":381},"D1",1,"D",null,"مصطفى ",null," مصطفى "]
[145," ",1100413270915600,null,null,"أنثى","2004-02-08","مغنية","نصف داخلي","3أ ف01",null,null,null,"ثالثة","آداب وفلسفة ",1,145,"D2",null,"أولاد قدور الكبار - مغنية -  ",null,null,null,null,null,null,{"$f":"IF($J148=\"\",\"\",MATCH($J148,OFFSET(BASE!$C$5,,,MAX(BASE!$B:$B)),0))","v":7},{"$f":"IF($AA148=\"\",\"\",60*($AA148-1)+COUNTIF($AA$9:$AA148,$AA148))","v":382},"D2",2,"D",null,"يحي ",null," يحي "]
[146," ",1100513270349400,null,null,"أنثى","2005-11-30","مغنية","نصف داخلي","3أ ف01",null,null,null,"ثالثة","آداب وفلسفة ",1,146,"D2",null,"قرية العقيد عباس - مغنية - ",null,null,null,null,null,null,{"$f":"IF($J149=\"\",\"\",MATCH($J149,OFFSET(BASE!$C$5,,,MAX(BASE!$B:$B)),0))","v":7},{"$f":"IF($AA149=\"\",\"\",60*($AA149-1)+COUNTIF($AA$9:$AA149,$AA149))","v":383},"D2",2,"D",null,"عبد العزيز ",null," عبد العزيز "]
[147," ",1100513270131400,null,null,"أنثى","2005-05-30","مغنية","نصف داخلي","3أ ف01",null,null,null,"ثالثة","آداب وفلسفة ",1,147,"D2",null,"قرية المصامدة  - مغنية - ",null,null,null,null,"D2",null,{"$f":"IF($J150=\"\",\"\",MATCH($J150,OFFSET(BASE!$C$5,,,MAX(BASE!$B:$B)),0))","v":7},{"$f":"IF($AA150=\"\",\"\",60*($AA150-1)+COUNTIF($AA$9:$AA150,$AA150))","v":384},"D2",2,"D",null,"حميدة ",null," حميدة "]
[148," ",1000513270295300,null,null,"ذكر","2005-10-05","مغنية","خارجي","3أ ف01",null,null,null,"ثالثة","آداب وفلسفة ",1,148,"E1",null,"حي الشهداء ",null,null,null,null,null,null,{"$f":"IF($J151=\"\",\"\",MATCH($J151,OFFSET(BASE!$C$5,,,MAX(BASE!$B:$B)),0))","v":7},{"$f":"IF($AA151=\"\",\"\",60*($AA151-1)+COUNTIF($AA$9:$AA151,$AA151))","v":385},"E1",1,"E",null,"محمد ",null," محمد "]
[149," ",1000413270160200,null,null,"ذكر","2004-06-28","مغنية","خارجي","3أ ف01",null,null,null,"ثالثة","آداب وفلسفة ",1,149,"E1",null,"حي الشهداء ",null,null,null,null,null,null,{"$f":"IF($J152=\"\",\"\",MATCH($J152,OFFSET(BASE!$C$5,,,MAX(BASE!$B:$B)),0))","v":7},{"$f":"IF($AA152=\"\",\"\",60*($AA152-1)+COUNTIF($AA$9:$AA152,$AA152))","v":386},"E1",1,"E",null,"عبد القادر ",null," عبد القادر "]
[150," ",1000413270345400,null,null,"ذكر","2004-12-15","مغنية","خارجي","3أ ف01",null,null,null,"ثالثة","آداب وفلسفة ",1,150,"E1",null,"منزل رقم 1 حي جابر حي الشهداء مغنية ",null,null,null,null,null,null,{"$f":"IF($J153=\"\",\"\",MATCH($J153,OFFSET(BASE!$C$5,,,MAX(BASE!$B:$B)),0))","v":7},{"$f":"IF($AA153=\"\",\"\",60*($AA153-1)+COUNTIF($AA$9:$AA153,$AA153))","v":387},"E1",1,"E",null,"فؤاد ",null," فؤاد "]
[151," ",1000314290095200,null,null,"أنثى","2003-07-28","قصرالشلالة","خارجي","3أ ف01",null,null,null,"ثالثة","آداب وفلسفة ",1,151,"E2",null," ",null,null,null,null,null,null,{"$f":"IF($J154=\"\",\"\",MATCH($J154,OFFSET(BASE!$C$5,,,MAX(BASE!$B:$B)),0))","v":7},{"$f":"IF($AA154=\"\",\"\",60*($AA154-1)+COUNTIF($AA$9:$AA154,$AA154))","v":388},"E2",2,"E",null,"عبدالقادر ",null," عبدالقادر "]
[152," ",1100513270184600,null,null,"أنثى","2005-07-06","مغنية","خارجي","3أ ف01",null,null,null,"ثالثة","آداب وفلسفة ",1,152,"E2",null,"حي الشهداء - مغنية -  ",null,null,null,null,null,null,{"$f":"IF($J155=\"\",\"\",MATCH($J155,OFFSET(BASE!$C$5,,,MAX(BASE!$B:$B)),0))","v":7},{"$f":"IF($AA155=\"\",\"\",60*($AA155-1)+COUNTIF($AA$9:$AA155,$AA155))","v":389},"E2",2,"E",null,"علي ",null," علي "]
[153," ",1100513270228500,null,null,"أنثى","2005-08-09","مغنية","خارجي","3أ ف01",null,null,null,"ثالثة","آداب وفلسفة ",1,153,"E2",null,"حي الشهداء - مغنية -  ",null,null,null,null,null,null,{"$f":"IF($J156=\"\",\"\",MATCH($J156,OFFSET(BASE!$C$5,,,MAX(BASE!$B:$B)),0))","v":7},{"$f":"IF($AA156=\"\",\"\",60*($AA156-1)+COUNTIF($AA$9:$AA156,$AA156))","v":390},"E2",2,"E",null,"سعيد ",null," سعيد "]
[154," ",1000513270192100,null,null,"ذكر","2005-07-12","مغنية","خارجي","3أ ف01",null,null,null,"ثالثة","آداب وفلسفة ",1,154,"E1",null,"حي الشهداء - مغنية -  ",null,null,null,null,null,null,{"$f":"IF($J157=\"\",\"\",MATCH($J157,OFFSET(BASE!$C$5,,,MAX(BASE!$B:$B)),0))","v":7},{"$f":"IF($AA157=\"\",\"\",60*($AA157-1)+COUNTIF($AA$9:$AA157,$AA157))","v":391},"E1",1,"E",null,"عبد القادر ",null," عبد القادر "]
[155," ",1100213270100000,null,null,"أنثى","2002-05-26","مغنية","خارجي","3أ ف01",null,null,null,"ثالثة","آداب وفلسفة ",1,155,"E2",null," ",null,null,null,null,null,null,{"$f":"IF($J158=\"\",\"\",MATCH($J158,OFFSET(BASE!$C$5,,,MAX(BASE!$B:$B)),0))","v":7},{"$f":"IF($AA158=\"\",\"\",60*($AA158-1)+COUNTIF($AA$9:$AA158,$AA158))","v":392},"E2",2,"E",null,"أحمد ",null," أحمد "]
[156," ",1000313270500700,null,null,"ذكر","2003-08-10","تلمسان","خارجي","3أ ف01",null,null,null,"ثالثة","آداب وفلسفة ",1,156,"E1",null,"شارع 13 رقم 19 حي الشهداء مغنية ",null,null,null,null,null,null,{"$f":"IF($J159=\"\",\"\",MATCH($J159,OFFSET(BASE!$C$5,,,MAX(BASE!$B:$B)),0))","v":7},{"$f":"IF($AA159=\"\",\"\",60*($AA159-1)+COUNTIF($AA$9:$AA159,$AA159))","v":393},"E1",1,"E",null,"حسين ",null," حسين "]
[157," ",1100513270121000,null,null,"أنثى","2005-05-22","مغنية","خارجي","3أ ف01",null,null,null,"ثالثة","آداب وفلسفة ",1,157,"E2",null,"حي الشهداء ",null,null,null,null,null,null,{"$f":"IF($J160=\"\",\"\",MATCH($J160,OFFSET(BASE!$C$5,,,MAX(BASE!$B:$B)),0))","v":7},{"$f":"IF($AA160=\"\",\"\",60*($AA160-1)+COUNTIF($AA$9:$AA160,$AA160))","v":394},"E2",2,"E",null,"فتحي ",null," فتحي "]
[158," ",1100613270100300,null,null,"أنثى","2006-04-29","مغنية","نصف داخلي","3أ ف02",null,null,null,"ثالثة","آداب وفلسفة ",2,158,"D2",null,"قرية العقيد لطفي ",null,null,null,null,null,null,{"$f":"IF($J161=\"\",\"\",MATCH($J161,OFFSET(BASE!$C$5,,,MAX(BASE!$B:$B)),0))","v":8},{"$f":"IF($AA161=\"\",\"\",60*($AA161-1)+COUNTIF($AA$9:$AA161,$AA161))","v":421},"D2",2,"D",null,"عكاشة ",null," عكاشة "]
[159," ",1000513270090900,null,null,"ذكر","2005-04-22","مغنية","نصف داخلي","3أ ف02",null,null,null,"ثالثة","آداب وفلسفة ",2,159,"D1",null,"قرية البطيم مغنية ",null,null,null,null,null,null,{"$f":"IF($J162=\"\",\"\",MATCH($J162,OFFSET(BASE!$C$5,,,MAX(BASE!$B:$B)),0))","v":8},{"$f":"IF($AA162=\"\",\"\",60*($AA162-1)+COUNTIF($AA$9:$AA162,$AA162))","v":422},"D1",1,"D",null,"العيد ",null," العيد "]
[160," ",1100513270176900,null,null,"أنثى","2005-07-01","مغنية","نصف داخلي","3أ ف02",null,null,null,"ثالثة","آداب وفلسفة ",2,160,"D2",null,"قرية العقيد عباس مغنية ",null,null,null,null,null,null,{"$f":"IF($J163=\"\",\"\",MATCH($J163,OFFSET(BASE!$C$5,,,MAX(BASE!$B:$B)),0))","v":8},{"$f":"IF($AA163=\"\",\"\",60*($AA163-1)+COUNTIF($AA$9:$AA163,$AA163))","v":423},"D2",2,"D",null,"بلخير ",null," بلخير "]
[161," ",1100313270179300,null,null,"أنثى","2003-08-08","مغنية","نصف داخلي","3أ ف02",null,null,null,"ثالثة","آداب وفلسفة ",2,161,"D2",null,"أولاد قدور لكبار مغنية ",null,null,null,null,null,null,{"$f":"IF($J164=\"\",\"\",MATCH($J164,OFFSET(BASE!$C$5,,,MAX(BASE!$B:$B)),0))","v":8},{"$f":"IF($AA164=\"\",\"\",60*($AA164-1)+COUNTIF($AA$9:$AA164,$AA164))","v":424},"D2",2,"D",null,"عبدالله ",null," عبدالله "]
[162," ",1100513270288400,null,null,"أنثى","2005-09-29","مغنية","نصف داخلي","3أ ف02",null,null,null,"ثالثة","آداب وفلسفة ",2,162,"D2",null,"أولاد الشارف - مغنية - ",null,null,null,null,null,null,{"$f":"IF($J165=\"\",\"\",MATCH($J165,OFFSET(BASE!$C$5,,,MAX(BASE!$B:$B)),0))","v":8},{"$f":"IF($AA165=\"\",\"\",60*($AA165-1)+COUNTIF($AA$9:$AA165,$AA165))","v":425},"D2",2,"D",null,"بوبكر ",null," بوبكر "]
[163," ",1100413350001300,null,null,"أنثى","2004-01-04","سبدو","نصف داخلي","3أ ف02",null,null,null,"ثالثة","آداب وفلسفة ",2,163,"D2",null,"العابد- بلدية البويهي ",null,null,null,null,null,null,{"$f":"IF($J166=\"\",\"\",MATCH($J166,OFFSET(BASE!$C$5,,,MAX(BASE!$B:$B)),0))","v":8},{"$f":"IF($AA166=\"\",\"\",60*($AA166-1)+COUNTIF($AA$9:$AA166,$AA166))","v":426},"D2",2,"D",null,"جيلالي ",null," جيلالي "]
[164," ",1100113270013800,null,null,"أنثى","2001-01-17","مغنية","نصف داخلي","3أ ف02",null,null,null,"ثالثة","آداب وفلسفة ",2,164,"D2",null,"قرية البطيم مغنية ",null,null,null,null,null,null,{"$f":"IF($J167=\"\",\"\",MATCH($J167,OFFSET(BASE!$C$5,,,MAX(BASE!$B:$B)),0))","v":8},{"$f":"IF($AA167=\"\",\"\",60*($AA167-1)+COUNTIF($AA$9:$AA167,$AA167))","v":427},"D2",2,"D",null,"حفيظ ",null," حفيظ "]
[165," ",1100413270175100,null,null,"أنثى","2004-07-08","مغنية","نصف داخلي","3أ ف02",null,null,null,"ثالثة","آداب وفلسفة ",2,165,"D2",null,"قرية المصامدة - مغنية -  ",null,null,null,null,null,null,{"$f":"IF($J168=\"\",\"\",MATCH($J168,OFFSET(BASE!$C$5,,,MAX(BASE!$B:$B)),0))","v":8},{"$f":"IF($AA168=\"\",\"\",60*($AA168-1)+COUNTIF($AA$9:$AA168,$AA168))","v":428},"D2",2,"D",null,"محمد ",null," محمد "]
[166," ",1000513270320500,null,null,"ذكر","2005-10-30","مغنية","نصف داخلي","3أ ف02",null,null,null,"ثالثة","آداب وفلسفة ",2,166,"D1",null,"قرية العقيد عباس مغنية ",null,null,null,null,null,null,{"$f":"IF($J169=\"\",\"\",MATCH($J169,OFFSET(BASE!$C$5,,,MAX(BASE!$B:$B)),0))","v":8},{"$f":"IF($AA169=\"\",\"\",60*($AA169-1)+COUNTIF($AA$9:$AA169,$AA169))","v":429},"D1",1,"D",null,"محمد ",null," محمد "]
[167," ",1100513270243000,null,null,"أنثى","2005-08-21","مغنية","نصف داخلي","3أ ف02",null,null,null,"ثالثة","آداب وفلسفة ",2,167,"D2",null,"قرية المصامدة - مغنية - تلمسان ",null,null,null,null,null,null,{"$f":"IF($J170=\"\",\"\",MATCH($J170,OFFSET(BASE!$C$5,,,MAX(BASE!$B:$B)),0))","v":8},{"$f":"IF($AA170=\"\",\"\",60*($AA170-1)+COUNTIF($AA$9:$AA170,$AA170))","v":430},"D2",2,"D",null,"عبد النبي ",null," عبد النبي "]
[168," ",1100413270098700,null,null,"أنثى","2004-05-02","مغنية","نصف داخلي","3أ ف02",null,null,null,"ثالثة","آداب وفلسفة ",2,168,"D2",null," ",null,null,null,null,null,null,{"$f":"IF($J171=\"\",\"\",MATCH($J171,OFFSET(BASE!$C$5,,,MAX(BASE!$B:$B)),0))","v":8},{"$f":"IF($AA171=\"\",\"\",60*($AA171-1)+COUNTIF($AA$9:$AA171,$AA171))","v":431},"D2",2,"D",null,"لخضر ",null," لخضر "]
[169,{"$f":"D172& \" \" &E172","v":" "},1100613270033100,null,null,"أنثى","2006-02-05","مغنية","نصف داخلي","3أ ف02",null,null,null,"ثالثة","آداب وفلسفة ",2,169,"D2",null,"قرية المصامدة - مغنية - تلمسان ",null,null,null,null,null,null,{"$f":"IF($J172=\"\",\"\",MATCH($J172,OFFSET(BASE!$C$5,,,MAX(BASE!$B:$B)),0))","v":8},{"$f":"IF($AA172=\"\",\"\",60*($AA172-1)+COUNTIF($AA$9:$AA172,$AA172))","v":432},"D2",2,"D",null,"يحي ",null," يحي "]
[170," ",1100413270004900,null,null,"أنثى","2004-07-05","مرسى بن مهيدي","نصف داخلي","3أ ف02",null,null,null,"ثالثة","آداب وفلسفة ",2,170,"D2",null,"قرية المصامدة مغنية ",null,null,null,null,null,null,{"$f":"IF($J173=\"\",\"\",MATCH($J173,OFFSET(BASE!$C$5,,,MAX(BASE!$B:$B)),0))","v":8},{"$f":"IF($AA173=\"\",\"\",60*($AA173-1)+COUNTIF($AA$9:$AA173,$AA173))","v":433},"D2",2,"D",null,"عبد المجيد ",null," عبد المجيد "]
[171," ",1100513270038900,null,null,"أنثى","2005-02-13","مغنية","نصف داخلي","3أ ف02",null,null,null,"ثالثة","آداب وفلسفة ",2,171,"D2",null,"أولاد الشارف مغنية ",null,null,null,null,null,null,{"$f":"IF($J174=\"\",\"\",MATCH($J174,OFFSET(BASE!$C$5,,,MAX(BASE!$B:$B)),0))","v":8},{"$f":"IF($AA174=\"\",\"\",60*($AA174-1)+COUNTIF($AA$9:$AA174,$AA174))","v":434},"D2",2,"D",null,"محمد ",null," محمد "]
[172," ",1100413270299500,null,null,"أنثى","2004-10-30","مغنية","نصف داخلي","3أ ف02",null,null,null,"ثالثة","آداب وفلسفة ",2,172,"D2",null,"قرية البطيم  ",null,null,null,null,null,null,{"$f":"IF($J175=\"\",\"\",MATCH($J175,OFFSET(BASE!$C$5,,,MAX(BASE!$B:$B)),0))","v":8},{"$f":"IF($AA175=\"\",\"\",60*($AA175-1)+COUNTIF($AA$9:$AA175,$AA175))","v":435},"D2",2,"D",null,"محمد ",null," محمد "]
[173," ",1100413270166800,null,null,"أنثى","2004-07-02","مغنية","نصف داخلي","3أ ف02",null,null,null,"ثالثة","آداب وفلسفة ",2,173,"D2",null,"قرية اولاد الشارف - مغنية - ",null,null,null,null,null,null,{"$f":"IF($J176=\"\",\"\",MATCH($J176,OFFSET(BASE!$C$5,,,MAX(BASE!$B:$B)),0))","v":8},{"$f":"IF($AA176=\"\",\"\",60*($AA176-1)+COUNTIF($AA$9:$AA176,$AA176))","v":436},"D2",2,"D",null,"محمد ",null," محمد "]
[174," ",1100513270264500,null,null,"أنثى","2005-09-06","مغنية","نصف داخلي","3أ ف02",null,null,null,"ثالثة","آداب وفلسفة ",2,174,"D2",null,"قرية البطيم-مغنية- ",null,null,null,null,null,null,{"$f":"IF($J177=\"\",\"\",MATCH($J177,OFFSET(BASE!$C$5,,,MAX(BASE!$B:$B)),0))","v":8},{"$f":"IF($AA177=\"\",\"\",60*($AA177-1)+COUNTIF($AA$9:$AA177,$AA177))","v":437},"D2",2,"D",null,"واسيني ",null," واسيني "]
[175," ",1100408010339400,null,null,"أنثى","2004-11-04","بشار","نصف داخلي","3أ ف02",null,null,null,"ثالثة","آداب وفلسفة ",2,175,"D2",null,"قرية المصامدة - مغنية - تلمسان ",null,null,null,null,null,null,{"$f":"IF($J178=\"\",\"\",MATCH($J178,OFFSET(BASE!$C$5,,,MAX(BASE!$B:$B)),0))","v":8},{"$f":"IF($AA178=\"\",\"\",60*($AA178-1)+COUNTIF($AA$9:$AA178,$AA178))","v":438},"D2",2,"D",null,"لحبيب ",null," لحبيب "]
[176," ",1100413270346600,null,null,"أنثى","2004-12-17","مغنية","نصف داخلي","3أ ف02",null,null,null,"ثالثة","آداب وفلسفة ",2,176,"D2",null,"قرية المصامدة - مغنية - ",null,null,null,null,null,null,{"$f":"IF($J179=\"\",\"\",MATCH($J179,OFFSET(BASE!$C$5,,,MAX(BASE!$B:$B)),0))","v":8},{"$f":"IF($AA179=\"\",\"\",60*($AA179-1)+COUNTIF($AA$9:$AA179,$AA179))","v":439},"D2",2,"D",null,"بختي ",null," بختي "]
[177," ",1100413270012200,null,null,"أنثى","2004-01-15","مغنية","نصف داخلي","3أ ف02",null,null,null,"ثالثة","آداب وفلسفة ",2,177,"D2",null,"قرية البطيم مغنية ",null,null,null,null,null,null,{"$f":"IF($J180=\"\",\"\",MATCH($J180,OFFSET(BASE!$C$5,,,MAX(BASE!$B:$B)),0))","v":8},{"$f":"IF($AA180=\"\",\"\",60*($AA180-1)+COUNTIF($AA$9:$AA180,$AA180))","v":440},"D2",2,"D",null,"أحمد ",null," أحمد "]
[178," ",1000213270258400,null,null,"ذكر","2002-11-18","مغنية","نصف داخلي","3أ ف02",null,null,null,"ثالثة","آداب وفلسفة ",2,178,"D1",null,"قرية المصامدة - مغنية - ",null,null,null,null,null,null,{"$f":"IF($J181=\"\",\"\",MATCH($J181,OFFSET(BASE!$C$5,,,MAX(BASE!$B:$B)),0))","v":8},{"$f":"IF($AA181=\"\",\"\",60*($AA181-1)+COUNTIF($AA$9:$AA181,$AA181))","v":441},"D1",1,"D",null,"محمد عبد الباسط ",null," محمد عبد الباسط "]
[179," ",1100313270072100,null,null,"أنثى","2003-12-30","بوقيرات","خارجي","3أ ف02",null,null,null,"ثالثة","آداب وفلسفة ",2,179,"E2",null,"تافنة مغنية ",null,null,null,null,null,null,{"$f":"IF($J182=\"\",\"\",MATCH($J182,OFFSET(BASE!$C$5,,,MAX(BASE!$B:$B)),0))","v":8},{"$f":"IF($AA182=\"\",\"\",60*($AA182-1)+COUNTIF($AA$9:$AA182,$AA182))","v":442},"E2",2,"E",null,"الصادق ",null," الصادق "]
[180," ",1000614270113300,null,null,"ذكر","2006-02-21","سيدي بلعباس","خارجي","3أ ف02",null,null,null,"ثالثة","آداب وفلسفة ",2,180,"E1",null,null,null,null,null,null,null,null,{"$f":"IF($J183=\"\",\"\",MATCH($J183,OFFSET(BASE!$C$5,,,MAX(BASE!$B:$B)),0))","v":8},{"$f":"IF($AA183=\"\",\"\",60*($AA183-1)+COUNTIF($AA$9:$AA183,$AA183))","v":443},"E1",1,"E",null,null,null," "]
[181," ",1000213270101900,null,null,"ذكر","2002-05-27","مغنية","خارجي","3أ ف02",null,null,null,"ثالثة","آداب وفلسفة ",2,181,"E1",null,"قرية المصامدة مغنية ",null,null,null,null,null,null,{"$f":"IF($J184=\"\",\"\",MATCH($J184,OFFSET(BASE!$C$5,,,MAX(BASE!$B:$B)),0))","v":8},{"$f":"IF($AA184=\"\",\"\",60*($AA184-1)+COUNTIF($AA$9:$AA184,$AA184))","v":444},"E1",1,"E",null,"محمد ",null," محمد "]
[182," ",1000213270226100,null,null,"ذكر","2002-10-12","مغنية","خارجي","3أ ف02",null,null,null,"ثالثة","آداب وفلسفة ",2,182,"E1",null,"دوار المرازقة مغنية ",null,null,null,null,null,null,{"$f":"IF($J185=\"\",\"\",MATCH($J185,OFFSET(BASE!$C$5,,,MAX(BASE!$B:$B)),0))","v":8},{"$f":"IF($AA185=\"\",\"\",60*($AA185-1)+COUNTIF($AA$9:$AA185,$AA185))","v":445},"E1",1,"E",null,"مصطفى ",null," مصطفى "]
[183," ",1100513270057100,null,null,"أنثى","2005-03-08","مغنية","خارجي","3أ ف02",null,null,null,"ثالثة","آداب وفلسفة ",2,183,"E2",null,"مدرسة شعبان حمدون -  مغنية -  ",null,null,null,null,null,null,{"$f":"IF($J186=\"\",\"\",MATCH($J186,OFFSET(BASE!$C$5,,,MAX(BASE!$B:$B)),0))","v":8},{"$f":"IF($AA186=\"\",\"\",60*($AA186-1)+COUNTIF($AA$9:$AA186,$AA186))","v":446},"E2",2,"E",null,"أحمد ",null," أحمد "]
[184," ",1000431010184200,null,null,"ذكر","2004-02-16","وهران","خارجي","3أ ف02",null,null,null,"ثالثة","آداب وفلسفة ",2,184,"E1",null,"رقم 11 حي 08 حي الشهداء مغنية ",null,null,null,null,null,null,{"$f":"IF($J187=\"\",\"\",MATCH($J187,OFFSET(BASE!$C$5,,,MAX(BASE!$B:$B)),0))","v":8},{"$f":"IF($AA187=\"\",\"\",60*($AA187-1)+COUNTIF($AA$9:$AA187,$AA187))","v":447},"E1",1,"E",null,"سنوسي ",null," سنوسي "]
[185," ",1100413270174800,null,null,"أنثى","2004-07-08","مغنية","خارجي","3أ ف02",null,null,null,"ثالثة","آداب وفلسفة ",2,185,"E2",null,"طريق المسبح حي الشهداء مغنية ",null,null,null,null,null,null,{"$f":"IF($J188=\"\",\"\",MATCH($J188,OFFSET(BASE!$C$5,,,MAX(BASE!$B:$B)),0))","v":8},{"$f":"IF($AA188=\"\",\"\",60*($AA188-1)+COUNTIF($AA$9:$AA188,$AA188))","v":448},"E2",2,"E",null,"محمد ",null," محمد "]
[186," ",1100513270105500,null,null,"أنثى","2005-05-07","مغنية","خارجي","3أ ف02",null,null,null,"ثالثة","آداب وفلسفة ",2,186,"E2",null,"حي الشهداء - مغنية -  ",null,null,null,null,null,null,{"$f":"IF($J189=\"\",\"\",MATCH($J189,OFFSET(BASE!$C$5,,,MAX(BASE!$B:$B)),0))","v":8},{"$f":"IF($AA189=\"\",\"\",60*($AA189-1)+COUNTIF($AA$9:$AA189,$AA189))","v":449},"E2",2,"E",null,"محمد ",null," محمد "]
[187," ",1000513270037500,null,null,"ذكر","2005-02-11","مغنية","نصف داخلي","3لغات /إسبا",null,null,null,"ثالثة","لغات أجنبية إسبانية",1,187,"D1",null,"قرية العقيد عباس مغنية ",null,null,null,null,null,null,{"$f":"IF($J190=\"\",\"\",MATCH($J190,OFFSET(BASE!$C$5,,,MAX(BASE!$B:$B)),0))","v":9},{"$f":"IF($AA190=\"\",\"\",60*($AA190-1)+COUNTIF($AA$9:$AA190,$AA190))","v":481},"D1",1,"D",null,"رشيد ",null," رشيد "]
[188," ",1100613270031800,null,null,"أنثى","2006-02-04","مغنية","نصف داخلي","3لغات /إسبا",null,null,null,"ثالثة","لغات أجنبية إسبانية",1,188,"D2",null,"قرية العقيد عباس  - مغنية -  ",null,null,null,null,null,null,{"$f":"IF($J191=\"\",\"\",MATCH($J191,OFFSET(BASE!$C$5,,,MAX(BASE!$B:$B)),0))","v":9},{"$f":"IF($AA191=\"\",\"\",60*($AA191-1)+COUNTIF($AA$9:$AA191,$AA191))","v":482},"D2",2,"D",null,"محمد ",null," محمد "]
[189," ",1100413270203500,null,null,"أنثى","2004-07-29","مغنية","نصف داخلي","3لغات /إسبا",null,null,null,"ثالثة","لغات أجنبية إسبانية",1,189,"D2",null,"حي الشهداء مغنية ",null,null,null,null,null,null,{"$f":"IF($J192=\"\",\"\",MATCH($J192,OFFSET(BASE!$C$5,,,MAX(BASE!$B:$B)),0))","v":9},{"$f":"IF($AA192=\"\",\"\",60*($AA192-1)+COUNTIF($AA$9:$AA192,$AA192))","v":483},"D2",2,"D",null,"نور الدين ",null," نور الدين "]
[190," ",1100513270174400,null,null,"أنثى","2005-06-28","مغنية","نصف داخلي","3لغات /إسبا",null,null,null,"ثالثة","لغات أجنبية إسبانية",1,190,"D2",null,"قرية العقيد عباس -  مغنية -  ",null,null,null,null,null,null,{"$f":"IF($J193=\"\",\"\",MATCH($J193,OFFSET(BASE!$C$5,,,MAX(BASE!$B:$B)),0))","v":9},{"$f":"IF($AA193=\"\",\"\",60*($AA193-1)+COUNTIF($AA$9:$AA193,$AA193))","v":484},"D2",2,"D",null,"بن اعمر ",null," بن اعمر "]
[191," ",1100513270009900,null,null,"أنثى","2005-05-31","واد تليلات","نصف داخلي","3لغات /إسبا",null,null,null,"ثالثة","لغات أجنبية إسبانية",1,191,"D2",null,"قرية أولاد الشارف - مغنية - ",null,null,null,null,null,null,{"$f":"IF($J194=\"\",\"\",MATCH($J194,OFFSET(BASE!$C$5,,,MAX(BASE!$B:$B)),0))","v":9},{"$f":"IF($AA194=\"\",\"\",60*($AA194-1)+COUNTIF($AA$9:$AA194,$AA194))","v":485},"D2",2,"D",null,"عبد الله ",null," عبد الله "]
[192," ",1100513400021000,null,null,"أنثى","2005-06-01","ندرومة","نصف داخلي","3لغات /إسبا",null,null,null,"ثالثة","لغات أجنبية إسبانية",1,192,"D2",null,"قرية البطيم ",null,null,null,null,null,null,{"$f":"IF($J195=\"\",\"\",MATCH($J195,OFFSET(BASE!$C$5,,,MAX(BASE!$B:$B)),0))","v":9},{"$f":"IF($AA195=\"\",\"\",60*($AA195-1)+COUNTIF($AA$9:$AA195,$AA195))","v":486},"D2",2,"D",null,"سيدي محمد ",null," سيدي محمد "]
[193,{"$f":"D196& \" \" &E196","v":" "},1000213270251900,null,null,"ذكر","2002-11-10","مغنية","نصف داخلي","3لغات /إسبا",null,null,null,"ثالثة","لغات أجنبية إسبانية",1,193,"D1",null,"قرية العقيد عباس ",null,null,null,null,null,null,{"$f":"IF($J196=\"\",\"\",MATCH($J196,OFFSET(BASE!$C$5,,,MAX(BASE!$B:$B)),0))","v":9},{"$f":"IF($AA196=\"\",\"\",60*($AA196-1)+COUNTIF($AA$9:$AA196,$AA196))","v":487},"D1",1,"D",null,"صافي ",null," صافي "]
[194," ",1100513270132500,null,null,"أنثى","2005-06-05","مغنية","نصف داخلي","3لغات /إسبا",null,null,null,"ثالثة","لغات أجنبية إسبانية",1,194,"D2",null,"قرية العقيد عباس -  مغنية -  ",null,null,null,null,null,null,{"$f":"IF($J197=\"\",\"\",MATCH($J197,OFFSET(BASE!$C$5,,,MAX(BASE!$B:$B)),0))","v":9},{"$f":"IF($AA197=\"\",\"\",60*($AA197-1)+COUNTIF($AA$9:$AA197,$AA197))","v":488},"D2",2,"D",null,"محمد ",null," محمد "]
[195," ",1100513270143800,null,null,"أنثى","2005-06-08","مغنية","نصف داخلي","3لغات /إسبا",null,null,null,"ثالثة","لغات أجنبية إسبانية",1,195,"D2",null,"قرية العقيد عباس -  مغنية - ",null,null,null,null,null,null,{"$f":"IF($J198=\"\",\"\",MATCH($J198,OFFSET(BASE!$C$5,,,MAX(BASE!$B:$B)),0))","v":9},{"$f":"IF($AA198=\"\",\"\",60*($AA198-1)+COUNTIF($AA$9:$AA198,$AA198))","v":489},"D2",2,"D",null,"يوسف ",null," يوسف "]
[196," ",1100513270342800,null,null,"أنثى","2005-11-21","مغنية","نصف داخلي","3لغات /إسبا",null,null,null,"ثالثة","لغات أجنبية إسبانية",1,196,"D2",null,"قرية البطيم-مغنية- ",null,null,null,null,null,null,{"$f":"IF($J199=\"\",\"\",MATCH($J199,OFFSET(BASE!$C$5,,,MAX(BASE!$B:$B)),0))","v":9},{"$f":"IF($AA199=\"\",\"\",60*($AA199-1)+COUNTIF($AA$9:$AA199,$AA199))","v":490},"D2",2,"D",null,"عبد القادر ",null," عبد القادر "]
[197," ",1000313270073800,null,null,"ذكر","2003-04-13","مغنية","نصف داخلي","3لغات /إسبا",null,null,null,"ثالثة","لغات أجنبية إسبانية",1,197,"D1",null," ",null,null,null,null,null,null,{"$f":"IF($J200=\"\",\"\",MATCH($J200,OFFSET(BASE!$C$5,,,MAX(BASE!$B:$B)),0))","v":9},{"$f":"IF($AA200=\"\",\"\",60*($AA200-1)+COUNTIF($AA$9:$AA200,$AA200))","v":491},"D1",1,"D",null,"محمد ",null," محمد "]
[198," ",1100513270093700,null,null,"أنثى","2005-04-24","مغنية","نصف داخلي","3لغات /إسبا",null,null,null,"ثالثة","لغات أجنبية إسبانية",1,198,"D2",null,"قرية البطيم-مغنية- ",null,null,null,null,null,null,{"$f":"IF($J201=\"\",\"\",MATCH($J201,OFFSET(BASE!$C$5,,,MAX(BASE!$B:$B)),0))","v":9},{"$f":"IF($AA201=\"\",\"\",60*($AA201-1)+COUNTIF($AA$9:$AA201,$AA201))","v":492},"D2",2,"D",null,"امجاهد ",null,{"$f":"D201 & \" \" & AG201","v":" امجاهد "}]
[199," ",1100513270300100,null,null,"أنثى","2005-10-10","مغنية","نصف داخلي","3لغات /إسبا",null,null,null,"ثالثة","لغات أجنبية إسبانية",1,199,"D2",null,"قرية العقيد عباس مغنية ",null,null,null,null,null,null,{"$f":"IF($J202=\"\",\"\",MATCH($J202,OFFSET(BASE!$C$5,,,MAX(BASE!$B:$B)),0))","v":9},{"$f":"IF($AA202=\"\",\"\",60*($AA202-1)+COUNTIF($AA$9:$AA202,$AA202))","v":493},{"$f":"AE202&AD202","v":"D2"},{"$f":"IF(F202=\"أنثى\",2,1)","v":2},{"$f":"IF(I202=\"نصف داخلي\",\"D\",\"E\")","v":"D"},null,"مختار ",null," مختار "]
[200," ",1100513270844900,null,null,"أنثى","2005-11-29","تلمسان","نصف داخلي","3لغات /إسبا",null,null,null,"ثالثة","لغات أجنبية إسبانية",1,200,"D2",null,"قرية العقيد عباس - مغنية -  ",null,null,null,null,null,null,{"$f":"IF($J203=\"\",\"\",MATCH($J203,OFFSET(BASE!$C$5,,,MAX(BASE!$B:$B)),0))","v":9},{"$f":"IF($AA203=\"\",\"\",60*($AA203-1)+COUNTIF($AA$9:$AA203,$AA203))","v":494},"D2",2,"D",null,"أحمد ",null," أحمد "]
[201," ",1000213270207500,null,null,"ذكر","2002-09-20","مغنية","نصف داخلي","3لغات /إسبا",null,null,null,"ثالثة","لغات أجنبية إسبانية",1,201,"D1",null,"قرية العقيد عباس مغنية ",null,null,null,null,null,null,{"$f":"IF($J204=\"\",\"\",MATCH($J204,OFFSET(BASE!$C$5,,,MAX(BASE!$B:$B)),0))","v":9},{"$f":"IF($AA204=\"\",\"\",60*($AA204-1)+COUNTIF($AA$9:$AA204,$AA204))","v":495},"D1",1,"D",null,"بلخير ",null," بلخير "]
[202," ",1000413270249800,null,null,"ذكر","2004-09-13","مغنية","نصف داخلي","3لغات /إسبا",null,null,null,"ثالثة","لغات أجنبية إسبانية",1,202,"D1",null,"قرية البخاتة مغنية ",null,null,null,null,null,null,{"$f":"IF($J205=\"\",\"\",MATCH($J205,OFFSET(BASE!$C$5,,,MAX(BASE!$B:$B)),0))","v":9},{"$f":"IF($AA205=\"\",\"\",60*($AA205-1)+COUNTIF($AA$9:$AA205,$AA205))","v":496},"D1",1,"D",null,"العيد ",null," العيد "]
[203," ",1100613010189800,null,null,"أنثى","2006-03-23","تلمسان","نصف داخلي","3لغات /إسبا",null,null,null,"ثالثة","لغات أجنبية إسبانية",1,203,"D2",null,"1 حي أبوتاشفين تلمسان ",null,null,null,null,null,null,{"$f":"IF($J206=\"\",\"\",MATCH($J206,OFFSET(BASE!$C$5,,,MAX(BASE!$B:$B)),0))","v":9},{"$f":"IF($AA206=\"\",\"\",60*($AA206-1)+COUNTIF($AA$9:$AA206,$AA206))","v":497},"D2",2,"D",null,"عبد العالي ",null," عبد العالي "]
[204," ",1100513270134800,null,null,"أنثى","2005-06-02","مغنية","نصف داخلي","3لغات /إسبا",null,null,null,"ثالثة","لغات أجنبية إسبانية",1,204,"D2",null,"قرية البطيم مغنية ",null,null,null,null,null,null,{"$f":"IF($J207=\"\",\"\",MATCH($J207,OFFSET(BASE!$C$5,,,MAX(BASE!$B:$B)),0))","v":9},{"$f":"IF($AA207=\"\",\"\",60*($AA207-1)+COUNTIF($AA$9:$AA207,$AA207))","v":498},"D2",2,"D",null,"كريم ",null," كريم "]
[205," ",1100513270008900,null,null,"أنثى","2005-01-09","مغنية","نصف داخلي","3لغات /إسبا",null,null,null,"ثالثة","لغات أجنبية إسبانية",1,205,"D2",null,"قرية العقيد عباس - مغنية - ",null,null,null,null,null,null,{"$f":"IF($J208=\"\",\"\",MATCH($J208,OFFSET(BASE!$C$5,,,MAX(BASE!$B:$B)),0))","v":9},{"$f":"IF($AA208=\"\",\"\",60*($AA208-1)+COUNTIF($AA$9:$AA208,$AA208))","v":499},"D2",2,"D",null,"محمد ",null," محمد "]
[206," ",1100513270219500,null,null,"أنثى","2005-08-02","مغنية","نصف داخلي","3لغات /إسبا",null,null,null,"ثالثة","لغات أجنبية إسبانية",1,206,"D2",null,"اولاد معيدر ",null,null,null,null,null,null,{"$f":"IF($J209=\"\",\"\",MATCH($J209,OFFSET(BASE!$C$5,,,MAX(BASE!$B:$B)),0))","v":9},{"$f":"IF($AA209=\"\",\"\",60*($AA209-1)+COUNTIF($AA$9:$AA209,$AA209))","v":500},"D2",2,"D",null,"بلخير ",null," بلخير "]
[207," ",1100513270123700,null,null,"أنثى","2005-05-25","مغنية","نصف داخلي","3لغات /إسبا",null,null,null,"ثالثة","لغات أجنبية إسبانية",1,207,"D2",null,"قرية البطيم مغنية ",null,null,null,null,null,null,{"$f":"IF($J210=\"\",\"\",MATCH($J210,OFFSET(BASE!$C$5,,,MAX(BASE!$B:$B)),0))","v":9},{"$f":"IF($AA210=\"\",\"\",60*($AA210-1)+COUNTIF($AA$9:$AA210,$AA210))","v":501},"D2",2,"D",null,"أحمد ",null," أحمد "]
[208," ",1100513270306200,null,null,"أنثى","2005-10-16","مغنية","نصف داخلي","3لغات /إسبا",null,null,null,"ثالثة","لغات أجنبية إسبانية",1,208,"D2",null,"مزرعة شعبان حمدوت - مغنية - ",null,null,null,null,null,null,{"$f":"IF($J211=\"\",\"\",MATCH($J211,OFFSET(BASE!$C$5,,,MAX(BASE!$B:$B)),0))","v":9},{"$f":"IF($AA211=\"\",\"\",60*($AA211-1)+COUNTIF($AA$9:$AA211,$AA211))","v":502},"D2",2,"D",null,"عبد المومن ",null," عبد المومن "]
[209," ",1100513270322900,null,null,"أنثى","2005-11-02","مغنية","نصف داخلي","3لغات /إسبا",null,null,null,"ثالثة","لغات أجنبية إسبانية",1,209,"D2",null,"قرية العقيد عباس - مغنية -  ",null,null,null,null,null,null,{"$f":"IF($J212=\"\",\"\",MATCH($J212,OFFSET(BASE!$C$5,,,MAX(BASE!$B:$B)),0))","v":9},{"$f":"IF($AA212=\"\",\"\",60*($AA212-1)+COUNTIF($AA$9:$AA212,$AA212))","v":503},"D2",2,"D",null,"محمد ",null," محمد "]
[210," ",1100513010135300,null,null,"أنثى","2005-03-06","تلمسان","خارجي","3لغات /إسبا",null,null,null,"ثالثة","لغات أجنبية إسبانية",1,210,"E2",null,"17حي بوضياف ابوتشفين تلمسان ",null,null,null,null,null,null,{"$f":"IF($J213=\"\",\"\",MATCH($J213,OFFSET(BASE!$C$5,,,MAX(BASE!$B:$B)),0))","v":9},{"$f":"IF($AA213=\"\",\"\",60*($AA213-1)+COUNTIF($AA$9:$AA213,$AA213))","v":504},"E2",2,"E",null,"حبيب ",null," حبيب "]
[211," ",1000313270302500,null,null,"ذكر","2003-12-30","مغنية","خارجي","3لغات /إسبا",null,null,null,"ثالثة","لغات أجنبية إسبانية",1,211,"E1",null,"طريق الزوية المصامدة مغنية ",null,null,null,null,null,null,{"$f":"IF($J214=\"\",\"\",MATCH($J214,OFFSET(BASE!$C$5,,,MAX(BASE!$B:$B)),0))","v":9},{"$f":"IF($AA214=\"\",\"\",60*($AA214-1)+COUNTIF($AA$9:$AA214,$AA214))","v":505},"E1",1,"E",null,"حسين ",null," حسين "]
[212," ",1100413270062400,null,null,"أنثى","2004-03-15","مغنية","خارجي","3لغات /إسبا",null,null,null,"ثالثة","لغات أجنبية إسبانية",1,212,"E2",null,"حي المدرجات ",null,null,null,null,null,null,{"$f":"IF($J215=\"\",\"\",MATCH($J215,OFFSET(BASE!$C$5,,,MAX(BASE!$B:$B)),0))","v":9},{"$f":"IF($AA215=\"\",\"\",60*($AA215-1)+COUNTIF($AA$9:$AA215,$AA215))","v":506},"E2",2,"E",null,"نور الدين ",null," نور الدين "]
[213," ",1100213270019300,null,null,"أنثى","2002-01-29","مغنية","خارجي","3لغات /إسبا",null,null,null,"ثالثة","لغات أجنبية إسبانية",1,213,"E2",null,"حي الشهداء مغنية ",null,null,null,null,null,null,{"$f":"IF($J216=\"\",\"\",MATCH($J216,OFFSET(BASE!$C$5,,,MAX(BASE!$B:$B)),0))","v":9},{"$f":"IF($AA216=\"\",\"\",60*($AA216-1)+COUNTIF($AA$9:$AA216,$AA216))","v":507},"E2",2,"E",null,"عبد الناصر ",null," عبد الناصر "]
[214," ",1100613270017100,null,null,"أنثى","2006-01-18","مغنية","خارجي","3لغات /إسبا",null,null,null,"ثالثة","لغات أجنبية إسبانية",1,214,"E2",null,"حي الشهداء - مغنية -  ",null,null,null,null,null,null,{"$f":"IF($J217=\"\",\"\",MATCH($J217,OFFSET(BASE!$C$5,,,MAX(BASE!$B:$B)),0))","v":9},{"$f":"IF($AA217=\"\",\"\",60*($AA217-1)+COUNTIF($AA$9:$AA217,$AA217))","v":508},"E2",2,"E",null,"محمد ",null," محمد "]
[215," ",1000313270125800,null,null,"ذكر","2003-06-15","مغنية","خارجي","3لغات /إسبا",null,null,null,"ثالثة","لغات أجنبية إسبانية",1,215,"E1",null,"أولاد الشارف مغنية ",null,null,null,null,null,null,{"$f":"IF($J218=\"\",\"\",MATCH($J218,OFFSET(BASE!$C$5,,,MAX(BASE!$B:$B)),0))","v":9},{"$f":"IF($AA218=\"\",\"\",60*($AA218-1)+COUNTIF($AA$9:$AA218,$AA218))","v":509},"E1",1,"E",null,"يزيد ",null," يزيد "]
[216," ",1100513270132200,null,null,"أنثى","2005-05-31","مغنية","خارجي","3لغات /إسبا",null,null,null,"ثالثة","لغات أجنبية إسبانية",1,216,"E2",null,"حي الشهداء - مغنية -  ",null,null,null,null,null,null,{"$f":"IF($J219=\"\",\"\",MATCH($J219,OFFSET(BASE!$C$5,,,MAX(BASE!$B:$B)),0))","v":9},{"$f":"IF($AA219=\"\",\"\",60*($AA219-1)+COUNTIF($AA$9:$AA219,$AA219))","v":510},"E2",2,"E",null,"محمد ",null," محمد "]
[217," ",1100613270228800,null,null,"أنثى","2006-08-12","مغنية","نصف داخلي","2ت ر/هم",null,null,null,"ثانية","تقني رياضي هندسة مدنية",1,217,"D2",null,"قرية البطيم-مغنية- ",null,null,null,null,null,null,{"$f":"IF($J220=\"\",\"\",MATCH($J220,OFFSET(BASE!$C$5,,,MAX(BASE!$B:$B)),0))","v":10},{"$f":"IF($AA220=\"\",\"\",60*($AA220-1)+COUNTIF($AA$9:$AA220,$AA220))","v":541},"D2",2,"D",null,"امحمد ",null," امحمد "]
[218," ",1100613270003800,null,null,"أنثى","2006-02-05","مغنية","نصف داخلي","2ت ر/هم",null,null,null,"ثانية","تقني رياضي هندسة مدنية",1,218,"D2",null,"سيدي مجاهد بني بوسعيد تلمسان ",null,null,null,null,null,null,{"$f":"IF($J221=\"\",\"\",MATCH($J221,OFFSET(BASE!$C$5,,,MAX(BASE!$B:$B)),0))","v":10},{"$f":"IF($AA221=\"\",\"\",60*($AA221-1)+COUNTIF($AA$9:$AA221,$AA221))","v":542},"D2",2,"D",null,"أحمد ",null," أحمد "]
[219," ",1000413270144800,null,null,"ذكر","2004-06-18","مغنية","نصف داخلي","2ت ر/هم",null,null,null,"ثانية","تقني رياضي هندسة مدنية",1,219,"D1",null,"حي العزوني مغنية ",null,null,null,null,null,null,{"$f":"IF($J222=\"\",\"\",MATCH($J222,OFFSET(BASE!$C$5,,,MAX(BASE!$B:$B)),0))","v":10},{"$f":"IF($AA222=\"\",\"\",60*($AA222-1)+COUNTIF($AA$9:$AA222,$AA222))","v":543},"D1",1,"D",null,"جمال الدين ",null," جمال الدين "]
[220," ",1100613010314300,null,null,"أنثى","2006-05-12","تلمسان","نصف داخلي","2ت ر/هم",null,null,null,"ثانية","تقني رياضي هندسة مدنية",1,220,"D2",null,"قرية البطيم مغنية ",null,null,null,null,null,null,{"$f":"IF($J223=\"\",\"\",MATCH($J223,OFFSET(BASE!$C$5,,,MAX(BASE!$B:$B)),0))","v":10},{"$f":"IF($AA223=\"\",\"\",60*($AA223-1)+COUNTIF($AA$9:$AA223,$AA223))","v":544},"D2",2,"D",null,"معزوز ",null," معزوز "]
[221," ",1000613270227700,null,null,"ذكر","2006-08-10","مغنية","نصف داخلي","2ت ر/هم",null,null,null,"ثانية","تقني رياضي هندسة مدنية",1,221,"D1",null,"قرية العقيد عباس - مغنية -  ",null,null,null,null,null,null,{"$f":"IF($J224=\"\",\"\",MATCH($J224,OFFSET(BASE!$C$5,,,MAX(BASE!$B:$B)),0))","v":10},{"$f":"IF($AA224=\"\",\"\",60*($AA224-1)+COUNTIF($AA$9:$AA224,$AA224))","v":545},"D1",1,"D",null,"نبيل ",null," نبيل "]
[222," ",1100613270374700,null,null,"أنثى","2006-12-25","مغنية","نصف داخلي","2ت ر/هم",null,null,null,"ثانية","تقني رياضي هندسة مدنية",1,222,"D2",null,"قرية البطيم-مغنية- ",null,null,null,null,null,null,{"$f":"IF($J225=\"\",\"\",MATCH($J225,OFFSET(BASE!$C$5,,,MAX(BASE!$B:$B)),0))","v":10},{"$f":"IF($AA225=\"\",\"\",60*($AA225-1)+COUNTIF($AA$9:$AA225,$AA225))","v":546},"D2",2,"D",null,"ميلود ",null," ميلود "]
[223," ",1000613010269300,null,null,"ذكر","2006-04-26","تلمسان","نصف داخلي","2ت ر/هم",null,null,null,"ثانية","تقني رياضي هندسة مدنية",1,223,"D1",null,"قرية البطيم-مغنية- ",null,null,null,null,null,null,{"$f":"IF($J226=\"\",\"\",MATCH($J226,OFFSET(BASE!$C$5,,,MAX(BASE!$B:$B)),0))","v":10},{"$f":"IF($AA226=\"\",\"\",60*($AA226-1)+COUNTIF($AA$9:$AA226,$AA226))","v":547},"D1",1,"D",null,"رشيد ",null," رشيد "]
[224," ",1000313270564200,null,null,"ذكر","2003-06-15","مغنية","نصف داخلي","2ت ر/هم",null,null,null,"ثانية","تقني رياضي هندسة مدنية",1,224,"D1",null,null,null,null,null,null,null,null,{"$f":"IF($J227=\"\",\"\",MATCH($J227,OFFSET(BASE!$C$5,,,MAX(BASE!$B:$B)),0))","v":10},{"$f":"IF($AA227=\"\",\"\",60*($AA227-1)+COUNTIF($AA$9:$AA227,$AA227))","v":548},"D1",1,"D",null,null,null," "]
[225," ",1100613270251400,null,null,"أنثى","2006-09-01","مغنية","نصف داخلي","2ت ر/هم",null,null,null,"ثانية","تقني رياضي هندسة مدنية",1,225,"D2",null,"حي العزوني ",null,null,null,null,null,null,{"$f":"IF($J228=\"\",\"\",MATCH($J228,OFFSET(BASE!$C$5,,,MAX(BASE!$B:$B)),0))","v":10},{"$f":"IF($AA228=\"\",\"\",60*($AA228-1)+COUNTIF($AA$9:$AA228,$AA228))","v":549},"D2",2,"D",null,"محمد ",null," محمد "]
[226," ",1000413270284800,null,null,"ذكر","2004-10-16","مغنية","نصف داخلي","2ت ر/هم",null,null,null,"ثانية","تقني رياضي هندسة مدنية",1,226,"D1",null,"قرية العقيد عباس -  مغنية -  ",null,null,null,null,null,null,{"$f":"IF($J229=\"\",\"\",MATCH($J229,OFFSET(BASE!$C$5,,,MAX(BASE!$B:$B)),0))","v":10},{"$f":"IF($AA229=\"\",\"\",60*($AA229-1)+COUNTIF($AA$9:$AA229,$AA229))","v":550},"D1",1,"D",null,"محمد ",null," محمد "]
[227," ",1000613270315500,null,null,"ذكر","2006-10-25","مغنية","خارجي","2ت ر/هم",null,null,null,"ثانية","تقني رياضي هندسة مدنية",1,227,"E1",null,"حي الشهداء ",null,null,null,null,null,null,{"$f":"IF($J230=\"\",\"\",MATCH($J230,OFFSET(BASE!$C$5,,,MAX(BASE!$B:$B)),0))","v":10},{"$f":"IF($AA230=\"\",\"\",60*($AA230-1)+COUNTIF($AA$9:$AA230,$AA230))","v":551},"E1",1,"E",null,"عبد الحق ",null," عبد الحق "]
[228," ",1000613270463000,null,null,"ذكر","2006-06-27","مغنية","خارجي","2ت ر/هم",null,null,null,"ثانية","تقني رياضي هندسة مدنية",1,228,"E1",null,"قرية اولاد الشارف - مغنية -  ",null,null,null,null,null,null,{"$f":"IF($J231=\"\",\"\",MATCH($J231,OFFSET(BASE!$C$5,,,MAX(BASE!$B:$B)),0))","v":10},{"$f":"IF($AA231=\"\",\"\",60*($AA231-1)+COUNTIF($AA$9:$AA231,$AA231))","v":552},"E1",1,"E",null,"أحمد ",null," أحمد "]
[229," ",1000513270052400,null,null,"ذكر","2005-03-02","مغنية","خارجي","2ت ر/هم",null,null,null,"ثانية","تقني رياضي هندسة مدنية",1,229,"E1",null,"بلدية حمام بوغرارة 13036 تلمسان ",null,null,null,null,null,null,{"$f":"IF($J232=\"\",\"\",MATCH($J232,OFFSET(BASE!$C$5,,,MAX(BASE!$B:$B)),0))","v":10},{"$f":"IF($AA232=\"\",\"\",60*($AA232-1)+COUNTIF($AA$9:$AA232,$AA232))","v":553},"E1",1,"E",null,"عمر ",null," عمر "]
[230," ",1100513270330100,null,null,"أنثى","2005-11-07","مغنية","خارجي","2ت ر/هم",null,null,null,"ثانية","تقني رياضي هندسة مدنية",1,230,"E2",null,"حي الشهداء - مغنية -  ",null,null,null,null,null,null,{"$f":"IF($J233=\"\",\"\",MATCH($J233,OFFSET(BASE!$C$5,,,MAX(BASE!$B:$B)),0))","v":10},{"$f":"IF($AA233=\"\",\"\",60*($AA233-1)+COUNTIF($AA$9:$AA233,$AA233))","v":554},"E2",2,"E",null,"نجيم ",null," نجيم "]
[231," ",1000731010527100,null,null,"ذكر","2007-05-13","وهران","خارجي","2ت ر/هم",null,null,null,"ثانية","تقني رياضي هندسة مدنية",1,231,"E1",null,null,null,null,null,null,null,null,{"$f":"IF($J234=\"\",\"\",MATCH($J234,OFFSET(BASE!$C$5,,,MAX(BASE!$B:$B)),0))","v":10},{"$f":"IF($AA234=\"\",\"\",60*($AA234-1)+COUNTIF($AA$9:$AA234,$AA234))","v":555},"E1",1,"E",null,null,null," "]
[232," ",1000613270308600,null,null,"ذكر","2006-10-19","مغنية","خارجي","2ت ر/هم",null,null,null,"ثانية","تقني رياضي هندسة مدنية",1,232,"E1",null,"طريق و وجدة حي الزيتون مغنية ",null,null,null,null,null,null,{"$f":"IF($J235=\"\",\"\",MATCH($J235,OFFSET(BASE!$C$5,,,MAX(BASE!$B:$B)),0))","v":10},{"$f":"IF($AA235=\"\",\"\",60*($AA235-1)+COUNTIF($AA$9:$AA235,$AA235))","v":556},"E1",1,"E",null,"محمد ",null," محمد "]
[233," ",1000713270193300,null,null,"ذكر","2007-03-27","تلمسان","خارجي","2ت ر/هم",null,null,null,"ثانية","تقني رياضي هندسة مدنية",1,233,"E1",null,"حي عمر المختار  - مغنية ",null,null,null,null,null,null,{"$f":"IF($J236=\"\",\"\",MATCH($J236,OFFSET(BASE!$C$5,,,MAX(BASE!$B:$B)),0))","v":10},{"$f":"IF($AA236=\"\",\"\",60*($AA236-1)+COUNTIF($AA$9:$AA236,$AA236))","v":557},"E1",1,"E",null,"علي ",null," علي "]
[234," ",1000613270355800,null,null,"ذكر","2006-12-02","مغنية","نصف داخلي","2ت ر/هم",null,null,null,"ثانية","تقني رياضي هندسة كهربائية",1,234,"D1",null,"قرية العقيد عباس مغنية ",null,null,null,null,null,null,{"$f":"IF($J237=\"\",\"\",MATCH($J237,OFFSET(BASE!$C$5,,,MAX(BASE!$B:$B)),0))","v":10},{"$f":"IF($AA237=\"\",\"\",60*($AA237-1)+COUNTIF($AA$9:$AA237,$AA237))","v":558},"D1",1,"D",null,"ميلود ",null," ميلود "]
[235," ",1000613270136400,null,null,"ذكر","2006-06-01","مغنية","نصف داخلي","2ت ر/هم",null,null,null,"ثانية","تقني رياضي هندسة كهربائية",1,235,"D1",null,"أولاد الشارف ",null,null,null,null,null,null,{"$f":"IF($J238=\"\",\"\",MATCH($J238,OFFSET(BASE!$C$5,,,MAX(BASE!$B:$B)),0))","v":10},{"$f":"IF($AA238=\"\",\"\",60*($AA238-1)+COUNTIF($AA$9:$AA238,$AA238))","v":559},"D1",1,"D",null,"محمد ",null," محمد "]
[236," ",1000513270371700,null,null,"ذكر","2005-12-21","مغنية","نصف داخلي","2ت ر/هم",null,null,null,"ثانية","تقني رياضي هندسة كهربائية",1,236,"D1",null,"قرية المصامدة - مغنية -  ",null,null,null,null,null,null,{"$f":"IF($J239=\"\",\"\",MATCH($J239,OFFSET(BASE!$C$5,,,MAX(BASE!$B:$B)),0))","v":10},{"$f":"IF($AA239=\"\",\"\",60*($AA239-1)+COUNTIF($AA$9:$AA239,$AA239))","v":560},"D1",1,"D",null,"شيخ ",null," شيخ "]
[237," ",1100608010008500,null,null,"أنثى","2006-01-06","بشار","نصف داخلي","2ت ر/هم",null,null,null,"ثانية","تقني رياضي هندسة كهربائية",1,237,"D2",null,"قرية المصامدة - مغنية - تلمسان ",null,null,null,null,null,null,{"$f":"IF($J240=\"\",\"\",MATCH($J240,OFFSET(BASE!$C$5,,,MAX(BASE!$B:$B)),0))","v":10},{"$f":"IF($AA240=\"\",\"\",60*($AA240-1)+COUNTIF($AA$9:$AA240,$AA240))","v":561},"D2",2,"D",null,"لحبيب ",null," لحبيب "]
[238," ",1100613270109300,null,null,"أنثى","2006-05-09","مغنية","نصف داخلي","2ت إ01",null,null,null,"ثانية","تسيير واقتصاد ",1,238,"D2",null,"اولاد قدور الصغار ",null,null,null,null,null,null,{"$f":"IF($J241=\"\",\"\",MATCH($J241,OFFSET(BASE!$C$5,,,MAX(BASE!$B:$B)),0))","v":12},{"$f":"IF($AA241=\"\",\"\",60*($AA241-1)+COUNTIF($AA$9:$AA241,$AA241))","v":661},"D2",2,"D",null,"بلخير ",null," بلخير "]
[239," ",1100313270050300,null,null,"أنثى","2003-12-17","مغنية","نصف داخلي","2ت إ01",null,null,null,"ثانية","تسيير واقتصاد ",1,239,"D2",null,"قرية اولاد قدور الكبار مغنية ",null,null,null,null,null,null,{"$f":"IF($J242=\"\",\"\",MATCH($J242,OFFSET(BASE!$C$5,,,MAX(BASE!$B:$B)),0))","v":12},{"$f":"IF($AA242=\"\",\"\",60*($AA242-1)+COUNTIF($AA$9:$AA242,$AA242))","v":662},"D2",2,"D",null,"واسيني ",null," واسيني "]
[240," ",1000413270055400,null,null,"ذكر","2004-03-06","مغنية","نصف داخلي","2ت إ01",null,null,null,"ثانية","تسيير واقتصاد ",1,240,"D1",null,"قرية أولاد قدور - مغنية -  ",null,null,null,null,null,null,{"$f":"IF($J243=\"\",\"\",MATCH($J243,OFFSET(BASE!$C$5,,,MAX(BASE!$B:$B)),0))","v":12},{"$f":"IF($AA243=\"\",\"\",60*($AA243-1)+COUNTIF($AA$9:$AA243,$AA243))","v":663},"D1",1,"D",null,"ميلود ",null," ميلود "]
[241," ",1100613270193300,null,null,"أنثى","2006-07-13","مغنية","نصف داخلي","2ت إ01",null,null,null,"ثانية","تسيير واقتصاد ",1,241,"D2",null,"اولاد معيدر ",null,null,null,null,null,null,{"$f":"IF($J244=\"\",\"\",MATCH($J244,OFFSET(BASE!$C$5,,,MAX(BASE!$B:$B)),0))","v":12},{"$f":"IF($AA244=\"\",\"\",60*($AA244-1)+COUNTIF($AA$9:$AA244,$AA244))","v":664},"D2",2,"D",null,"حسين ",null," حسين "]
[242," ",1000513270236200,null,null,"ذكر","2005-08-15","مغنية","نصف داخلي","2ت إ01",null,null,null,"ثانية","تسيير واقتصاد ",1,242,"D1",null,"قرية العقيد عباس مغنية ",null,null,null,null,null,null,{"$f":"IF($J245=\"\",\"\",MATCH($J245,OFFSET(BASE!$C$5,,,MAX(BASE!$B:$B)),0))","v":12},{"$f":"IF($AA245=\"\",\"\",60*($AA245-1)+COUNTIF($AA$9:$AA245,$AA245))","v":665},"D1",1,"D",null,"عفان ",null," عفان "]
[243," ",1100613270242400,null,null,"أنثى","2006-08-23","مغنية","نصف داخلي","2ت إ01",null,null,null,"ثانية","تسيير واقتصاد ",1,243,"D2",null,"قرية العقيد عباس - مغنية - ",null,null,null,null,null,null,{"$f":"IF($J246=\"\",\"\",MATCH($J246,OFFSET(BASE!$C$5,,,MAX(BASE!$B:$B)),0))","v":12},{"$f":"IF($AA246=\"\",\"\",60*($AA246-1)+COUNTIF($AA$9:$AA246,$AA246))","v":666},"D2",2,"D",null,"علي ",null," علي "]
[244," ",1000513270224300,null,null,"ذكر","2005-08-06","مغنية","نصف داخلي","2ت إ01",null,null,null,"ثانية","تسيير واقتصاد ",1,244,"D1",null,"قرية البطيم ",null,null,null,null,null,null,{"$f":"IF($J247=\"\",\"\",MATCH($J247,OFFSET(BASE!$C$5,,,MAX(BASE!$B:$B)),0))","v":12},{"$f":"IF($AA247=\"\",\"\",60*($AA247-1)+COUNTIF($AA$9:$AA247,$AA247))","v":667},"D1",1,"D",null,"سالم ",null," سالم "]
[245," ",1000613270162700,null,null,"ذكر","2006-06-20","مغنية","نصف داخلي","2ت إ01",null,null,null,"ثانية","تسيير واقتصاد ",1,245,"D1",null,"ص . ب . 512  - مغنية - تلمسان ",null,null,null,null,null,null,{"$f":"IF($J248=\"\",\"\",MATCH($J248,OFFSET(BASE!$C$5,,,MAX(BASE!$B:$B)),0))","v":12},{"$f":"IF($AA248=\"\",\"\",60*($AA248-1)+COUNTIF($AA$9:$AA248,$AA248))","v":668},"D1",1,"D",null,"أحمد ",null," أحمد "]
[246," ",1100313270875200,null,null,"أنثى","2003-11-02","مغنية","نصف داخلي","2ت إ01",null,null,null,"ثانية","تسيير واقتصاد ",1,246,"D2",null,"قرية أولاد الشارف - مغنية -  ",null,null,null,null,null,null,{"$f":"IF($J249=\"\",\"\",MATCH($J249,OFFSET(BASE!$C$5,,,MAX(BASE!$B:$B)),0))","v":12},{"$f":"IF($AA249=\"\",\"\",60*($AA249-1)+COUNTIF($AA$9:$AA249,$AA249))","v":669},"D2",2,"D",null,"عبد الحميد ",null," عبد الحميد "]
[247," ",1100622010602500,null,null,"أنثى","2006-08-21","سيدي بلعباس","نصف داخلي","2ت إ01",null,null,null,"ثانية","تسيير واقتصاد ",1,247,"D2",null,"قرية المصامدة - مغنية - تلمسان ",null,null,null,null,null,null,{"$f":"IF($J250=\"\",\"\",MATCH($J250,OFFSET(BASE!$C$5,,,MAX(BASE!$B:$B)),0))","v":12},{"$f":"IF($AA250=\"\",\"\",60*($AA250-1)+COUNTIF($AA$9:$AA250,$AA250))","v":670},"D2",2,"D",null,"عباس ",null," عباس "]
[248," ",1100613270287900,null,null,"أنثى","2006-10-02","مغنية","نصف داخلي","2ت إ01",null,null,null,"ثانية","تسيير واقتصاد ",1,248,"D2",null,"حي المطمر مغنية ",null,null,null,null,null,null,{"$f":"IF($J251=\"\",\"\",MATCH($J251,OFFSET(BASE!$C$5,,,MAX(BASE!$B:$B)),0))","v":12},{"$f":"IF($AA251=\"\",\"\",60*($AA251-1)+COUNTIF($AA$9:$AA251,$AA251))","v":671},"D2",2,"D",null,"عمر ",null," عمر "]
[249," ",1100514160071700,null,null,"أنثى","2005-03-30","السوقر","نصف داخلي","2ت إ01",null,null,null,"ثانية","تسيير واقتصاد ",1,249,"D2",null,"أولاد الشارف مغنية ",null,null,null,null,null,null,{"$f":"IF($J252=\"\",\"\",MATCH($J252,OFFSET(BASE!$C$5,,,MAX(BASE!$B:$B)),0))","v":12},{"$f":"IF($AA252=\"\",\"\",60*($AA252-1)+COUNTIF($AA$9:$AA252,$AA252))","v":672},"D2",2,"D",null,"عبد الجليل ",null," عبد الجليل "]
[250," ",1100513270042800,null,null,"أنثى","2005-10-08","ندرومة","نصف داخلي","2ت إ01",null,null,null,"ثانية","تسيير واقتصاد ",1,250,"D2",null,"دوار المرازقة  -  مغنية -  ",null,null,null,null,null,null,{"$f":"IF($J253=\"\",\"\",MATCH($J253,OFFSET(BASE!$C$5,,,MAX(BASE!$B:$B)),0))","v":12},{"$f":"IF($AA253=\"\",\"\",60*($AA253-1)+COUNTIF($AA$9:$AA253,$AA253))","v":673},"D2",2,"D",null,"محمد ",null," محمد "]
[251," ",1100613010128700,null,null,"أنثى","2006-07-13","تلمسان","نصف داخلي","2ت إ01",null,null,null,"ثانية","تسيير واقتصاد ",1,251,"D2",null,"قرية البطيم ",null,null,null,null,null,null,{"$f":"IF($J254=\"\",\"\",MATCH($J254,OFFSET(BASE!$C$5,,,MAX(BASE!$B:$B)),0))","v":12},{"$f":"IF($AA254=\"\",\"\",60*($AA254-1)+COUNTIF($AA$9:$AA254,$AA254))","v":674},"D2",2,"D",null,"حسين ",null," حسين "]
[252," ",1000613270242800,null,null,"ذكر","2006-08-23","مغنية","نصف داخلي","2ت إ01",null,null,null,"ثانية","تسيير واقتصاد ",1,252,"D1",null,"قرية أولاد الشارف - مغنية -  ",null,null,null,null,null,null,{"$f":"IF($J255=\"\",\"\",MATCH($J255,OFFSET(BASE!$C$5,,,MAX(BASE!$B:$B)),0))","v":12},{"$f":"IF($AA255=\"\",\"\",60*($AA255-1)+COUNTIF($AA$9:$AA255,$AA255))","v":675},"D1",1,"D",null,"أحمد ",null," أحمد "]
[253," ",1000613270189500,null,null,"ذكر","2006-07-10","مغنية","نصف داخلي","2ت إ01",null,null,null,"ثانية","تسيير واقتصاد ",1,253,"D1",null,"قرية البطيم-مغنية- ",null,null,null,null,null,null,{"$f":"IF($J256=\"\",\"\",MATCH($J256,OFFSET(BASE!$C$5,,,MAX(BASE!$B:$B)),0))","v":12},{"$f":"IF($AA256=\"\",\"\",60*($AA256-1)+COUNTIF($AA$9:$AA256,$AA256))","v":676},"D1",1,"D",null,"بن عامر ",null," بن عامر "]
[254," ",1100613270316600,null,null,"أنثى","2006-10-26","مغنية","نصف داخلي","2ت إ01",null,null,null,"ثانية","تسيير واقتصاد ",1,254,"D2",null,"قرية المصامدة - مغنية - تلمسان ",null,null,null,null,null,null,{"$f":"IF($J257=\"\",\"\",MATCH($J257,OFFSET(BASE!$C$5,,,MAX(BASE!$B:$B)),0))","v":12},{"$f":"IF($AA257=\"\",\"\",60*($AA257-1)+COUNTIF($AA$9:$AA257,$AA257))","v":677},"D2",2,"D",null,"مصطفى ",null," مصطفى "]
[255," ",1100413270128200,null,null,"أنثى","2004-06-01","مغنية","نصف داخلي","2ت إ01",null,null,null,"ثانية","تسيير واقتصاد ",1,255,"D2",null,"قرية المصامدة - مغنية -  ",null,null,null,null,null,null,{"$f":"IF($J258=\"\",\"\",MATCH($J258,OFFSET(BASE!$C$5,,,MAX(BASE!$B:$B)),0))","v":12},{"$f":"IF($AA258=\"\",\"\",60*($AA258-1)+COUNTIF($AA$9:$AA258,$AA258))","v":678},"D2",2,"D",null,"بوعناني  ",null," بوعناني  "]
[256," ",1100413270128100,null,null,"أنثى","2004-06-01","مغنية","نصف داخلي","2ت إ01",null,null,null,"ثانية","تسيير واقتصاد ",1,256,"D2",null,"قرية المصامدة -  مغنية -  ",null,null,null,null,null,null,{"$f":"IF($J259=\"\",\"\",MATCH($J259,OFFSET(BASE!$C$5,,,MAX(BASE!$B:$B)),0))","v":12},{"$f":"IF($AA259=\"\",\"\",60*($AA259-1)+COUNTIF($AA$9:$AA259,$AA259))","v":679},"D2",2,"D",null,"بوعناني ",null," بوعناني "]
[257,{"$f":"D260& \" \" &E260","v":" "},1000513270319000,null,null,"ذكر","2005-10-29","مغنية","نصف داخلي","2ت إ01",null,null,null,"ثانية","تسيير واقتصاد ",1,257,"D1",null,"درب 01 رقم10 حي العربي بن مهيدي -مغنية- ",null,null,null,null,null,null,{"$f":"IF($J260=\"\",\"\",MATCH($J260,OFFSET(BASE!$C$5,,,MAX(BASE!$B:$B)),0))","v":12},{"$f":"IF($AA260=\"\",\"\",60*($AA260-1)+COUNTIF($AA$9:$AA260,$AA260))","v":680},"D1",1,"D",null,"سليم ",null," سليم "]
[258," ",1000613270049000,null,null,"ذكر","2006-02-24","مغنية","نصف داخلي","2ت إ01",null,null,null,"ثانية","تسيير واقتصاد ",1,258,"D1",null,"قرية البطيم مغنية ",null,null,null,null,null,null,{"$f":"IF($J261=\"\",\"\",MATCH($J261,OFFSET(BASE!$C$5,,,MAX(BASE!$B:$B)),0))","v":12},{"$f":"IF($AA261=\"\",\"\",60*($AA261-1)+COUNTIF($AA$9:$AA261,$AA261))","v":681},"D1",1,"D",null,"عبد الرحمان ",null," عبد الرحمان "]
[259," ",1100513270176000,null,null,"أنثى","2005-06-30","مغنية","نصف داخلي","2ت إ01",null,null,null,"ثانية","تسيير واقتصاد ",1,259,"D2",null,"دوار المرازقة  - مغنية -  ",null,null,null,null,null,null,{"$f":"IF($J262=\"\",\"\",MATCH($J262,OFFSET(BASE!$C$5,,,MAX(BASE!$B:$B)),0))","v":12},{"$f":"IF($AA262=\"\",\"\",60*($AA262-1)+COUNTIF($AA$9:$AA262,$AA262))","v":682},"D2",2,"D",null,"عبد الله ",null," عبد الله "]
[260," ",1000613270471200,null,null,"ذكر","2006-06-30","مغنية","نصف داخلي","2ت إ01",null,null,null,"ثانية","تسيير واقتصاد ",1,260,"D1",null,"قرية أولاد الشارف - مغنية - ",null,null,null,null,null,null,{"$f":"IF($J263=\"\",\"\",MATCH($J263,OFFSET(BASE!$C$5,,,MAX(BASE!$B:$B)),0))","v":12},{"$f":"IF($AA263=\"\",\"\",60*($AA263-1)+COUNTIF($AA$9:$AA263,$AA263))","v":683},"D1",1,"D",null,"مصطفى ",null," مصطفى "]
[261," ",1000613270411900,null,null,"ذكر","2006-06-12","تلمسان","نصف داخلي","2ت إ01",null,null,null,"ثانية","تسيير واقتصاد ",1,261,"D1",null,"قرية أولاد الشارف - مغنية -  ",null,null,null,null,null,null,{"$f":"IF($J264=\"\",\"\",MATCH($J264,OFFSET(BASE!$C$5,,,MAX(BASE!$B:$B)),0))","v":12},{"$f":"IF($AA264=\"\",\"\",60*($AA264-1)+COUNTIF($AA$9:$AA264,$AA264))","v":684},"D1",1,"D",null,"عبد العالي ",null," عبد العالي "]
[262," ",1100413270342700,null,null,"أنثى","2004-12-12","مغنية","نصف داخلي","2ت إ01",null,null,null,"ثانية","تسيير واقتصاد ",1,262,"D2",null,"قرية العقيد عباس مغنية تلمسان ",null,null,null,null,null,null,{"$f":"IF($J265=\"\",\"\",MATCH($J265,OFFSET(BASE!$C$5,,,MAX(BASE!$B:$B)),0))","v":12},{"$f":"IF($AA265=\"\",\"\",60*($AA265-1)+COUNTIF($AA$9:$AA265,$AA265))","v":685},"D2",2,"D",null,"عزيز ",null,{"$f":"D265 & \" \" & AG265","v":" عزيز "}]
[263," ",1100313270729600,null,null,"أنثى","2003-11-18","مغنية","نصف داخلي","2ت إ01",null,null,null,"ثانية","تسيير واقتصاد ",1,263,"D2",null,"حي عمر المختار-مغنية ",null,null,null,null,null,null,{"$f":"IF($J266=\"\",\"\",MATCH($J266,OFFSET(BASE!$C$5,,,MAX(BASE!$B:$B)),0))","v":12},{"$f":"IF($AA266=\"\",\"\",60*($AA266-1)+COUNTIF($AA$9:$AA266,$AA266))","v":686},{"$f":"AE266&AD266","v":"D2"},{"$f":"IF(F266=\"أنثى\",2,1)","v":2},{"$f":"IF(I266=\"نصف داخلي\",\"D\",\"E\")","v":"D"},null,"حسن ",null," حسن "]
[264," ",1100746010073600,null,null,"ذكر","2007-02-20","المدية","خارجي","2ت إ01",null,null,null,"ثانية","تسيير واقتصاد ",1,264,"E1",null,null,null,null,null,null,null,null,{"$f":"IF($J267=\"\",\"\",MATCH($J267,OFFSET(BASE!$C$5,,,MAX(BASE!$B:$B)),0))","v":12},{"$f":"IF($AA267=\"\",\"\",60*($AA267-1)+COUNTIF($AA$9:$AA267,$AA267))","v":687},"E1",1,"E",null,null,null," "]
[265," ",1000516240390700,null,null,"ذكر","2005-11-03","الحمامات","خارجي","2ت إ01",null,null,null,"ثانية","تسيير واقتصاد ",1,265,"E1",null,"مدرسة الشرطة القضائية للدرك الوطني سيدي   منيف زرالدة ",null,null,null,null,null,null,{"$f":"IF($J268=\"\",\"\",MATCH($J268,OFFSET(BASE!$C$5,,,MAX(BASE!$B:$B)),0))","v":12},{"$f":"IF($AA268=\"\",\"\",60*($AA268-1)+COUNTIF($AA$9:$AA268,$AA268))","v":688},"E1",1,"E",null,"العيد ",null," العيد "]
[266," ",1000413270289500,null,null,"ذكر","2004-10-20","مغنية","خارجي","2ت إ01",null,null,null,"ثانية","تسيير واقتصاد ",1,266,"E1",null,"شارع المسبح البلدي حي الشهداء -مغنية- ",null,null,null,null,null,null,{"$f":"IF($J269=\"\",\"\",MATCH($J269,OFFSET(BASE!$C$5,,,MAX(BASE!$B:$B)),0))","v":12},{"$f":"IF($AA269=\"\",\"\",60*($AA269-1)+COUNTIF($AA$9:$AA269,$AA269))","v":689},"E1",1,"E",null,"محمد ",null," محمد "]
[267," ",1100513270107300,null,null,"أنثى","2005-05-09","مغنية","خارجي","2ت إ01",null,null,null,"ثانية","تسيير واقتصاد ",1,267,"E2",null,"دوار المرازقة -  مغنية - ",null,null,null,null,null,null,{"$f":"IF($J270=\"\",\"\",MATCH($J270,OFFSET(BASE!$C$5,,,MAX(BASE!$B:$B)),0))","v":12},{"$f":"IF($AA270=\"\",\"\",60*($AA270-1)+COUNTIF($AA$9:$AA270,$AA270))","v":690},"E2",2,"E",null,"عمر ",null," عمر "]
[268," ",1100413270171700,null,null,"أنثى","2004-07-06","مغنية","خارجي","2ت إ01",null,null,null,"ثانية","تسيير واقتصاد ",1,268,"E2",null,"درب 4 منزل 16 حي الشهداء ",null,null,null,null,null,null,{"$f":"IF($J271=\"\",\"\",MATCH($J271,OFFSET(BASE!$C$5,,,MAX(BASE!$B:$B)),0))","v":12},{"$f":"IF($AA271=\"\",\"\",60*($AA271-1)+COUNTIF($AA$9:$AA271,$AA271))","v":691},"E2",2,"E",null,"موسى ",null," موسى "]
[269," ",1000413270248000,null,null,"ذكر","2004-09-11","مغنية","خارجي","2ت إ01",null,null,null,"ثانية","تسيير واقتصاد ",1,269,"E1",null,"عين عباس طريق صبرة مغنية ",null,null,null,null,null,null,{"$f":"IF($J272=\"\",\"\",MATCH($J272,OFFSET(BASE!$C$5,,,MAX(BASE!$B:$B)),0))","v":12},{"$f":"IF($AA272=\"\",\"\",60*($AA272-1)+COUNTIF($AA$9:$AA272,$AA272))","v":692},"E1",1,"E",null,"يحي ",null," يحي "]
[270," ",1100313270139200,null,null,"أنثى","2003-06-27","مغنية","خارجي","2ت إ01",null,null,null,"ثانية","تسيير واقتصاد ",1,270,"E2",null,"مجموعة الدرك الوطني سيدي بلعباس ",null,null,null,null,null,null,{"$f":"IF($J273=\"\",\"\",MATCH($J273,OFFSET(BASE!$C$5,,,MAX(BASE!$B:$B)),0))","v":12},{"$f":"IF($AA273=\"\",\"\",60*($AA273-1)+COUNTIF($AA$9:$AA273,$AA273))","v":693},"E2",2,"E",null,"عمر ",null," عمر "]
[271," ",1000629060192600,null,null,"ذكر","2006-07-29","تغنيف","خارجي","2ت إ01",null,null,null,"ثانية","تسيير واقتصاد ",1,271,"E1",null,"الحي الغربي باب العسة ",null,null,null,null,null,null,{"$f":"IF($J274=\"\",\"\",MATCH($J274,OFFSET(BASE!$C$5,,,MAX(BASE!$B:$B)),0))","v":12},{"$f":"IF($AA274=\"\",\"\",60*($AA274-1)+COUNTIF($AA$9:$AA274,$AA274))","v":694},"E1",1,"E",null,"غريسي ",null," غريسي "]
[272," ",1100413270301900,null,null,"أنثى","2004-11-02","مغنية","نصف داخلي","2ع ت01",null,null,null,"ثانية","علوم تجريبية ",1,273,"D2",null,"التلالسة قرية البطيم ",null,null,null,null,null,null,{"$f":"IF($J275=\"\",\"\",MATCH($J275,OFFSET(BASE!$C$5,,,MAX(BASE!$B:$B)),0))","v":13},{"$f":"IF($AA275=\"\",\"\",60*($AA275-1)+COUNTIF($AA$9:$AA275,$AA275))","v":721},"D2",2,"D",null,"محمد ",null," محمد "]
[273," ",1000613270096000,null,null,"ذكر","2006-04-25","مغنية","نصف داخلي","2ع ت01",null,null,null,"ثانية","علوم تجريبية ",1,274,"D1",null,"قرية العقيد عباس  - مغنية -  ",null,null,null,null,null,null,{"$f":"IF($J276=\"\",\"\",MATCH($J276,OFFSET(BASE!$C$5,,,MAX(BASE!$B:$B)),0))","v":13},{"$f":"IF($AA276=\"\",\"\",60*($AA276-1)+COUNTIF($AA$9:$AA276,$AA276))","v":722},"D1",1,"D",null,"جمال ",null," جمال "]
[274," ",1100613270143800,null,null,"أنثى","2006-06-08","مغنية","نصف داخلي","2ع ت01",null,null,null,"ثانية","علوم تجريبية ",1,275,"D2",null,"قرية البطيم-مغنية- ",null,null,null,null,null,null,{"$f":"IF($J277=\"\",\"\",MATCH($J277,OFFSET(BASE!$C$5,,,MAX(BASE!$B:$B)),0))","v":13},{"$f":"IF($AA277=\"\",\"\",60*($AA277-1)+COUNTIF($AA$9:$AA277,$AA277))","v":723},"D2",2,"D",null,"بن اعمر ",null," بن اعمر "]
[275," ",1100613270148200,null,null,"أنثى","2006-06-11","مغنية","نصف داخلي","2ع ت01",null,null,null,"ثانية","علوم تجريبية ",1,276,"D2",null,"قرية العقيد عباس - مغنية -  ",null,null,null,null,null,null,{"$f":"IF($J278=\"\",\"\",MATCH($J278,OFFSET(BASE!$C$5,,,MAX(BASE!$B:$B)),0))","v":13},{"$f":"IF($AA278=\"\",\"\",60*($AA278-1)+COUNTIF($AA$9:$AA278,$AA278))","v":724},"D2",2,"D",null,"الحاج ",null," الحاج "]
[276," ",1100513270169700,null,null,"أنثى","2005-06-26","مغنية","نصف داخلي","2ع ت01",null,null,null,"ثانية","علوم تجريبية ",1,277,"D2",null,"قرية العقيد لطفي ",null,null,null,null,null,null,{"$f":"IF($J279=\"\",\"\",MATCH($J279,OFFSET(BASE!$C$5,,,MAX(BASE!$B:$B)),0))","v":13},{"$f":"IF($AA279=\"\",\"\",60*($AA279-1)+COUNTIF($AA$9:$AA279,$AA279))","v":725},"D2",2,"D",null,"مكاحلي فاطمة ",null," مكاحلي فاطمة "]
[277," ",1000513270335600,null,null,"ذكر","2005-11-14","مغنية","نصف داخلي","2ع ت01",null,null,null,"ثانية","علوم تجريبية ",1,278,"D1",null,"دوار المرازقة مغنية ",null,null,null,null,null,null,{"$f":"IF($J280=\"\",\"\",MATCH($J280,OFFSET(BASE!$C$5,,,MAX(BASE!$B:$B)),0))","v":13},{"$f":"IF($AA280=\"\",\"\",60*($AA280-1)+COUNTIF($AA$9:$AA280,$AA280))","v":726},"D1",1,"D",null,"محمد ",null," محمد "]
[278," ",1100613270250900,null,null,"أنثى","2006-09-01","مغنية","نصف داخلي","2ع ت01",null,null,null,"ثانية","علوم تجريبية ",1,279,"D2",null,"قرية العقيد عباس - مغنية -  ",null,null,null,null,null,null,{"$f":"IF($J281=\"\",\"\",MATCH($J281,OFFSET(BASE!$C$5,,,MAX(BASE!$B:$B)),0))","v":13},{"$f":"IF($AA281=\"\",\"\",60*($AA281-1)+COUNTIF($AA$9:$AA281,$AA281))","v":727},"D2",2,"D",null,"محمد ",null," محمد "]
[279," ",1000613270150200,null,null,"ذكر","2006-06-13","مغنية","نصف داخلي","2ع ت01",null,null,null,"ثانية","علوم تجريبية ",1,280,"D1",null,"قرية المصامدة - مغنية - تلمسان ",null,null,null,null,null,null,{"$f":"IF($J282=\"\",\"\",MATCH($J282,OFFSET(BASE!$C$5,,,MAX(BASE!$B:$B)),0))","v":13},{"$f":"IF($AA282=\"\",\"\",60*($AA282-1)+COUNTIF($AA$9:$AA282,$AA282))","v":728},"D1",1,"D",null,"بن أعمر ",null," بن أعمر "]
[280," ",1100613270093700,null,null,"أنثى","2006-04-23","مغنية","نصف داخلي","2ع ت01",null,null,null,"ثانية","علوم تجريبية ",1,281,"D2",null,"قرية أولاد الشارف - مغنية -  ",null,null,null,null,null,null,{"$f":"IF($J283=\"\",\"\",MATCH($J283,OFFSET(BASE!$C$5,,,MAX(BASE!$B:$B)),0))","v":13},{"$f":"IF($AA283=\"\",\"\",60*($AA283-1)+COUNTIF($AA$9:$AA283,$AA283))","v":729},"D2",2,"D",null,"عبد المجيد ",null," عبد المجيد "]
[281," ",1000613270143900,null,null,"ذكر","2006-06-08","مغنية","نصف داخلي","2ع ت01",null,null,null,"ثانية","علوم تجريبية ",1,282,"D1",null,"قرية اولاد الشارف - مغنية - ",null,null,null,null,null,null,{"$f":"IF($J284=\"\",\"\",MATCH($J284,OFFSET(BASE!$C$5,,,MAX(BASE!$B:$B)),0))","v":13},{"$f":"IF($AA284=\"\",\"\",60*($AA284-1)+COUNTIF($AA$9:$AA284,$AA284))","v":730},"D1",1,"D",null,"محمد ",null," محمد "]
[282," ",1100713270060800,null,null,"أنثى","2007-03-10","مغنية","نصف داخلي","2ع ت01",null,null,null,"ثانية","علوم تجريبية ",1,282,"D2",null,"قرية المصامدة - مغنية - تلمسان ",null,null,null,null,null,null,{"$f":"IF($J285=\"\",\"\",MATCH($J285,OFFSET(BASE!$C$5,,,MAX(BASE!$B:$B)),0))","v":13},{"$f":"IF($AA285=\"\",\"\",60*($AA285-1)+COUNTIF($AA$9:$AA285,$AA285))","v":731},"D2",2,"D",null,"محمد ",null," محمد "]
[283," ",1000513270037300,null,null,"ذكر","2005-02-10","مغنية","نصف داخلي","2ع ت01",null,null,null,"ثانية","علوم تجريبية ",1,283,"D1",null,"قرية العقيد عباس -  مغنية -  ",null,null,null,null,null,null,{"$f":"IF($J286=\"\",\"\",MATCH($J286,OFFSET(BASE!$C$5,,,MAX(BASE!$B:$B)),0))","v":13},{"$f":"IF($AA286=\"\",\"\",60*($AA286-1)+COUNTIF($AA$9:$AA286,$AA286))","v":732},"D1",1,"D",null,"مصطفى ",null," مصطفى "]
[284," ",1000613270057300,null,null,"ذكر","2006-03-08","مغنية","نصف داخلي","2ع ت01",null,null,null,"ثانية","علوم تجريبية ",1,284,"D1",null,"أولاد الشارف ",null,null,null,null,null,null,{"$f":"IF($J287=\"\",\"\",MATCH($J287,OFFSET(BASE!$C$5,,,MAX(BASE!$B:$B)),0))","v":13},{"$f":"IF($AA287=\"\",\"\",60*($AA287-1)+COUNTIF($AA$9:$AA287,$AA287))","v":733},"D1",1,"D",null,"أحمد ",null," أحمد "]
[285," ",1000613270023000,null,null,"ذكر","2006-01-25","مغنية","نصف داخلي","2ع ت01",null,null,null,"ثانية","علوم تجريبية ",1,285,"D1",null,"حي الشهداء ",null,null,null,null,null,null,{"$f":"IF($J288=\"\",\"\",MATCH($J288,OFFSET(BASE!$C$5,,,MAX(BASE!$B:$B)),0))","v":13},{"$f":"IF($AA288=\"\",\"\",60*($AA288-1)+COUNTIF($AA$9:$AA288,$AA288))","v":734},"D1",1,"D",null,"رشيد ",null," رشيد "]
[286," ",1000713270000600,null,null,"ذكر","2007-01-01","مغنية","نصف داخلي","2ع ت01",null,null,null,"ثانية","علوم تجريبية ",1,286,"D1",null,"قرية البطيم مغنية ",null,null,null,null,null,null,{"$f":"IF($J289=\"\",\"\",MATCH($J289,OFFSET(BASE!$C$5,,,MAX(BASE!$B:$B)),0))","v":13},{"$f":"IF($AA289=\"\",\"\",60*($AA289-1)+COUNTIF($AA$9:$AA289,$AA289))","v":735},"D1",1,"D",null,"مصطفى ",null," مصطفى "]
[287," ",1100613270154900,null,null,"أنثى","2006-06-15","مغنية","خارجي","2ع ت01",null,null,null,"ثانية","علوم تجريبية ",1,287,"E2",null,"قرية الشبيكية - مغنية ",null,null,null,null,null,null,{"$f":"IF($J290=\"\",\"\",MATCH($J290,OFFSET(BASE!$C$5,,,MAX(BASE!$B:$B)),0))","v":13},{"$f":"IF($AA290=\"\",\"\",60*($AA290-1)+COUNTIF($AA$9:$AA290,$AA290))","v":736},"E2",2,"E",null,"واسيني ",null," واسيني "]
[288," ",1000613270049200,null,null,"ذكر","2006-02-25","مغنية","خارجي","2ع ت01",null,null,null,"ثانية","علوم تجريبية ",1,288,"E1",null,"قرية البطيم مغنية ",null,null,null,null,null,null,{"$f":"IF($J291=\"\",\"\",MATCH($J291,OFFSET(BASE!$C$5,,,MAX(BASE!$B:$B)),0))","v":13},{"$f":"IF($AA291=\"\",\"\",60*($AA291-1)+COUNTIF($AA$9:$AA291,$AA291))","v":737},"E1",1,"E",null,"صديق ",null," صديق "]
[289," ",1100613270301400,null,null,"أنثى","2006-10-13","مغنية","خارجي","2ع ت01",null,null,null,"ثانية","علوم تجريبية ",1,289,"E2",null,"رقم 55 حي الشهداء - مغنية -  ",null,null,null,null,null,null,{"$f":"IF($J292=\"\",\"\",MATCH($J292,OFFSET(BASE!$C$5,,,MAX(BASE!$B:$B)),0))","v":13},{"$f":"IF($AA292=\"\",\"\",60*($AA292-1)+COUNTIF($AA$9:$AA292,$AA292))","v":738},"E2",2,"E",null,"محمد ",null," محمد "]
[290," ",1000613270128700,null,null,"ذكر","2006-05-27","مغنية","خارجي","2ع ت01",null,null,null,"ثانية","علوم تجريبية ",1,290,"E1",null,"رقم 47 حي الشهداء - مغنية -  ",null,null,null,null,null,null,{"$f":"IF($J293=\"\",\"\",MATCH($J293,OFFSET(BASE!$C$5,,,MAX(BASE!$B:$B)),0))","v":13},{"$f":"IF($AA293=\"\",\"\",60*($AA293-1)+COUNTIF($AA$9:$AA293,$AA293))","v":739},"E1",1,"E",null,"عبد العالي ",null," عبد العالي "]
[291," ",1100613270293100,null,null,"أنثى","2006-10-05","مغنية","خارجي","2ع ت01",null,null,null,"ثانية","علوم تجريبية ",1,291,"E2",null,"درب 27 رقم 03 حي الشهداء - مغنية -  ",null,null,null,null,null,null,{"$f":"IF($J294=\"\",\"\",MATCH($J294,OFFSET(BASE!$C$5,,,MAX(BASE!$B:$B)),0))","v":13},{"$f":"IF($AA294=\"\",\"\",60*($AA294-1)+COUNTIF($AA$9:$AA294,$AA294))","v":740},"E2",2,"E",null,"عبد الحليم ",null," عبد الحليم "]
[292," ",1000513270010000,null,null,"ذكر","2005-01-10","مغنية","خارجي","2ع ت01",null,null,null,"ثانية","علوم تجريبية ",1,292,"E1",null,"شارع 22 حي الشهداء مغنية ",null,null,null,null,null,null,{"$f":"IF($J295=\"\",\"\",MATCH($J295,OFFSET(BASE!$C$5,,,MAX(BASE!$B:$B)),0))","v":13},{"$f":"IF($AA295=\"\",\"\",60*($AA295-1)+COUNTIF($AA$9:$AA295,$AA295))","v":741},"E1",1,"E",null,"عمر ",null," عمر "]
[293," ",1000713270053000,null,null,"ذكر","2007-03-02","مغنية","خارجي","2ع ت01",null,null,null,"ثانية","علوم تجريبية ",1,293,"E1",null,"رقم 17 حي الشهداء - مغنية -  ",null,null,null,null,null,null,{"$f":"IF($J296=\"\",\"\",MATCH($J296,OFFSET(BASE!$C$5,,,MAX(BASE!$B:$B)),0))","v":13},{"$f":"IF($AA296=\"\",\"\",60*($AA296-1)+COUNTIF($AA$9:$AA296,$AA296))","v":742},"E1",1,"E",null,"عبد الكريم ",null," عبد الكريم "]
[294," ",1000613270300000,null,null,"ذكر","2006-10-11","مغنية","خارجي","2ع ت01",null,null,null,"ثانية","علوم تجريبية ",1,294,"E1",null,"حي الشهداء - مغنية -  ",null,null,null,null,null,null,{"$f":"IF($J297=\"\",\"\",MATCH($J297,OFFSET(BASE!$C$5,,,MAX(BASE!$B:$B)),0))","v":13},{"$f":"IF($AA297=\"\",\"\",60*($AA297-1)+COUNTIF($AA$9:$AA297,$AA297))","v":743},"E1",1,"E",null,"محمد ",null," محمد "]
[295," ",1100513270313200,null,null,"أنثى","2005-10-24","مغنية","خارجي","2ع ت01",null,null,null,"ثانية","علوم تجريبية ",1,295,"E2",null,"منزل رقم 07 طريق الزوية حي الشهداء - مغنية -  ",null,null,null,null,null,null,{"$f":"IF($J298=\"\",\"\",MATCH($J298,OFFSET(BASE!$C$5,,,MAX(BASE!$B:$B)),0))","v":13},{"$f":"IF($AA298=\"\",\"\",60*($AA298-1)+COUNTIF($AA$9:$AA298,$AA298))","v":744},"E2",2,"E",null,"محمد ",null," محمد "]
[296," ",1000213270245600,null,null,"ذكر","2002-11-03","مغنية","خارجي","2ع ت01",null,null,null,"ثانية","علوم تجريبية ",1,296,"E1",null," ",null,null,null,null,null,null,{"$f":"IF($J299=\"\",\"\",MATCH($J299,OFFSET(BASE!$C$5,,,MAX(BASE!$B:$B)),0))","v":13},{"$f":"IF($AA299=\"\",\"\",60*($AA299-1)+COUNTIF($AA$9:$AA299,$AA299))","v":745},"E1",1,"E",null,"الطيب ",null," الطيب "]
[297," ",1100213270282400,null,null,"أنثى","2002-12-10","مغنية","خارجي","2ع ت01",null,null,null,"ثانية","علوم تجريبية ",1,297,"E2",null,"حي  ",null,null,null,null,null,null,{"$f":"IF($J300=\"\",\"\",MATCH($J300,OFFSET(BASE!$C$5,,,MAX(BASE!$B:$B)),0))","v":13},{"$f":"IF($AA300=\"\",\"\",60*($AA300-1)+COUNTIF($AA$9:$AA300,$AA300))","v":746},"E2",2,"E",null,"بومدين ",null," بومدين "]
[298," ",1000513240146500,null,null,"ذكر","2007-03-28","بن سكران","خارجي","2ع ت01",null,null,null,"ثانية","علوم تجريبية ",1,298,"E1",null,"شارع 30 رقم 20 حي المقراني  ( الباطوار ) - مغنية -  ",null,null,null,null,null,null,{"$f":"IF($J301=\"\",\"\",MATCH($J301,OFFSET(BASE!$C$5,,,MAX(BASE!$B:$B)),0))","v":13},{"$f":"IF($AA301=\"\",\"\",60*($AA301-1)+COUNTIF($AA$9:$AA301,$AA301))","v":747},"E1",1,"E",null,"مصطفى ",null," مصطفى "]
[299," ",1000713270061000,null,null,"ذكر","2007-03-10","مغنية","خارجي","2ع ت01",null,null,null,"ثانية","علوم تجريبية ",1,299,"E1",null,"شارع س رقم 06 حي الشهداء - مغنية -  ",null,null,null,null,null,null,{"$f":"IF($J302=\"\",\"\",MATCH($J302,OFFSET(BASE!$C$5,,,MAX(BASE!$B:$B)),0))","v":13},{"$f":"IF($AA302=\"\",\"\",60*($AA302-1)+COUNTIF($AA$9:$AA302,$AA302))","v":748},"E1",1,"E",null,"عبد الرزاق ",null," عبد الرزاق "]
[300," ",1100613270315800,null,null,"أنثى","2006-10-25","مغنية","خارجي","2ع ت01",null,null,null,"ثانية","علوم تجريبية ",1,300,"E2",null,"حي الأمير القادر ",null,null,null,null,null,null,{"$f":"IF($J303=\"\",\"\",MATCH($J303,OFFSET(BASE!$C$5,,,MAX(BASE!$B:$B)),0))","v":13},{"$f":"IF($AA303=\"\",\"\",60*($AA303-1)+COUNTIF($AA$9:$AA303,$AA303))","v":749},"E2",2,"E",null,"بن عمر ",null," بن عمر "]
[301," ",1000613270218000,null,null,"ذكر","2006-08-02","مغنية","خارجي","2ع ت01",null,null,null,"ثانية","علوم تجريبية ",1,301,"E1",null,"رقم 99 حي الشهداء- مغنية -  ",null,null,null,null,null,null,{"$f":"IF($J304=\"\",\"\",MATCH($J304,OFFSET(BASE!$C$5,,,MAX(BASE!$B:$B)),0))","v":13},{"$f":"IF($AA304=\"\",\"\",60*($AA304-1)+COUNTIF($AA$9:$AA304,$AA304))","v":750},"E1",1,"E",null,"حسين ",null," حسين "]
[302," ",1100613270361300,null,null,"أنثى","2006-12-10","مغنية","نصف داخلي","2ع ت02",null,null,null,"ثانية","علوم تجريبية ",2,302,"D2",null,"قرية البطيم مغنية ",null,null,null,null,null,null,{"$f":"IF($J305=\"\",\"\",MATCH($J305,OFFSET(BASE!$C$5,,,MAX(BASE!$B:$B)),0))","v":14},{"$f":"IF($AA305=\"\",\"\",60*($AA305-1)+COUNTIF($AA$9:$AA305,$AA305))","v":781},"D2",2,"D",null,"هواري ",null," هواري "]
[303," ",1000613270328700,null,null,"ذكر","2006-11-05","مغنية","نصف داخلي","2ع ت02",null,null,null,"ثانية","علوم تجريبية ",2,303,"D1",null,"دوار المرازقة  - مغنية -  ",null,null,null,null,null,null,{"$f":"IF($J306=\"\",\"\",MATCH($J306,OFFSET(BASE!$C$5,,,MAX(BASE!$B:$B)),0))","v":14},{"$f":"IF($AA306=\"\",\"\",60*($AA306-1)+COUNTIF($AA$9:$AA306,$AA306))","v":782},"D1",1,"D",null,"بن أعمر ",null," بن أعمر "]
[304," ",1100613270186800,null,null,"أنثى","2006-07-08","مغنية","نصف داخلي","2ع ت02",null,null,null,"ثانية","علوم تجريبية ",2,304,"D2",null,"قرية العقيد عباس - مغنية -  ",null,null,null,null,null,null,{"$f":"IF($J307=\"\",\"\",MATCH($J307,OFFSET(BASE!$C$5,,,MAX(BASE!$B:$B)),0))","v":14},{"$f":"IF($AA307=\"\",\"\",60*($AA307-1)+COUNTIF($AA$9:$AA307,$AA307))","v":783},"D2",2,"D",null,"احمد ",null," احمد "]
[305," ",1100613270112900,null,null,"أنثى","2006-05-13","مغنية","نصف داخلي","2ع ت02",null,null,null,"ثانية","علوم تجريبية ",2,305,"D2",null,"حي الشهداء - مغنية -  ",null,null,null,null,null,null,{"$f":"IF($J308=\"\",\"\",MATCH($J308,OFFSET(BASE!$C$5,,,MAX(BASE!$B:$B)),0))","v":14},{"$f":"IF($AA308=\"\",\"\",60*($AA308-1)+COUNTIF($AA$9:$AA308,$AA308))","v":784},"D2",2,"D",null,"احمد ",null," احمد "]
[306," ",1100613270203200,null,null,"أنثى","2006-07-21","مغنية","نصف داخلي","2ع ت02",null,null,null,"ثانية","علوم تجريبية ",2,306,"D2",null,"قرية أولاد الشارف - مغنية -  ",null,null,null,null,null,null,{"$f":"IF($J309=\"\",\"\",MATCH($J309,OFFSET(BASE!$C$5,,,MAX(BASE!$B:$B)),0))","v":14},{"$f":"IF($AA309=\"\",\"\",60*($AA309-1)+COUNTIF($AA$9:$AA309,$AA309))","v":785},"D2",2,"D",null,"محمد ",null," محمد "]
[307," ",1100613270147600,null,null,"أنثى","2006-06-11","مغنية","نصف داخلي","2ع ت02",null,null,null,"ثانية","علوم تجريبية ",2,307,"D2",null,"قرية البطيم مغنية ",null,null,null,null,null,null,{"$f":"IF($J310=\"\",\"\",MATCH($J310,OFFSET(BASE!$C$5,,,MAX(BASE!$B:$B)),0))","v":14},{"$f":"IF($AA310=\"\",\"\",60*($AA310-1)+COUNTIF($AA$9:$AA310,$AA310))","v":786},"D2",2,"D",null,"عبد الله ",null," عبد الله "]
[308," ",1100413270299400,null,null,"أنثى","2004-10-30","مغنية","نصف داخلي","2ع ت02",null,null,null,"ثانية","علوم تجريبية ",2,308,"D2",null,"قرية العقيد عباس مغنية تلمسان ",null,null,null,null,null,null,{"$f":"IF($J311=\"\",\"\",MATCH($J311,OFFSET(BASE!$C$5,,,MAX(BASE!$B:$B)),0))","v":14},{"$f":"IF($AA311=\"\",\"\",60*($AA311-1)+COUNTIF($AA$9:$AA311,$AA311))","v":787},"D2",2,"D",null,"ميلود ",null," ميلود "]
[309," ",1000613270276200,null,null,"أنثى","2006-04-24","مغنية","نصف داخلي","2ع ت02",null,null,null,"ثانية","علوم تجريبية ",2,309,"D2",null,"قرية المصامدة - مغنية - تلمسان ",null,null,null,null,null,null,{"$f":"IF($J312=\"\",\"\",MATCH($J312,OFFSET(BASE!$C$5,,,MAX(BASE!$B:$B)),0))","v":14},{"$f":"IF($AA312=\"\",\"\",60*($AA312-1)+COUNTIF($AA$9:$AA312,$AA312))","v":788},"D2",2,"D",null,"محمد ",null," محمد "]
[310," ",1100613270095600,null,null,"ذكر","2006-09-20","مغنية","نصف داخلي","2ع ت02",null,null,null,"ثانية","علوم تجريبية ",2,310,"D1",null,"قرية المصامدة - مغنية - تلمسان ",null,null,null,null,null,null,{"$f":"IF($J313=\"\",\"\",MATCH($J313,OFFSET(BASE!$C$5,,,MAX(BASE!$B:$B)),0))","v":14},{"$f":"IF($AA313=\"\",\"\",60*($AA313-1)+COUNTIF($AA$9:$AA313,$AA313))","v":789},"D1",1,"D",null,"ميمون ",null," ميمون "]
[311," ",1000613270152100,null,null,"ذكر","2006-06-15","مغنية","نصف داخلي","2ع ت02",null,null,null,"ثانية","علوم تجريبية ",2,311,"D1",null,"قرية المصامدة - مغنية - تلمسان ",null,null,null,null,null,null,{"$f":"IF($J314=\"\",\"\",MATCH($J314,OFFSET(BASE!$C$5,,,MAX(BASE!$B:$B)),0))","v":14},{"$f":"IF($AA314=\"\",\"\",60*($AA314-1)+COUNTIF($AA$9:$AA314,$AA314))","v":790},"D1",1,"D",null,"محمد ",null," محمد "]
[312," ",1000613270197300,null,null,"ذكر","2006-07-16","مغنية","نصف داخلي","2ع ت02",null,null,null,"ثانية","علوم تجريبية ",2,312,"D1",null,"قرية أولاد الشارف - مغنية - ",null,null,null,null,null,null,{"$f":"IF($J315=\"\",\"\",MATCH($J315,OFFSET(BASE!$C$5,,,MAX(BASE!$B:$B)),0))","v":14},{"$f":"IF($AA315=\"\",\"\",60*($AA315-1)+COUNTIF($AA$9:$AA315,$AA315))","v":791},"D1",1,"D",null,"عبد الرحمن ",null," عبد الرحمن "]
[313," ",1000613270311300,null,null,"ذكر","2006-10-21","مغنية","نصف داخلي","2ع ت02",null,null,null,"ثانية","علوم تجريبية ",2,313,"D1",null,"قرية العقيد عباس - مغنية -  ",null,null,null,null,null,null,{"$f":"IF($J316=\"\",\"\",MATCH($J316,OFFSET(BASE!$C$5,,,MAX(BASE!$B:$B)),0))","v":14},{"$f":"IF($AA316=\"\",\"\",60*($AA316-1)+COUNTIF($AA$9:$AA316,$AA316))","v":792},"D1",1,"D",null,"غوتي ",null," غوتي "]
[314," ",1100613270562100,null,null,"أنثى","2006-08-19","مغنية","نصف داخلي","2ع ت02",null,null,null,"ثانية","علوم تجريبية ",2,314,"D2",null,"قرية العقيد عباس - مغنية -  ",null,null,null,null,null,null,{"$f":"IF($J317=\"\",\"\",MATCH($J317,OFFSET(BASE!$C$5,,,MAX(BASE!$B:$B)),0))","v":14},{"$f":"IF($AA317=\"\",\"\",60*($AA317-1)+COUNTIF($AA$9:$AA317,$AA317))","v":793},"D2",2,"D",null,"عبد الحليم  ",null," عبد الحليم  "]
[315," ",1000613270215200,null,null,"ذكر","2006-07-31","مغنية","نصف داخلي","2ع ت02",null,null,null,"ثانية","علوم تجريبية ",2,315,"D1",null,"قرية أولاد الشارف - مغنية - ",null,null,null,null,null,null,{"$f":"IF($J318=\"\",\"\",MATCH($J318,OFFSET(BASE!$C$5,,,MAX(BASE!$B:$B)),0))","v":14},{"$f":"IF($AA318=\"\",\"\",60*($AA318-1)+COUNTIF($AA$9:$AA318,$AA318))","v":794},"D1",1,"D",null,"حسين ",null," حسين "]
[316," ",1100513270093800,null,null,"أنثى","2005-04-25","مغنية","نصف داخلي","2ع ت02",null,null,null,"ثانية","علوم تجريبية ",2,316,"D2",null,"قرية البطيم مغنية ",null,null,null,null,null,null,{"$f":"IF($J319=\"\",\"\",MATCH($J319,OFFSET(BASE!$C$5,,,MAX(BASE!$B:$B)),0))","v":14},{"$f":"IF($AA319=\"\",\"\",60*($AA319-1)+COUNTIF($AA$9:$AA319,$AA319))","v":795},"D2",2,"D",null,"محمد ",null," محمد "]
[317," ",1000613270155100,null,null,"ذكر","2006-06-16","مغنية","نصف داخلي","2ع ت02",null,null,null,"ثانية","علوم تجريبية ",2,317,"D1",null,"قرية المصامدة - مغنية - تلمسان ",null,null,null,null,null,null,{"$f":"IF($J320=\"\",\"\",MATCH($J320,OFFSET(BASE!$C$5,,,MAX(BASE!$B:$B)),0))","v":14},{"$f":"IF($AA320=\"\",\"\",60*($AA320-1)+COUNTIF($AA$9:$AA320,$AA320))","v":796},"D1",1,"D",null,"عمر ",null," عمر "]
[318," ",1100613010777700,null,null,"أنثى","2006-10-14","تلمسان","نصف داخلي","2ع ت02",null,null,null,"ثانية","علوم تجريبية ",2,318,"D2",null,"حي اولاد بن دامو مغنية ",null,null,null,null,null,null,{"$f":"IF($J321=\"\",\"\",MATCH($J321,OFFSET(BASE!$C$5,,,MAX(BASE!$B:$B)),0))","v":14},{"$f":"IF($AA321=\"\",\"\",60*($AA321-1)+COUNTIF($AA$9:$AA321,$AA321))","v":797},"D2",2,"D",null,"محمد ",null," محمد "]
[319," ",1000613270208800,null,null,"ذكر","2006-07-26","مغنية","نصف داخلي","2ع ت02",null,null,null,"ثانية","علوم تجريبية ",2,319,"D1",null,"قرية أولاد الشارف - مغنية -  ",null,null,null,null,null,null,{"$f":"IF($J322=\"\",\"\",MATCH($J322,OFFSET(BASE!$C$5,,,MAX(BASE!$B:$B)),0))","v":14},{"$f":"IF($AA322=\"\",\"\",60*($AA322-1)+COUNTIF($AA$9:$AA322,$AA322))","v":798},"D1",1,"D",null,"يوسف ",null," يوسف "]
[320," ",1100713270005400,null,null,"ذكر","2005-02-19","مغنية","نصف داخلي","2ع ت02",null,null,null,"ثانية","علوم تجريبية ",2,320,"D1",null,"قرية العقيد عباس مغنية ",null,null,null,null,null,null,{"$f":"IF($J323=\"\",\"\",MATCH($J323,OFFSET(BASE!$C$5,,,MAX(BASE!$B:$B)),0))","v":14},{"$f":"IF($AA323=\"\",\"\",60*($AA323-1)+COUNTIF($AA$9:$AA323,$AA323))","v":799},"D1",1,"D",null,"مكي ",null," مكي "]
[321,{"$f":"D324& \" \" &E324","v":" "},1000513270043100,null,null,"أنثى","2007-01-06","مغنية","نصف داخلي","2ع ت02",null,null,null,"ثانية","علوم تجريبية ",2,321,"D2",null,"قرية العقيد عباس مغنية ",null,null,null,null,null,null,{"$f":"IF($J324=\"\",\"\",MATCH($J324,OFFSET(BASE!$C$5,,,MAX(BASE!$B:$B)),0))","v":14},{"$f":"IF($AA324=\"\",\"\",60*($AA324-1)+COUNTIF($AA$9:$AA324,$AA324))","v":800},"D2",2,"D",null,"مكي ",null," مكي "]
[322," ",1100613270089900,null,null,"أنثى","2006-04-18","مغنية","نصف داخلي","2ع ت02",null,null,null,"ثانية","علوم تجريبية ",2,322,"D2",null,"قرية أولاد الشارف - مغنية - ",null,null,null,null,null,null,{"$f":"IF($J325=\"\",\"\",MATCH($J325,OFFSET(BASE!$C$5,,,MAX(BASE!$B:$B)),0))","v":14},{"$f":"IF($AA325=\"\",\"\",60*($AA325-1)+COUNTIF($AA$9:$AA325,$AA325))","v":801},"D2",2,"D",null,"جمال الدين ",null," جمال الدين "]
[323," ",1100713270954000,null,null,"أنثى","2007-03-25","مغنية","نصف داخلي","2ع ت02",null,null,null,"ثانية","علوم تجريبية ",2,323,"D2",null,"قرية العقيد لطفي - مغنية -  ",null,null,null,null,null,null,{"$f":"IF($J326=\"\",\"\",MATCH($J326,OFFSET(BASE!$C$5,,,MAX(BASE!$B:$B)),0))","v":14},{"$f":"IF($AA326=\"\",\"\",60*($AA326-1)+COUNTIF($AA$9:$AA326,$AA326))","v":802},"D2",2,"D",null,"يحي ",null," يحي "]
[324," ",1000413270753100,null,null,"ذكر","2004-03-31","مغنية","نصف داخلي","2ع ت02",null,null,null,"ثانية","علوم تجريبية ",2,324,"D1",null,"قرية اليخاتة - مغنية - ",null,null,null,null,null,null,{"$f":"IF($J327=\"\",\"\",MATCH($J327,OFFSET(BASE!$C$5,,,MAX(BASE!$B:$B)),0))","v":14},{"$f":"IF($AA327=\"\",\"\",60*($AA327-1)+COUNTIF($AA$9:$AA327,$AA327))","v":803},"D1",1,"D",null,"بوفلجة ",null," بوفلجة "]
[325," ",1100622010620900,null,null,"أنثى","2006-08-28","سيدي بلعباس","خارجي","2ع ت02",null,null,null,"ثانية","علوم تجريبية ",2,325,"E2",null,"منزل 29 حي الشهداء - مغنية -  ",null,null,null,null,null,null,{"$f":"IF($J328=\"\",\"\",MATCH($J328,OFFSET(BASE!$C$5,,,MAX(BASE!$B:$B)),0))","v":14},{"$f":"IF($AA328=\"\",\"\",60*($AA328-1)+COUNTIF($AA$9:$AA328,$AA328))","v":804},"E2",2,"E",null,"احمد ",null," احمد "]
[326," ",1000613270123700,null,null,"ذكر","2006-05-23","مغنية","خارجي","2ع ت02",null,null,null,"ثانية","علوم تجريبية ",2,326,"E1",null,"رقم 02 شارع 25  - حي الشهداء - مغنية - ",null,null,null,null,null,null,{"$f":"IF($J329=\"\",\"\",MATCH($J329,OFFSET(BASE!$C$5,,,MAX(BASE!$B:$B)),0))","v":14},{"$f":"IF($AA329=\"\",\"\",60*($AA329-1)+COUNTIF($AA$9:$AA329,$AA329))","v":805},"E1",1,"E",null,"عبد الغاني ",null,{"$f":"D329 & \" \" & AG329","v":" عبد الغاني "}]
[327," ",1100613270036300,null,null,"أنثى","2006-02-09","مغنية","خارجي","2ع ت02",null,null,null,"ثانية","علوم تجريبية ",2,327,"E2",null,"حي الشهداء  -  مغنية -  ",null,null,null,null,null,null,{"$f":"IF($J330=\"\",\"\",MATCH($J330,OFFSET(BASE!$C$5,,,MAX(BASE!$B:$B)),0))","v":14},{"$f":"IF($AA330=\"\",\"\",60*($AA330-1)+COUNTIF($AA$9:$AA330,$AA330))","v":806},{"$f":"AE330&AD330","v":"E2"},{"$f":"IF(F330=\"أنثى\",2,1)","v":2},{"$f":"IF(I330=\"نصف داخلي\",\"D\",\"E\")","v":"E"},null,"بن عمر ",null," بن عمر "]
[328," ",1000613270315000,null,null,"ذكر","2006-10-24","مغنية","خارجي","2ع ت02",null,null,null,"ثانية","علوم تجريبية ",2,328,"E1",null,"شارع 02 رقم 12 حي الشهداء - مغنية - ",null,null,null,null,null,null,{"$f":"IF($J331=\"\",\"\",MATCH($J331,OFFSET(BASE!$C$5,,,MAX(BASE!$B:$B)),0))","v":14},{"$f":"IF($AA331=\"\",\"\",60*($AA331-1)+COUNTIF($AA$9:$AA331,$AA331))","v":807},"E1",1,"E",null,"رشيد ",null," رشيد "]
[329," ",1100613270212400,null,null,"أنثى","2006-07-29","مغنية","خارجي","2ع ت02",null,null,null,"ثانية","علوم تجريبية ",2,329,"E2",null,"حي الشهداء مغنية ",null,null,null,null,null,null,{"$f":"IF($J332=\"\",\"\",MATCH($J332,OFFSET(BASE!$C$5,,,MAX(BASE!$B:$B)),0))","v":14},{"$f":"IF($AA332=\"\",\"\",60*($AA332-1)+COUNTIF($AA$9:$AA332,$AA332))","v":808},"E2",2,"E",null,"بوجمعة ",null," بوجمعة "]
[330," ",1100713270061900,null,null,"أنثى","2007-03-12","مغنية","خارجي","2ع ت02",null,null,null,"ثانية","علوم تجريبية ",2,330,"E2",null,"عمارة الاساتذة حي الشهداء - مغنية - ",null,null,null,null,null,null,{"$f":"IF($J333=\"\",\"\",MATCH($J333,OFFSET(BASE!$C$5,,,MAX(BASE!$B:$B)),0))","v":14},{"$f":"IF($AA333=\"\",\"\",60*($AA333-1)+COUNTIF($AA$9:$AA333,$AA333))","v":809},"E2",2,"E",null,"علي ",null," علي "]
[331," ",1000613270269900,null,null,"ذكر","2006-09-16","مغنية","خارجي","2ع ت02",null,null,null,"ثانية","علوم تجريبية ",2,331,"E1",null,"حي الشهداء - مغنية -  ",null,null,null,null,null,null,{"$f":"IF($J334=\"\",\"\",MATCH($J334,OFFSET(BASE!$C$5,,,MAX(BASE!$B:$B)),0))","v":14},{"$f":"IF($AA334=\"\",\"\",60*($AA334-1)+COUNTIF($AA$9:$AA334,$AA334))","v":810},"E1",1,"E",null,"نصر الدين ",null," نصر الدين "]
[332," ",1100613270116500,null,null,"أنثى","2006-05-16","مغنية","نصف داخلي","2ع ت03",null,null,null,"ثانية","علوم تجريبية ",3,332,"D2",null,"قرية أولاد الشارف - مغنية -  ",null,null,null,null,null,null,{"$f":"IF($J335=\"\",\"\",MATCH($J335,OFFSET(BASE!$C$5,,,MAX(BASE!$B:$B)),0))","v":15},{"$f":"IF($AA335=\"\",\"\",60*($AA335-1)+COUNTIF($AA$9:$AA335,$AA335))","v":841},"D2",2,"D",null,"مصطفى ",null," مصطفى "]
[333," ",1100613270139600,null,null,"أنثى","2006-06-05","مغنية","نصف داخلي","2ع ت03",null,null,null,"ثانية","علوم تجريبية ",3,333,"D2",null,"قرية البطيم مغنية ",null,null,null,null,null,null,{"$f":"IF($J336=\"\",\"\",MATCH($J336,OFFSET(BASE!$C$5,,,MAX(BASE!$B:$B)),0))","v":15},{"$f":"IF($AA336=\"\",\"\",60*($AA336-1)+COUNTIF($AA$9:$AA336,$AA336))","v":842},"D2",2,"D",null,"عبد الوفي ",null," عبد الوفي "]
[334," ",1100713270004200,null,null,"أنثى","2007-01-05","مغنية","نصف داخلي","2ع ت03",null,null,null,"ثانية","علوم تجريبية ",3,334,"D2",null,"قرية اولاد الشارف - مغنية -  ",null,null,null,null,null,null,{"$f":"IF($J337=\"\",\"\",MATCH($J337,OFFSET(BASE!$C$5,,,MAX(BASE!$B:$B)),0))","v":15},{"$f":"IF($AA337=\"\",\"\",60*($AA337-1)+COUNTIF($AA$9:$AA337,$AA337))","v":843},"D2",2,"D",null,"يحي ",null," يحي "]
[335," ",1100613270350900,null,null,"أنثى","2006-11-27","مغنية","نصف داخلي","2ع ت03",null,null,null,"ثانية","علوم تجريبية ",3,335,"D2",null,"قرية العقيد عباس  - مغنية -  ",null,null,null,null,null,null,{"$f":"IF($J338=\"\",\"\",MATCH($J338,OFFSET(BASE!$C$5,,,MAX(BASE!$B:$B)),0))","v":15},{"$f":"IF($AA338=\"\",\"\",60*($AA338-1)+COUNTIF($AA$9:$AA338,$AA338))","v":844},"D2",2,"D",null,"بن حمو ",null," بن حمو "]
[336," ",1100613270071900,null,null,"أنثى","2006-03-27","مغنية","نصف داخلي","2ع ت03",null,null,null,"ثانية","علوم تجريبية ",3,336,"D2",null,"قرية البطيم مغنية ",null,null,null,null,null,null,{"$f":"IF($J339=\"\",\"\",MATCH($J339,OFFSET(BASE!$C$5,,,MAX(BASE!$B:$B)),0))","v":15},{"$f":"IF($AA339=\"\",\"\",60*($AA339-1)+COUNTIF($AA$9:$AA339,$AA339))","v":845},"D2",2,"D",null,"أعمر ",null," أعمر "]
[337," ",1100613270227900,null,null,"أنثى","2006-08-11","مغنية","نصف داخلي","2ع ت03",null,null,null,"ثانية","علوم تجريبية ",3,337,"D2",null,"قرية البخاتة ",null,null,null,null,null,null,{"$f":"IF($J340=\"\",\"\",MATCH($J340,OFFSET(BASE!$C$5,,,MAX(BASE!$B:$B)),0))","v":15},{"$f":"IF($AA340=\"\",\"\",60*($AA340-1)+COUNTIF($AA$9:$AA340,$AA340))","v":846},"D2",2,"D",null,"احمد ",null," احمد "]
[338," ",1000613270312700,null,null,"ذكر","2006-10-22","مغنية","نصف داخلي","2ع ت03",null,null,null,"ثانية","علوم تجريبية ",3,338,"D1",null,"قرية اولاد الشارف - مغنية -  ",null,null,null,null,null,null,{"$f":"IF($J341=\"\",\"\",MATCH($J341,OFFSET(BASE!$C$5,,,MAX(BASE!$B:$B)),0))","v":15},{"$f":"IF($AA341=\"\",\"\",60*($AA341-1)+COUNTIF($AA$9:$AA341,$AA341))","v":847},"D1",1,"D",null,"محمد ",null," محمد "]
[339," ",1000613270312600,null,null,"ذكر","2006-10-22","مغنية","نصف داخلي","2ع ت03",null,null,null,"ثانية","علوم تجريبية ",3,339,"D1",null,"قرية اولاد الشارف - مغنية -  ",null,null,null,null,null,null,{"$f":"IF($J342=\"\",\"\",MATCH($J342,OFFSET(BASE!$C$5,,,MAX(BASE!$B:$B)),0))","v":15},{"$f":"IF($AA342=\"\",\"\",60*($AA342-1)+COUNTIF($AA$9:$AA342,$AA342))","v":848},"D1",1,"D",null,"محمد ",null," محمد "]
[340," ",1100613270172200,null,null,"أنثى","2006-06-28","مغنية","نصف داخلي","2ع ت03",null,null,null,"ثانية","علوم تجريبية ",3,340,"D2",null,"قرية البطيم-مغنية- ",null,null,null,null,null,null,{"$f":"IF($J343=\"\",\"\",MATCH($J343,OFFSET(BASE!$C$5,,,MAX(BASE!$B:$B)),0))","v":15},{"$f":"IF($AA343=\"\",\"\",60*($AA343-1)+COUNTIF($AA$9:$AA343,$AA343))","v":849},"D2",2,"D",null,"عبد العزيز ",null," عبد العزيز "]
[341," ",1000613270159800,null,null,"ذكر","2006-04-28","مغنية","نصف داخلي","2ع ت03",null,null,null,"ثانية","علوم تجريبية ",3,341,"D1",null,"قرية العقيد لطفي - مغنية - ",null,null,null,null,null,null,{"$f":"IF($J344=\"\",\"\",MATCH($J344,OFFSET(BASE!$C$5,,,MAX(BASE!$B:$B)),0))","v":15},{"$f":"IF($AA344=\"\",\"\",60*($AA344-1)+COUNTIF($AA$9:$AA344,$AA344))","v":850},"D1",1,"D",null,"عمر ",null," عمر "]
[342," ",1100613270181900,null,null,"أنثى","2006-07-04","مغنية","نصف داخلي","2ع ت03",null,null,null,"ثانية","علوم تجريبية ",3,342,"D2",null,"قرية العقيد عباس - مغنية -  ",null,null,null,null,null,null,{"$f":"IF($J345=\"\",\"\",MATCH($J345,OFFSET(BASE!$C$5,,,MAX(BASE!$B:$B)),0))","v":15},{"$f":"IF($AA345=\"\",\"\",60*($AA345-1)+COUNTIF($AA$9:$AA345,$AA345))","v":851},"D2",2,"D",null,"محمد ",null," محمد "]
[343," ",1000413270167700,null,null,"ذكر","2004-07-03","مغنية","نصف داخلي","2ع ت03",null,null,null,"ثانية","علوم تجريبية ",3,343,"D1",null,"قرية أولاد الشارف -  مغنية -  ",null,null,null,null,null,null,{"$f":"IF($J346=\"\",\"\",MATCH($J346,OFFSET(BASE!$C$5,,,MAX(BASE!$B:$B)),0))","v":15},{"$f":"IF($AA346=\"\",\"\",60*($AA346-1)+COUNTIF($AA$9:$AA346,$AA346))","v":852},"D1",1,"D",null,"لحسن ",null," لحسن "]
[344," ",1000713270016600,null,null,"ذكر","2007-01-17","مغنية","نصف داخلي","2ع ت03",null,null,null,"ثانية","علوم تجريبية ",3,344,"D1",null,"قرية المصامدة - مغنية - تلمسان ",null,null,null,null,null,null,{"$f":"IF($J347=\"\",\"\",MATCH($J347,OFFSET(BASE!$C$5,,,MAX(BASE!$B:$B)),0))","v":15},{"$f":"IF($AA347=\"\",\"\",60*($AA347-1)+COUNTIF($AA$9:$AA347,$AA347))","v":853},"D1",1,"D",null,"نورالدين ",null," نورالدين "]
[345," ",1000613270095300,null,null,"ذكر","2006-07-03","مغنية","نصف داخلي","2ع ت03",null,null,null,"ثانية","علوم تجريبية ",3,345,"D1",null,"عمارة 01 جتاح 01 قرية العقيد لطفي - مغنية - ",null,null,null,null,null,null,{"$f":"IF($J348=\"\",\"\",MATCH($J348,OFFSET(BASE!$C$5,,,MAX(BASE!$B:$B)),0))","v":15},{"$f":"IF($AA348=\"\",\"\",60*($AA348-1)+COUNTIF($AA$9:$AA348,$AA348))","v":854},"D1",1,"D",null,"نورالدين ",null," نورالدين "]
[346," ",1100613270306100,null,null,"أنثى","2006-10-16","مغنية","نصف داخلي","2ع ت03",null,null,null,"ثانية","علوم تجريبية ",3,346,"D2",null,"قرية أولاد الشارف - مغنية -  ",null,null,null,null,null,null,{"$f":"IF($J349=\"\",\"\",MATCH($J349,OFFSET(BASE!$C$5,,,MAX(BASE!$B:$B)),0))","v":15},{"$f":"IF($AA349=\"\",\"\",60*($AA349-1)+COUNTIF($AA$9:$AA349,$AA349))","v":855},"D2",2,"D",null,"حمزة ",null," حمزة "]
[347," ",1000613270325000,null,null,"أنثى","2006-11-02","مغنية","نصف داخلي","2ع ت03",null,null,null,"ثانية","علوم تجريبية ",3,347,"D2",null,"قرية أولاد الشارف - مغنية - ",null,null,null,null,null,null,{"$f":"IF($J350=\"\",\"\",MATCH($J350,OFFSET(BASE!$C$5,,,MAX(BASE!$B:$B)),0))","v":15},{"$f":"IF($AA350=\"\",\"\",60*($AA350-1)+COUNTIF($AA$9:$AA350,$AA350))","v":856},"D2",2,"D",null,"محمد ",null," محمد "]
[348," ",1100513270223400,null,null,"أنثى","2005-08-06","مغنية","نصف داخلي","2ع ت03",null,null,null,"ثانية","علوم تجريبية ",3,348,"D2",null,"قرية أولاد الشارف - مغنية - ",null,null,null,null,null,null,{"$f":"IF($J351=\"\",\"\",MATCH($J351,OFFSET(BASE!$C$5,,,MAX(BASE!$B:$B)),0))","v":15},{"$f":"IF($AA351=\"\",\"\",60*($AA351-1)+COUNTIF($AA$9:$AA351,$AA351))","v":857},"D2",2,"D",null,"عبد القادر ",null," عبد القادر "]
[349," ",1100613270324100,null,null,"أنثى","2006-11-01","مغنية","نصف داخلي","2ع ت03",null,null,null,"ثانية","علوم تجريبية ",3,349,"D2",null,"قرية البطيم-مغنية- ",null,null,null,null,null,null,{"$f":"IF($J352=\"\",\"\",MATCH($J352,OFFSET(BASE!$C$5,,,MAX(BASE!$B:$B)),0))","v":15},{"$f":"IF($AA352=\"\",\"\",60*($AA352-1)+COUNTIF($AA$9:$AA352,$AA352))","v":858},"D2",2,"D",null,"يوسف ",null," يوسف "]
[350," ",1100613270167800,null,null,"أنثى","2006-06-24","مغنية","نصف داخلي","2ع ت03",null,null,null,"ثانية","علوم تجريبية ",3,350,"D2",null,"قرية البطيم مغنية ",null,null,null,null,null,null,{"$f":"IF($J353=\"\",\"\",MATCH($J353,OFFSET(BASE!$C$5,,,MAX(BASE!$B:$B)),0))","v":15},{"$f":"IF($AA353=\"\",\"\",60*($AA353-1)+COUNTIF($AA$9:$AA353,$AA353))","v":859},"D2",2,"D",null,"رشيد ",null," رشيد "]
[351," ",1100513270172500,null,null,"أنثى","2005-06-27","مغنية","نصف داخلي","2ع ت03",null,null,null,"ثانية","علوم تجريبية ",3,351,"D2",null,"قرية المصامدة - مغنية - تلمسان ",null,null,null,null,null,null,{"$f":"IF($J354=\"\",\"\",MATCH($J354,OFFSET(BASE!$C$5,,,MAX(BASE!$B:$B)),0))","v":15},{"$f":"IF($AA354=\"\",\"\",60*($AA354-1)+COUNTIF($AA$9:$AA354,$AA354))","v":860},"D2",2,"D",null,"محمد عبد الباسط ",null," محمد عبد الباسط "]
[352," ",1100613270117600,null,null,"أنثى","2006-05-17","مغنية","نصف داخلي","2ع ت03",null,null,null,"ثانية","علوم تجريبية ",3,352,"D2",null,"قرية العقيد لطفي ",null,null,null,null,null,null,{"$f":"IF($J355=\"\",\"\",MATCH($J355,OFFSET(BASE!$C$5,,,MAX(BASE!$B:$B)),0))","v":15},{"$f":"IF($AA355=\"\",\"\",60*($AA355-1)+COUNTIF($AA$9:$AA355,$AA355))","v":861},"D2",2,"D",null,"بلخير ",null," بلخير "]
[353," ",1100613010641700,null,null,"أنثى","2006-08-25","تلمسان","خارجي","2ع ت03",null,null,null,"ثانية","علوم تجريبية ",3,353,"E2",null,"رقم المنزل 24 حي الشهداء - مغنية -  ",null,null,null,null,null,null,{"$f":"IF($J356=\"\",\"\",MATCH($J356,OFFSET(BASE!$C$5,,,MAX(BASE!$B:$B)),0))","v":15},{"$f":"IF($AA356=\"\",\"\",60*($AA356-1)+COUNTIF($AA$9:$AA356,$AA356))","v":862},"E2",2,"E",null,"لخضر ",null," لخضر "]
[354," ",1000613270278500,null,null,"ذكر","2006-09-24","مغنية","خارجي","2ع ت03",null,null,null,"ثانية","علوم تجريبية ",3,354,"E1",null,"حي الشهداء - مغنية -  ",null,null,null,null,null,null,{"$f":"IF($J357=\"\",\"\",MATCH($J357,OFFSET(BASE!$C$5,,,MAX(BASE!$B:$B)),0))","v":15},{"$f":"IF($AA357=\"\",\"\",60*($AA357-1)+COUNTIF($AA$9:$AA357,$AA357))","v":863},"E1",1,"E",null,"محمد ",null," محمد "]
[355," ",1100613270072800,null,null,"أنثى","2006-03-29","مغنية","خارجي","2ع ت03",null,null,null,"ثانية","علوم تجريبية ",3,355,"E2",null,"حي الشهداء - مغنية - ",null,null,null,null,null,null,{"$f":"IF($J358=\"\",\"\",MATCH($J358,OFFSET(BASE!$C$5,,,MAX(BASE!$B:$B)),0))","v":15},{"$f":"IF($AA358=\"\",\"\",60*($AA358-1)+COUNTIF($AA$9:$AA358,$AA358))","v":864},"E2",2,"E",null,"محمد ",null," محمد "]
[356," ",1100713270011900,null,null,"أنثى","2007-01-12","مغنية","خارجي","2ع ت03",null,null,null,"ثانية","علوم تجريبية ",3,356,"E2",null,"حي الشهداء - مغنية - ",null,null,null,null,null,null,{"$f":"IF($J359=\"\",\"\",MATCH($J359,OFFSET(BASE!$C$5,,,MAX(BASE!$B:$B)),0))","v":15},{"$f":"IF($AA359=\"\",\"\",60*($AA359-1)+COUNTIF($AA$9:$AA359,$AA359))","v":865},"E2",2,"E",null,"عبد العزيز ",null," عبد العزيز "]
[357," ",1100613270204000,null,null,"أنثى","2006-07-22","مغنية","خارجي","2ع ت03",null,null,null,"ثانية","علوم تجريبية ",3,357,"E2",null,"رقم 02 مخبزة حي الشهداء - مغنية -  ",null,null,null,null,null,null,{"$f":"IF($J360=\"\",\"\",MATCH($J360,OFFSET(BASE!$C$5,,,MAX(BASE!$B:$B)),0))","v":15},{"$f":"IF($AA360=\"\",\"\",60*($AA360-1)+COUNTIF($AA$9:$AA360,$AA360))","v":866},"E2",2,"E",null,"عبد اللطيف ",null," عبد اللطيف "]
[358," ",1000513010736900,null,null,"ذكر","2005-10-14","تلمسان","خارجي","2ع ت03",null,null,null,"ثانية","علوم تجريبية ",3,358,"E1",null,"رقم 33حي الزوينات  شتوان تلمسان ",null,null,null,null,null,null,{"$f":"IF($J361=\"\",\"\",MATCH($J361,OFFSET(BASE!$C$5,,,MAX(BASE!$B:$B)),0))","v":15},{"$f":"IF($AA361=\"\",\"\",60*($AA361-1)+COUNTIF($AA$9:$AA361,$AA361))","v":867},"E1",1,"E",null,"زوبير ",null," زوبير "]
[359," ",1000613270358400,null,null,"ذكر","2006-12-04","مغنية","خارجي","2ع ت03",null,null,null,"ثانية","علوم تجريبية ",3,359,"E1",null,"حي الشهداء مغنية ",null,null,null,null,null,null,{"$f":"IF($J362=\"\",\"\",MATCH($J362,OFFSET(BASE!$C$5,,,MAX(BASE!$B:$B)),0))","v":15},{"$f":"IF($AA362=\"\",\"\",60*($AA362-1)+COUNTIF($AA$9:$AA362,$AA362))","v":868},"E1",1,"E",null,"مصطفى ",null," مصطفى "]
[360," ",1000213270226200,null,null,"ذكر","2002-10-08","مغنية","خارجي","2ع ت03",null,null,null,"ثانية","علوم تجريبية ",3,360,"E1",null,"شارع رقم 15 حي الشهداء   - مغنية -  ",null,null,null,null,null,null,{"$f":"IF($J363=\"\",\"\",MATCH($J363,OFFSET(BASE!$C$5,,,MAX(BASE!$B:$B)),0))","v":15},{"$f":"IF($AA363=\"\",\"\",60*($AA363-1)+COUNTIF($AA$9:$AA363,$AA363))","v":869},"E1",1,"E",null,"حسين ",null," حسين "]
[361," ",1100713270035600,null,null,"أنثى","2007-02-09","مغنية","خارجي","2ع ت03",null,null,null,"ثانية","علوم تجريبية ",3,361,"E2",null,"مزرعة شعبان حمدون - مغنية -  ",null,null,null,null,null,null,{"$f":"IF($J364=\"\",\"\",MATCH($J364,OFFSET(BASE!$C$5,,,MAX(BASE!$B:$B)),0))","v":15},{"$f":"IF($AA364=\"\",\"\",60*($AA364-1)+COUNTIF($AA$9:$AA364,$AA364))","v":870},"E2",2,"E",null,"مراد ",null," مراد "]
[362," ",1100613010409300,null,null,"أنثى","2006-06-11","تلمسان","خارجي","2ع ت03",null,null,null,"ثانية","علوم تجريبية ",3,362,"E2",null,"سيد العربي ",null,null,null,null,null,null,{"$f":"IF($J365=\"\",\"\",MATCH($J365,OFFSET(BASE!$C$5,,,MAX(BASE!$B:$B)),0))","v":15},{"$f":"IF($AA365=\"\",\"\",60*($AA365-1)+COUNTIF($AA$9:$AA365,$AA365))","v":871},"E2",2,"E",null,"جمال ",null," جمال "]
[363," ",1100713270007100,null,null,"أنثى","2007-01-08","مغنية","نصف داخلي","2أ ف01",null,null,null,"ثانية","آداب وفلسفة ",1,363,"D2",null,"قرية أولاد الشارف - مغنية -  ",null,null,null,null,null,null,{"$f":"IF($J366=\"\",\"\",MATCH($J366,OFFSET(BASE!$C$5,,,MAX(BASE!$B:$B)),0))","v":16},{"$f":"IF($AA366=\"\",\"\",60*($AA366-1)+COUNTIF($AA$9:$AA366,$AA366))","v":901},"D2",2,"D",null,"ميلود ",null," ميلود "]
[364," ",1000513270170300,null,null,"ذكر","2005-06-26","مغنية","نصف داخلي","2أ ف01",null,null,null,"ثانية","آداب وفلسفة ",1,364,"D1",null,"قرية العقيد لطفي ",null,null,null,null,null,null,{"$f":"IF($J367=\"\",\"\",MATCH($J367,OFFSET(BASE!$C$5,,,MAX(BASE!$B:$B)),0))","v":16},{"$f":"IF($AA367=\"\",\"\",60*($AA367-1)+COUNTIF($AA$9:$AA367,$AA367))","v":902},"D1",1,"D",null,"رشيد محمد ",null," رشيد محمد "]
[365," ",1000413270113200,null,null,"ذكر","2004-05-19","مغنية","نصف داخلي","2أ ف01",null,null,null,"ثانية","آداب وفلسفة ",1,365,"D1",null,"قرية البطيم مغنية ",null,null,null,null,null,null,{"$f":"IF($J368=\"\",\"\",MATCH($J368,OFFSET(BASE!$C$5,,,MAX(BASE!$B:$B)),0))","v":16},{"$f":"IF($AA368=\"\",\"\",60*($AA368-1)+COUNTIF($AA$9:$AA368,$AA368))","v":903},"D1",1,"D",null,"محمد ",null," محمد "]
[366," ",1100413270297300,null,null,"أنثى","2004-10-27","مغنية","نصف داخلي","2أ ف01",null,null,null,"ثانية","آداب وفلسفة ",1,366,"D2",null,"قرية المصامدة - مغنية - تلمسان ",null,null,null,null,null,null,{"$f":"IF($J369=\"\",\"\",MATCH($J369,OFFSET(BASE!$C$5,,,MAX(BASE!$B:$B)),0))","v":16},{"$f":"IF($AA369=\"\",\"\",60*($AA369-1)+COUNTIF($AA$9:$AA369,$AA369))","v":904},"D2",2,"D",null,"عمر ",null," عمر "]
[367," ",1100613270089400,null,null,"أنثى","2006-09-19","مغنية","نصف داخلي","2أ ف01",null,null,null,"ثانية","آداب وفلسفة ",1,367,"D2",null,"عمارة رقم 01 قرية العقيد لطفي - مغنية -  ",null,null,null,null,null,null,{"$f":"IF($J370=\"\",\"\",MATCH($J370,OFFSET(BASE!$C$5,,,MAX(BASE!$B:$B)),0))","v":16},{"$f":"IF($AA370=\"\",\"\",60*($AA370-1)+COUNTIF($AA$9:$AA370,$AA370))","v":905},"D2",2,"D",null,"عبد الحميد  ",null," عبد الحميد  "]
[368," ",1100613270254800,null,null,"أنثى","2006-04-19","تلمسان","نصف داخلي","2أ ف01",null,null,null,"ثانية","آداب وفلسفة ",1,368,"D2",null,"قرية أولاد الشارف - مغنية *-  ",null,null,null,null,null,null,{"$f":"IF($J371=\"\",\"\",MATCH($J371,OFFSET(BASE!$C$5,,,MAX(BASE!$B:$B)),0))","v":16},{"$f":"IF($AA371=\"\",\"\",60*($AA371-1)+COUNTIF($AA$9:$AA371,$AA371))","v":906},"D2",2,"D",null,"حصيني ",null," حصيني "]
[369," ",1000613271121500,null,null,"ذكر","2006-01-16","مغنية","نصف داخلي","2أ ف01",null,null,null,"ثانية","آداب وفلسفة ",1,369,"D1",null,"قرية العقيد عباس - مغنية -  ",null,null,null,null,null,null,{"$f":"IF($J372=\"\",\"\",MATCH($J372,OFFSET(BASE!$C$5,,,MAX(BASE!$B:$B)),0))","v":16},{"$f":"IF($AA372=\"\",\"\",60*($AA372-1)+COUNTIF($AA$9:$AA372,$AA372))","v":907},"D1",1,"D",null,"عبد الحليم ",null," عبد الحليم "]
[370," ",1000513270180700,null,null,"ذكر","2005-07-03","مغنية","نصف داخلي","2أ ف01",null,null,null,"ثانية","آداب وفلسفة ",1,370,"D1",null,"دوار المرازقة  - مغنية ",null,null,null,null,null,null,{"$f":"IF($J373=\"\",\"\",MATCH($J373,OFFSET(BASE!$C$5,,,MAX(BASE!$B:$B)),0))","v":16},{"$f":"IF($AA373=\"\",\"\",60*($AA373-1)+COUNTIF($AA$9:$AA373,$AA373))","v":908},"D1",1,"D",null,"لخضر ",null," لخضر "]
[371," ",1100513270230500,null,null,"أنثى","2005-08-11","مغنية","نصف داخلي","2أ ف01",null,null,null,"ثانية","آداب وفلسفة ",1,371,"D2",null,"قرية المصامدة - مغنية - تلمسان ",null,null,null,null,null,null,{"$f":"IF($J374=\"\",\"\",MATCH($J374,OFFSET(BASE!$C$5,,,MAX(BASE!$B:$B)),0))","v":16},{"$f":"IF($AA374=\"\",\"\",60*($AA374-1)+COUNTIF($AA$9:$AA374,$AA374))","v":909},"D2",2,"D",null,"مولاي أحمد ",null," مولاي أحمد "]
[372," ",1100713270046600,null,null,"أنثى","2007-02-21","مغنية","نصف داخلي","2أ ف01",null,null,null,"ثانية","آداب وفلسفة ",1,372,"D2",null,"قرية المصامدة - مغنية - تلمسان ",null,null,null,null,null,null,{"$f":"IF($J375=\"\",\"\",MATCH($J375,OFFSET(BASE!$C$5,,,MAX(BASE!$B:$B)),0))","v":16},{"$f":"IF($AA375=\"\",\"\",60*($AA375-1)+COUNTIF($AA$9:$AA375,$AA375))","v":910},"D2",2,"D",null,"حميد ",null," حميد "]
[373," ",1100613270332200,null,null,"أنثى","2006-11-08","مغنية","نصف داخلي","2أ ف01",null,null,null,"ثانية","آداب وفلسفة ",1,373,"D2",null,"قرية البطيم مغنية ",null,null,null,null,null,null,{"$f":"IF($J376=\"\",\"\",MATCH($J376,OFFSET(BASE!$C$5,,,MAX(BASE!$B:$B)),0))","v":16},{"$f":"IF($AA376=\"\",\"\",60*($AA376-1)+COUNTIF($AA$9:$AA376,$AA376))","v":911},"D2",2,"D",null,"عيسى ",null," عيسى "]
[374," ",1000413270006800,null,null,"ذكر","2004-01-09","مغنية","نصف داخلي","2أ ف01",null,null,null,"ثانية","آداب وفلسفة ",1,374,"D1",null," ",null,null,null,null,null,null,{"$f":"IF($J377=\"\",\"\",MATCH($J377,OFFSET(BASE!$C$5,,,MAX(BASE!$B:$B)),0))","v":16},{"$f":"IF($AA377=\"\",\"\",60*($AA377-1)+COUNTIF($AA$9:$AA377,$AA377))","v":912},"D1",1,"D",null,"بن أعمر ",null," بن أعمر "]
[375," ",1000513270066900,null,null,"ذكر","2005-03-20","مغنية","نصف داخلي","2أ ف01",null,null,null,"ثانية","آداب وفلسفة ",1,375,"D1",null,"قرية أولاد الشارف - مغنية -  ",null,null,null,null,null,null,{"$f":"IF($J378=\"\",\"\",MATCH($J378,OFFSET(BASE!$C$5,,,MAX(BASE!$B:$B)),0))","v":16},{"$f":"IF($AA378=\"\",\"\",60*($AA378-1)+COUNTIF($AA$9:$AA378,$AA378))","v":913},"D1",1,"D",null,"توفيق ",null," توفيق "]
[376," ",1000513270036000,null,null,"ذكر","2005-02-09","مغنية","نصف داخلي","2أ ف01",null,null,null,"ثانية","آداب وفلسفة ",1,376,"D1",null,"قرية البطيم مغنية ",null,null,null,null,null,null,{"$f":"IF($J379=\"\",\"\",MATCH($J379,OFFSET(BASE!$C$5,,,MAX(BASE!$B:$B)),0))","v":16},{"$f":"IF($AA379=\"\",\"\",60*($AA379-1)+COUNTIF($AA$9:$AA379,$AA379))","v":914},"D1",1,"D",null,"بن عودة ",null," بن عودة "]
[377," ",1100631060234100,null,null,"أنثى","2006-12-30","أرزيو","نصف داخلي","2أ ف01",null,null,null,"ثانية","آداب وفلسفة ",1,377,"D2",null," ",null,null,null,null,null,null,{"$f":"IF($J380=\"\",\"\",MATCH($J380,OFFSET(BASE!$C$5,,,MAX(BASE!$B:$B)),0))","v":16},{"$f":"IF($AA380=\"\",\"\",60*($AA380-1)+COUNTIF($AA$9:$AA380,$AA380))","v":915},"D2",2,"D",null,"محمد ",null," محمد "]
[378," ",1000613270271400,null,null,"ذكر","2006-09-17","مغنية","نصف داخلي","2أ ف01",null,null,null,"ثانية","آداب وفلسفة ",1,378,"D1",null,"102 حي الغابات مغنية ",null,null,null,null,null,null,{"$f":"IF($J381=\"\",\"\",MATCH($J381,OFFSET(BASE!$C$5,,,MAX(BASE!$B:$B)),0))","v":16},{"$f":"IF($AA381=\"\",\"\",60*($AA381-1)+COUNTIF($AA$9:$AA381,$AA381))","v":916},"D1",1,"D",null,"بومدين ",null," بومدين "]
[379," ",1100613270271300,null,null,"أنثى","2006-09-17","مغنية","نصف داخلي","2أ ف01",null,null,null,"ثانية","آداب وفلسفة ",1,379,"D2",null,"حي الباطوار رقم المنزل 102 مغنية ",null,null,null,null,null,null,{"$f":"IF($J382=\"\",\"\",MATCH($J382,OFFSET(BASE!$C$5,,,MAX(BASE!$B:$B)),0))","v":16},{"$f":"IF($AA382=\"\",\"\",60*($AA382-1)+COUNTIF($AA$9:$AA382,$AA382))","v":917},"D2",2,"D",null,"بومدين ",null," بومدين "]
[380," ",1100613270216500,null,null,"أنثى","2006-08-02","مغنية","نصف داخلي","2أ ف01",null,null,null,"ثانية","آداب وفلسفة ",1,380,"D2",null,"قرية البطيم-مغنية- ",null,null,null,null,null,null,{"$f":"IF($J383=\"\",\"\",MATCH($J383,OFFSET(BASE!$C$5,,,MAX(BASE!$B:$B)),0))","v":16},{"$f":"IF($AA383=\"\",\"\",60*($AA383-1)+COUNTIF($AA$9:$AA383,$AA383))","v":918},"D2",2,"D",null,"رشيد ",null," رشيد "]
[381," ",1000213270153200,null,null,"ذكر","2002-07-22","مغنية","نصف داخلي","2أ ف01",null,null,null,"ثانية","آداب وفلسفة ",1,381,"D1",null,"قرية البطيم مغنية ",null,null,null,null,null,null,{"$f":"IF($J384=\"\",\"\",MATCH($J384,OFFSET(BASE!$C$5,,,MAX(BASE!$B:$B)),0))","v":16},{"$f":"IF($AA384=\"\",\"\",60*($AA384-1)+COUNTIF($AA$9:$AA384,$AA384))","v":919},"D1",1,"D",null,"أحمد ",null," أحمد "]
[382," ",1000413270134100,null,null,"ذكر","2004-06-05","مغنية","نصف داخلي","2أ ف01",null,null,null,"ثانية","آداب وفلسفة ",1,382,"D1",null,"قرية البطيم مغنية ",null,null,null,null,null,null,{"$f":"IF($J385=\"\",\"\",MATCH($J385,OFFSET(BASE!$C$5,,,MAX(BASE!$B:$B)),0))","v":16},{"$f":"IF($AA385=\"\",\"\",60*($AA385-1)+COUNTIF($AA$9:$AA385,$AA385))","v":920},"D1",1,"D",null,"العيد ",null," العيد "]
[383," ",1000513270376100,null,null,"ذكر","2005-12-27","مغنية","نصف داخلي","2أ ف01",null,null,null,"ثانية","آداب وفلسفة ",1,383,"D1",null,"قرية البطيم-مغنية- ",null,null,null,null,null,null,{"$f":"IF($J386=\"\",\"\",MATCH($J386,OFFSET(BASE!$C$5,,,MAX(BASE!$B:$B)),0))","v":16},{"$f":"IF($AA386=\"\",\"\",60*($AA386-1)+COUNTIF($AA$9:$AA386,$AA386))","v":921},"D1",1,"D",null,"علي ",null," علي "]
[384," ",1000513270226100,null,null,"ذكر","2005-08-08","مغنية","نصف داخلي","2أ ف01",null,null,null,"ثانية","آداب وفلسفة ",1,384,"D1",null,"قرية البطيم-مغنية- ",null,null,null,null,null,null,{"$f":"IF($J387=\"\",\"\",MATCH($J387,OFFSET(BASE!$C$5,,,MAX(BASE!$B:$B)),0))","v":16},{"$f":"IF($AA387=\"\",\"\",60*($AA387-1)+COUNTIF($AA$9:$AA387,$AA387))","v":922},"D1",1,"D",null,"عبد الناصر ",null," عبد الناصر "]
[385,{"$f":"D388& \" \" &E388","v":" "},1100513270152300,null,null,"أنثى","2005-06-15","مغنية","نصف داخلي","2أ ف01",null,null,null,"ثانية","آداب وفلسفة ",1,385,"D2",null,"قرية البطيم-مغنية- ",null,null,null,null,null,null,{"$f":"IF($J388=\"\",\"\",MATCH($J388,OFFSET(BASE!$C$5,,,MAX(BASE!$B:$B)),0))","v":16},{"$f":"IF($AA388=\"\",\"\",60*($AA388-1)+COUNTIF($AA$9:$AA388,$AA388))","v":923},"D2",2,"D",null,"لخضر ",null," لخضر "]
[386," ",1000513270326400,null,null,"ذكر","2005-11-03","مغنية","نصف داخلي","2أ ف01",null,null,null,"ثانية","آداب وفلسفة ",1,386,"D1",null,"قرية البطيم-مغنية- ",null,null,null,null,null,null,{"$f":"IF($J389=\"\",\"\",MATCH($J389,OFFSET(BASE!$C$5,,,MAX(BASE!$B:$B)),0))","v":16},{"$f":"IF($AA389=\"\",\"\",60*($AA389-1)+COUNTIF($AA$9:$AA389,$AA389))","v":924},"D1",1,"D",null,"عبد المجيد ",null," عبد المجيد "]
[387," ",1000313010330700,null,null,"ذكر","2003-06-09","تلمسان","نصف داخلي","2أ ف01",null,null,null,"ثانية","آداب وفلسفة ",1,387,"D1",null,"قرية العقيد لطفي مغنية ",null,null,null,null,null,null,{"$f":"IF($J390=\"\",\"\",MATCH($J390,OFFSET(BASE!$C$5,,,MAX(BASE!$B:$B)),0))","v":16},{"$f":"IF($AA390=\"\",\"\",60*($AA390-1)+COUNTIF($AA$9:$AA390,$AA390))","v":925},"D1",1,"D",null,"عبد القادر ",null," عبد القادر "]
[388," ",1000213270155400,null,null,"ذكر","2002-07-23","مغنية","خارجي","2أ ف01",null,null,null,"ثانية","آداب وفلسفة ",1,388,"E1",null,"قرية اولاد الشارف مغنية ",null,null,null,null,null,null,{"$f":"IF($J391=\"\",\"\",MATCH($J391,OFFSET(BASE!$C$5,,,MAX(BASE!$B:$B)),0))","v":16},{"$f":"IF($AA391=\"\",\"\",60*($AA391-1)+COUNTIF($AA$9:$AA391,$AA391))","v":926},"E1",1,"E",null,"محمد ",null," محمد "]
[389," ",1100313270753200,null,null,"أنثى","2003-02-02","مغنية","خارجي","2أ ف01",null,null,null,"ثانية","آداب وفلسفة ",1,389,"E2",null,"حي الشهداء - مغنية -  ",null,null,null,null,null,null,{"$f":"IF($J392=\"\",\"\",MATCH($J392,OFFSET(BASE!$C$5,,,MAX(BASE!$B:$B)),0))","v":16},{"$f":"IF($AA392=\"\",\"\",60*($AA392-1)+COUNTIF($AA$9:$AA392,$AA392))","v":927},"E2",2,"E",null,"بن يونس ",null," بن يونس "]
[390," ",1100513270369700,null,null,"أنثى","2005-12-19","مغنية","خارجي","2أ ف01",null,null,null,"ثانية","آداب وفلسفة ",1,390,"E2",null,"قرية اولاد الشارف - مغنية - ",null,null,null,null,null,null,{"$f":"IF($J393=\"\",\"\",MATCH($J393,OFFSET(BASE!$C$5,,,MAX(BASE!$B:$B)),0))","v":16},{"$f":"IF($AA393=\"\",\"\",60*($AA393-1)+COUNTIF($AA$9:$AA393,$AA393))","v":928},"E2",2,"E",null,"محمد ",null,{"$f":"D393 & \" \" & AG393","v":" محمد "}]
[391," ",1000313270188900,null,null,"ذكر","2003-08-17","مغنية","خارجي","2أ ف01",null,null,null,"ثانية","آداب وفلسفة ",1,391,"E1",null," ",null,null,null,null,null,null,{"$f":"IF($J394=\"\",\"\",MATCH($J394,OFFSET(BASE!$C$5,,,MAX(BASE!$B:$B)),0))","v":16},{"$f":"IF($AA394=\"\",\"\",60*($AA394-1)+COUNTIF($AA$9:$AA394,$AA394))","v":929},{"$f":"AE394&AD394","v":"E1"},{"$f":"IF(F394=\"أنثى\",2,1)","v":1},{"$f":"IF(I394=\"نصف داخلي\",\"D\",\"E\")","v":"E"},null,"أحمد ",null," أحمد "]
[392," ",1100413270172600,null,null,"أنثى","2004-07-07","مغنية","خارجي","2أ ف01",null,null,null,"ثانية","آداب وفلسفة ",1,392,"E2",null,"اولاد قدور الكبار ",null,null,null,null,null,null,{"$f":"IF($J395=\"\",\"\",MATCH($J395,OFFSET(BASE!$C$5,,,MAX(BASE!$B:$B)),0))","v":16},{"$f":"IF($AA395=\"\",\"\",60*($AA395-1)+COUNTIF($AA$9:$AA395,$AA395))","v":930},"E2",2,"E",null,"عبد القادر ",null," عبد القادر "]
[393," ",1100413270144400,null,null,"أنثى","2004-06-15","مغنية","خارجي","2أ ف01",null,null,null,"ثانية","آداب وفلسفة ",1,393,"E2",null,"حي الشهداء - مغنية -  ",null,null,null,null,null,null,{"$f":"IF($J396=\"\",\"\",MATCH($J396,OFFSET(BASE!$C$5,,,MAX(BASE!$B:$B)),0))","v":16},{"$f":"IF($AA396=\"\",\"\",60*($AA396-1)+COUNTIF($AA$9:$AA396,$AA396))","v":931},"E2",2,"E",null,"عبد الكريم ",null," عبد الكريم "]
[394," ",1000513270045500,null,null,"ذكر","2005-02-21","مغنية","خارجي","2أ ف01",null,null,null,"ثانية","آداب وفلسفة ",1,395,"E1",null,"قرية العقيد عباس مغنية ",null,null,null,null,null,null,{"$f":"IF($J397=\"\",\"\",MATCH($J397,OFFSET(BASE!$C$5,,,MAX(BASE!$B:$B)),0))","v":16},{"$f":"IF($AA397=\"\",\"\",60*($AA397-1)+COUNTIF($AA$9:$AA397,$AA397))","v":932},"E1",1,"E",null,"لحسن ",null," لحسن "]
[395," ",1000413270058700,null,null,"ذكر","2004-10-26","مغنية","خارجي","2أ ف01",null,null,null,"ثانية","آداب وفلسفة ",1,395,"E1",null,null,null,null,null,null,null,null,{"$f":"IF($J398=\"\",\"\",MATCH($J398,OFFSET(BASE!$C$5,,,MAX(BASE!$B:$B)),0))","v":16},{"$f":"IF($AA398=\"\",\"\",60*($AA398-1)+COUNTIF($AA$9:$AA398,$AA398))","v":933},"E1",1,"E",null,null,null," "]
[396," ",1100613270301500,null,null,"أنثى","2006-10-13","مغنية","خارجي","2أ ف01",null,null,null,"ثانية","آداب وفلسفة ",1,396,"E2",null,"حي الشهداء - مغنية -  ",null,null,null,null,null,null,{"$f":"IF($J399=\"\",\"\",MATCH($J399,OFFSET(BASE!$C$5,,,MAX(BASE!$B:$B)),0))","v":16},{"$f":"IF($AA399=\"\",\"\",60*($AA399-1)+COUNTIF($AA$9:$AA399,$AA399))","v":934},"E2",2,"E",null,"محمد امين ",null," محمد امين "]
[397," ",1000313010002600,null,null,"ذكر","2003-01-03","بني بوسعيد","خارجي","2أ ف01",null,null,null,"ثانية","آداب وفلسفة ",1,397,"E1",null,null,null,null,null,null,null,null,{"$f":"IF($J400=\"\",\"\",MATCH($J400,OFFSET(BASE!$C$5,,,MAX(BASE!$B:$B)),0))","v":16},{"$f":"IF($AA400=\"\",\"\",60*($AA400-1)+COUNTIF($AA$9:$AA400,$AA400))","v":935},"E1",1,"E",null,null,null," "]
[398," ",1100413270354800,null,null,"أنثى","2004-12-28","مغنية","خارجي","2أ ف01",null,null,null,"ثانية","آداب وفلسفة ",1,398,"E2",null,"قرية العقيد عباس - مغنية - ",null,null,null,null,null,null,{"$f":"IF($J401=\"\",\"\",MATCH($J401,OFFSET(BASE!$C$5,,,MAX(BASE!$B:$B)),0))","v":16},{"$f":"IF($AA401=\"\",\"\",60*($AA401-1)+COUNTIF($AA$9:$AA401,$AA401))","v":936},"E2",2,"E",null,"محمد ",null," محمد "]
[399," ",1000613270134000,null,null,"ذكر","2006-05-30","مغنية","نصف داخلي","2أ ف02",null,null,null,"ثانية","آداب وفلسفة ",2,399,"D1",null,"قرية البطيم-مغنية- ",null,null,null,null,null,null,{"$f":"IF($J402=\"\",\"\",MATCH($J402,OFFSET(BASE!$C$5,,,MAX(BASE!$B:$B)),0))","v":17},{"$f":"IF($AA402=\"\",\"\",60*($AA402-1)+COUNTIF($AA$9:$AA402,$AA402))","v":961},"D1",1,"D",null,"محمد ",null," محمد "]
[400," ",1100613270231900,null,null,"أنثى","2006-08-14","مغنية","نصف داخلي","2أ ف02",null,null,null,"ثانية","آداب وفلسفة ",2,400,"D2",null,"قرية البطيم-مغنية- ",null,null,null,null,null,null,{"$f":"IF($J403=\"\",\"\",MATCH($J403,OFFSET(BASE!$C$5,,,MAX(BASE!$B:$B)),0))","v":17},{"$f":"IF($AA403=\"\",\"\",60*($AA403-1)+COUNTIF($AA$9:$AA403,$AA403))","v":962},"D2",2,"D",null,"مصطفى ",null," مصطفى "]
[401," ",1000313270053500,null,null,"ذكر","2003-03-09","مغنية","نصف داخلي","2أ ف02",null,null,null,"ثانية","آداب وفلسفة ",2,401,"D1",null,"دوار المخاليف - مغنية -  ",null,null,null,null,null,null,{"$f":"IF($J404=\"\",\"\",MATCH($J404,OFFSET(BASE!$C$5,,,MAX(BASE!$B:$B)),0))","v":17},{"$f":"IF($AA404=\"\",\"\",60*($AA404-1)+COUNTIF($AA$9:$AA404,$AA404))","v":963},"D1",1,"D",null,"جمال ",null," جمال "]
[402," ",1100413270098600,null,null,"أنثى","2004-05-02","مغنية","نصف داخلي","2أ ف02",null,null,null,"ثانية","آداب وفلسفة ",2,402,"D2",null,"قرية البطيم ",null,null,null,null,null,null,{"$f":"IF($J405=\"\",\"\",MATCH($J405,OFFSET(BASE!$C$5,,,MAX(BASE!$B:$B)),0))","v":17},{"$f":"IF($AA405=\"\",\"\",60*($AA405-1)+COUNTIF($AA$9:$AA405,$AA405))","v":964},"D2",2,"D",null,"محمد ",null," محمد "]
[403," ",1000413270009800,null,null,"ذكر","2004-01-12","مغنية","نصف داخلي","2أ ف02",null,null,null,"ثانية","آداب وفلسفة ",2,403,"D1",null,"قرية البطيم مغنية ",null,null,null,null,null,null,{"$f":"IF($J406=\"\",\"\",MATCH($J406,OFFSET(BASE!$C$5,,,MAX(BASE!$B:$B)),0))","v":17},{"$f":"IF($AA406=\"\",\"\",60*($AA406-1)+COUNTIF($AA$9:$AA406,$AA406))","v":965},"D1",1,"D",null,"العيد ",null," العيد "]
[404," ",1100613270244000,null,null,"أنثى","2006-08-25","مغنية","نصف داخلي","2أ ف02",null,null,null,"ثانية","آداب وفلسفة ",2,404,"D2",null,"قرية المصامدة - مغنية - تلمسان ",null,null,null,null,null,null,{"$f":"IF($J407=\"\",\"\",MATCH($J407,OFFSET(BASE!$C$5,,,MAX(BASE!$B:$B)),0))","v":17},{"$f":"IF($AA407=\"\",\"\",60*($AA407-1)+COUNTIF($AA$9:$AA407,$AA407))","v":966},"D2",2,"D",null,"عبد الحفيظ ",null," عبد الحفيظ "]
[405," ",1000613270230300,null,null,"ذكر","2006-08-13","مغنية","نصف داخلي","2أ ف02",null,null,null,"ثانية","آداب وفلسفة ",2,405,"D1",null,"قرية المصامدة - مغنية - تلمسان ",null,null,null,null,null,null,{"$f":"IF($J408=\"\",\"\",MATCH($J408,OFFSET(BASE!$C$5,,,MAX(BASE!$B:$B)),0))","v":17},{"$f":"IF($AA408=\"\",\"\",60*($AA408-1)+COUNTIF($AA$9:$AA408,$AA408))","v":967},"D1",1,"D",null,"رشيد ",null," رشيد "]
[406," ",1100313270249000,null,null,"أنثى","2003-10-23","مغنية","نصف داخلي","2أ ف02",null,null,null,"ثانية","آداب وفلسفة ",2,406,"D2",null,"الجرابعة مغنية ",null,null,null,null,null,null,{"$f":"IF($J409=\"\",\"\",MATCH($J409,OFFSET(BASE!$C$5,,,MAX(BASE!$B:$B)),0))","v":17},{"$f":"IF($AA409=\"\",\"\",60*($AA409-1)+COUNTIF($AA$9:$AA409,$AA409))","v":968},"D2",2,"D",null,"حبيب ",null," حبيب "]
[407," ",1100413270351900,null,null,"أنثى","2004-12-23","مغنية","نصف داخلي","2أ ف02",null,null,null,"ثانية","آداب وفلسفة ",2,407,"D2",null,"قرية المصامدة  - مغنية -  ",null,null,null,null,null,null,{"$f":"IF($J410=\"\",\"\",MATCH($J410,OFFSET(BASE!$C$5,,,MAX(BASE!$B:$B)),0))","v":17},{"$f":"IF($AA410=\"\",\"\",60*($AA410-1)+COUNTIF($AA$9:$AA410,$AA410))","v":969},"D2",2,"D",null,"بوعمامة ",null," بوعمامة "]
[408," ",1100513270297600,null,null,"أنثى","2005-10-08","مغنية","نصف داخلي","2أ ف02",null,null,null,"ثانية","آداب وفلسفة ",2,408,"D2",null,"قرية المصامدة - مغنية - تلمسان ",null,null,null,null,null,null,{"$f":"IF($J411=\"\",\"\",MATCH($J411,OFFSET(BASE!$C$5,,,MAX(BASE!$B:$B)),0))","v":17},{"$f":"IF($AA411=\"\",\"\",60*($AA411-1)+COUNTIF($AA$9:$AA411,$AA411))","v":970},"D2",2,"D",null,"محمد ",null," محمد "]
[409," ",1000413270056300,null,null,"ذكر","2004-03-07","مغنية","نصف داخلي","2أ ف02",null,null,null,"ثانية","آداب وفلسفة ",2,409,"D1",null,"قرية البطيم مغنية ",null,null,null,null,null,null,{"$f":"IF($J412=\"\",\"\",MATCH($J412,OFFSET(BASE!$C$5,,,MAX(BASE!$B:$B)),0))","v":17},{"$f":"IF($AA412=\"\",\"\",60*($AA412-1)+COUNTIF($AA$9:$AA412,$AA412))","v":971},"D1",1,"D",null,"يزيد ",null," يزيد "]
[410," ",1100313270028100,null,null,"أنثى","2003-10-19","مغنية","نصف داخلي","2أ ف02",null,null,null,"ثانية","آداب وفلسفة ",2,410,"D2",null,"قرية أولاد الشارف  - مغنية ",null,null,null,null,null,null,{"$f":"IF($J413=\"\",\"\",MATCH($J413,OFFSET(BASE!$C$5,,,MAX(BASE!$B:$B)),0))","v":17},{"$f":"IF($AA413=\"\",\"\",60*($AA413-1)+COUNTIF($AA$9:$AA413,$AA413))","v":972},"D2",2,"D",null,"فتحي ",null," فتحي "]
[411," ",1100613270062700,null,null,"أنثى","2006-03-15","مغنية","نصف داخلي","2أ ف02",null,null,null,"ثانية","آداب وفلسفة ",2,411,"D2",null,"قرية أولاد الشارف عين العباس - مغنية - ",null,null,null,null,null,null,{"$f":"IF($J414=\"\",\"\",MATCH($J414,OFFSET(BASE!$C$5,,,MAX(BASE!$B:$B)),0))","v":17},{"$f":"IF($AA414=\"\",\"\",60*($AA414-1)+COUNTIF($AA$9:$AA414,$AA414))","v":973},"D2",2,"D",null,"محمد ",null," محمد "]
[412," ",1100513270258100,null,null,"أنثى","2005-09-01","مغنية","نصف داخلي","2أ ف02",null,null,null,"ثانية","آداب وفلسفة ",2,412,"D2",null,"مزرعة جابر - مغنية -  ",null,null,null,null,null,null,{"$f":"IF($J415=\"\",\"\",MATCH($J415,OFFSET(BASE!$C$5,,,MAX(BASE!$B:$B)),0))","v":17},{"$f":"IF($AA415=\"\",\"\",60*($AA415-1)+COUNTIF($AA$9:$AA415,$AA415))","v":974},"D2",2,"D",null,"هاشمي ",null," هاشمي "]
[413," ",1000513270087700,null,null,"ذكر","2005-04-18","مغنية","نصف داخلي","2أ ف02",null,null,null,"ثانية","آداب وفلسفة ",2,413,"D1",null,"قرية أولاد الشارف - مغنية -  ",null,null,null,null,null,null,{"$f":"IF($J416=\"\",\"\",MATCH($J416,OFFSET(BASE!$C$5,,,MAX(BASE!$B:$B)),0))","v":17},{"$f":"IF($AA416=\"\",\"\",60*($AA416-1)+COUNTIF($AA$9:$AA416,$AA416))","v":975},"D1",1,"D",null,"هاشمي ",null," هاشمي "]
[414," ",1100613270047800,null,null,"أنثى","2006-02-24","مغنية","نصف داخلي","2أ ف02",null,null,null,"ثانية","آداب وفلسفة ",2,414,"D2",null,"قرية المصامدة - مغنية - ",null,null,null,null,null,null,{"$f":"IF($J417=\"\",\"\",MATCH($J417,OFFSET(BASE!$C$5,,,MAX(BASE!$B:$B)),0))","v":17},{"$f":"IF($AA417=\"\",\"\",60*($AA417-1)+COUNTIF($AA$9:$AA417,$AA417))","v":976},"D2",2,"D",null,"محمد ",null," محمد "]
[415," ",1100413270180500,null,null,"أنثى","2004-07-13","مغنية","نصف داخلي","2أ ف02",null,null,null,"ثانية","آداب وفلسفة ",2,415,"D2",null,"قرية العقيد عباس مغنية ",null,null,null,null,null,null,{"$f":"IF($J418=\"\",\"\",MATCH($J418,OFFSET(BASE!$C$5,,,MAX(BASE!$B:$B)),0))","v":17},{"$f":"IF($AA418=\"\",\"\",60*($AA418-1)+COUNTIF($AA$9:$AA418,$AA418))","v":977},"D2",2,"D",null,"أحمد ",null," أحمد "]
[416," ",1100513270203700,null,null,"أنثى","2005-07-22","مغنية","نصف داخلي","2أ ف02",null,null,null,"ثانية","آداب وفلسفة ",2,416,"D2",null,"عمارة 3 رقم 1 حي أولاد بن دامو -مغنية - ",null,null,null,null,null,null,{"$f":"IF($J419=\"\",\"\",MATCH($J419,OFFSET(BASE!$C$5,,,MAX(BASE!$B:$B)),0))","v":17},{"$f":"IF($AA419=\"\",\"\",60*($AA419-1)+COUNTIF($AA$9:$AA419,$AA419))","v":978},"D2",2,"D",null," ",null,"  "]
[417," ",1000613270103300,null,null,"ذكر","2006-05-04","مغنية","نصف داخلي","2أ ف02",null,null,null,"ثانية","آداب وفلسفة ",2,417,"D1",null,"قرية العقيد عباس - مغنية - ",null,null,null,null,null,null,{"$f":"IF($J420=\"\",\"\",MATCH($J420,OFFSET(BASE!$C$5,,,MAX(BASE!$B:$B)),0))","v":17},{"$f":"IF($AA420=\"\",\"\",60*($AA420-1)+COUNTIF($AA$9:$AA420,$AA420))","v":979},"D1",1,"D",null,"بلخير ",null," بلخير "]
[418," ",1000413270308000,null,null,"ذكر","2004-11-09","مغنية","نصف داخلي","2أ ف02",null,null,null,"ثانية","آداب وفلسفة ",2,418,"D1",null,"قرية البطيم مغنية ",null,null,null,null,null,null,{"$f":"IF($J421=\"\",\"\",MATCH($J421,OFFSET(BASE!$C$5,,,MAX(BASE!$B:$B)),0))","v":17},{"$f":"IF($AA421=\"\",\"\",60*($AA421-1)+COUNTIF($AA$9:$AA421,$AA421))","v":980},"D1",1,"D",null,"أحمد ",null," أحمد "]
[419," ",1100613270122800,null,null,"أنثى","2006-05-22","مغنية","نصف داخلي","2أ ف02",null,null,null,"ثانية","آداب وفلسفة ",2,419,"D2",null,"مزرعة شعبان حمدون - مغنية -  ",null,null,null,null,null,null,{"$f":"IF($J422=\"\",\"\",MATCH($J422,OFFSET(BASE!$C$5,,,MAX(BASE!$B:$B)),0))","v":17},{"$f":"IF($AA422=\"\",\"\",60*($AA422-1)+COUNTIF($AA$9:$AA422,$AA422))","v":981},"D2",2,"D",null,"عمر ",null," عمر "]
[420," ",1100413270219700,null,null,"أنثى","2004-08-14","مغنية","نصف داخلي","2أ ف02",null,null,null,"ثانية","آداب وفلسفة ",2,420,"D2",null,"طريق الزوية ورشة الزيتون - مغنية- ",null,null,null,null,null,null,{"$f":"IF($J423=\"\",\"\",MATCH($J423,OFFSET(BASE!$C$5,,,MAX(BASE!$B:$B)),0))","v":17},{"$f":"IF($AA423=\"\",\"\",60*($AA423-1)+COUNTIF($AA$9:$AA423,$AA423))","v":982},"D2",2,"D",null,"محمد ",null," محمد "]
[421," ",1100531051323400,null,null,"أنثى","2005-10-18","السانية","نصف داخلي","2أ ف02",null,null,null,"ثانية","آداب وفلسفة ",2,421,"D2",null,"قرية العقيد عباس - مغنية - ",null,null,null,null,null,null,{"$f":"IF($J424=\"\",\"\",MATCH($J424,OFFSET(BASE!$C$5,,,MAX(BASE!$B:$B)),0))","v":17},{"$f":"IF($AA424=\"\",\"\",60*($AA424-1)+COUNTIF($AA$9:$AA424,$AA424))","v":983},"D2",2,"D",null,"محمد ",null," محمد "]
[422," ",1000713270125900,null,null,"ذكر","2007-05-19","مغنية","نصف داخلي","2أ ف02",null,null,null,"ثانية","آداب وفلسفة ",2,422,"D1",null,"حي المطمر ",null,null,null,null,null,null,{"$f":"IF($J425=\"\",\"\",MATCH($J425,OFFSET(BASE!$C$5,,,MAX(BASE!$B:$B)),0))","v":17},{"$f":"IF($AA425=\"\",\"\",60*($AA425-1)+COUNTIF($AA$9:$AA425,$AA425))","v":984},"D1",1,"D",null,"محمد ",null," محمد "]
[423," ",1000613270047100,null,null,"ذكر","2006-02-23","مغنية","نصف داخلي","2أ ف02",null,null,null,"ثانية","آداب وفلسفة ",2,423,"D1",null,"قرية البطيم مغنية ",null,null,null,null,null,null,{"$f":"IF($J426=\"\",\"\",MATCH($J426,OFFSET(BASE!$C$5,,,MAX(BASE!$B:$B)),0))","v":17},{"$f":"IF($AA426=\"\",\"\",60*($AA426-1)+COUNTIF($AA$9:$AA426,$AA426))","v":985},"D1",1,"D",null,"بن أعمر ",null," بن أعمر "]
[424," ",1100413270014300,null,null,"أنثى","2004-01-17","مغنية","خارجي","2أ ف02",null,null,null,"ثانية","آداب وفلسفة ",2,424,"E2",null,"محطة القطار  مغنية ",null,null,null,null,null,null,{"$f":"IF($J427=\"\",\"\",MATCH($J427,OFFSET(BASE!$C$5,,,MAX(BASE!$B:$B)),0))","v":17},{"$f":"IF($AA427=\"\",\"\",60*($AA427-1)+COUNTIF($AA$9:$AA427,$AA427))","v":986},"E2",2,"E",null,"واسيني ",null," واسيني "]
[425," ",1100513270238500,null,null,"أنثى","2005-08-17","مغنية","خارجي","2أ ف02",null,null,null,"ثانية","آداب وفلسفة ",2,426,"E2",null,"قرية البطيم مغنية ",null,null,null,null,null,null,{"$f":"IF($J428=\"\",\"\",MATCH($J428,OFFSET(BASE!$C$5,,,MAX(BASE!$B:$B)),0))","v":17},{"$f":"IF($AA428=\"\",\"\",60*($AA428-1)+COUNTIF($AA$9:$AA428,$AA428))","v":987},"E2",2,"E",null,"واسيني ",null," واسيني "]
[426," ",1000513270336000,null,null,"ذكر","2005-11-14","مغنية","خارجي","2أ ف02",null,null,null,"ثانية","آداب وفلسفة ",2,427,"E1",null,"رقم 18 حي الشهداء - مغنية -  ",null,null,null,null,null,null,{"$f":"IF($J429=\"\",\"\",MATCH($J429,OFFSET(BASE!$C$5,,,MAX(BASE!$B:$B)),0))","v":17},{"$f":"IF($AA429=\"\",\"\",60*($AA429-1)+COUNTIF($AA$9:$AA429,$AA429))","v":988},"E1",1,"E",null,"رشيد ",null," رشيد "]
[427," ",1000413270148400,null,null,"ذكر","2004-06-19","مغنية","خارجي","2أ ف02",null,null,null,"ثانية","آداب وفلسفة ",2,427,"E1",null,"اولاد قدور الصغار - مغنية ",null,null,null,null,null,null,{"$f":"IF($J430=\"\",\"\",MATCH($J430,OFFSET(BASE!$C$5,,,MAX(BASE!$B:$B)),0))","v":17},{"$f":"IF($AA430=\"\",\"\",60*($AA430-1)+COUNTIF($AA$9:$AA430,$AA430))","v":989},"E1",1,"E",null,"بلخير ",null," بلخير "]
[428," ",1100213270280500,null,null,"أنثى","2002-12-08","مغنية","خارجي","2أ ف02",null,null,null,"ثانية","آداب وفلسفة ",2,428,"E2",null,"مزرعة شعبان حمدون - مغنية -  ",null,null,null,null,null,null,{"$f":"IF($J431=\"\",\"\",MATCH($J431,OFFSET(BASE!$C$5,,,MAX(BASE!$B:$B)),0))","v":17},{"$f":"IF($AA431=\"\",\"\",60*($AA431-1)+COUNTIF($AA$9:$AA431,$AA431))","v":990},"E2",2,"E",null,"واسيني ",null," واسيني "]
[429," ",1100613270055900,null,null,"أنثى","2006-03-06","مغنية","خارجي","2أ ف02",null,null,null,"ثانية","آداب وفلسفة ",2,429,"E2",null,"مركز التكوين المهني شعبان حمدون - مغنية -  ",null,null,null,null,null,null,{"$f":"IF($J432=\"\",\"\",MATCH($J432,OFFSET(BASE!$C$5,,,MAX(BASE!$B:$B)),0))","v":17},{"$f":"IF($AA432=\"\",\"\",60*($AA432-1)+COUNTIF($AA$9:$AA432,$AA432))","v":991},"E2",2,"E",null,"عبد القادر ",null," عبد القادر "]
[430," ",1100613270113700,null,null,"أنثى","2006-05-13","مغنية","خارجي","2أ ف02",null,null,null,"ثانية","آداب وفلسفة ",2,430,"E2",null,"قرية البخاتة - مغنية - ",null,null,null,null,null,null,{"$f":"IF($J433=\"\",\"\",MATCH($J433,OFFSET(BASE!$C$5,,,MAX(BASE!$B:$B)),0))","v":17},{"$f":"IF($AA433=\"\",\"\",60*($AA433-1)+COUNTIF($AA$9:$AA433,$AA433))","v":992},"E2",2,"E",null,"مصطفى ",null," مصطفى "]
[431," ",1100613270181100,null,null,"أنثى","2006-07-03","مغنية","نصف داخلي","2لغات /إسبا",null,null,null,"ثانية","لغات أجنبية إسبانية",1,431,"D2",null,"قرية البطيم مغنية ",null,null,null,null,null,null,{"$f":"IF($J434=\"\",\"\",MATCH($J434,OFFSET(BASE!$C$5,,,MAX(BASE!$B:$B)),0))","v":18},{"$f":"IF($AA434=\"\",\"\",60*($AA434-1)+COUNTIF($AA$9:$AA434,$AA434))","v":1021},"D2",2,"D",null,"عبدالقادر ",null," عبدالقادر "]
[432," ",1000513270105100,null,null,"ذكر","2005-05-06","مغنية","نصف داخلي","2لغات /إسبا",null,null,null,"ثانية","لغات أجنبية إسبانية",1,432,"D1",null,"قرية العقيد عباس  - مغنية -  ",null,null,null,null,null,null,{"$f":"IF($J435=\"\",\"\",MATCH($J435,OFFSET(BASE!$C$5,,,MAX(BASE!$B:$B)),0))","v":18},{"$f":"IF($AA435=\"\",\"\",60*($AA435-1)+COUNTIF($AA$9:$AA435,$AA435))","v":1022},"D1",1,"D",null,"ادريس ",null," ادريس "]
[433," ",1100613270045000,null,null,"أنثى","2006-02-20","مغنية","نصف داخلي","2لغات /إسبا",null,null,null,"ثانية","لغات أجنبية إسبانية",1,433,"D2",null,"قرية البطيم مغنية ",null,null,null,null,null,null,{"$f":"IF($J436=\"\",\"\",MATCH($J436,OFFSET(BASE!$C$5,,,MAX(BASE!$B:$B)),0))","v":18},{"$f":"IF($AA436=\"\",\"\",60*($AA436-1)+COUNTIF($AA$9:$AA436,$AA436))","v":1023},"D2",2,"D",null,"عبدالحق ",null," عبدالحق "]
[434," ",1100613010696100,null,null,"أنثى","2006-09-13","تلمسان","نصف داخلي","2لغات /إسبا",null,null,null,"ثانية","لغات أجنبية إسبانية",1,434,"D2",null,"قرية البطيم-مغنية- ",null,null,null,null,null,null,{"$f":"IF($J437=\"\",\"\",MATCH($J437,OFFSET(BASE!$C$5,,,MAX(BASE!$B:$B)),0))","v":18},{"$f":"IF($AA437=\"\",\"\",60*($AA437-1)+COUNTIF($AA$9:$AA437,$AA437))","v":1024},"D2",2,"D",null,"عبد القادر ",null," عبد القادر "]
[435," ",1300613270257600,null,null,"أنثى","2006-09-06","مغنية","نصف داخلي","2لغات /إسبا",null,null,null,"ثانية","لغات أجنبية إسبانية",1,435,"D2",null,null,null,null,null,null,null,null,{"$f":"IF($J438=\"\",\"\",MATCH($J438,OFFSET(BASE!$C$5,,,MAX(BASE!$B:$B)),0))","v":18},{"$f":"IF($AA438=\"\",\"\",60*($AA438-1)+COUNTIF($AA$9:$AA438,$AA438))","v":1025},"D2",2,"D",null,null,null," "]
[436," ",1100413270073600,null,null,"أنثى","2004-03-30","مغنية","نصف داخلي","2لغات /إسبا",null,null,null,"ثانية","لغات أجنبية إسبانية",1,436,"D2",null,"قرية البطيم مغنية ",null,null,null,null,null,null,{"$f":"IF($J439=\"\",\"\",MATCH($J439,OFFSET(BASE!$C$5,,,MAX(BASE!$B:$B)),0))","v":18},{"$f":"IF($AA439=\"\",\"\",60*($AA439-1)+COUNTIF($AA$9:$AA439,$AA439))","v":1026},"D2",2,"D",null,"نورالدين ",null," نورالدين "]
[437," ",1100613270035800,null,null,"أنثى","2006-02-08","مغنية","نصف داخلي","2لغات /إسبا",null,null,null,"ثانية","لغات أجنبية إسبانية",1,437,"D2",null,"حي الشهداء - مغنية -  ",null,null,null,null,null,null,{"$f":"IF($J440=\"\",\"\",MATCH($J440,OFFSET(BASE!$C$5,,,MAX(BASE!$B:$B)),0))","v":18},{"$f":"IF($AA440=\"\",\"\",60*($AA440-1)+COUNTIF($AA$9:$AA440,$AA440))","v":1027},"D2",2,"D",null,"مصطفى ",null," مصطفى "]
[438," ",1000513270101000,null,null,"ذكر","2005-05-01","مغنية","نصف داخلي","2لغات /إسبا",null,null,null,"ثانية","لغات أجنبية إسبانية",1,438,"D1",null,"قرية العقيد عباس مغنية ",null,null,null,null,null,null,{"$f":"IF($J441=\"\",\"\",MATCH($J441,OFFSET(BASE!$C$5,,,MAX(BASE!$B:$B)),0))","v":18},{"$f":"IF($AA441=\"\",\"\",60*($AA441-1)+COUNTIF($AA$9:$AA441,$AA441))","v":1028},"D1",1,"D",null,"عبد الغني ",null," عبد الغني "]
[439," ",1000313270133100,null,null,"ذكر","2003-06-23","مغنية","نصف داخلي","2لغات /إسبا",null,null,null,"ثانية","لغات أجنبية إسبانية",1,439,"D1",null,"شارع 13 منزل 14 حي المقراني ",null,null,null,null,null,null,{"$f":"IF($J442=\"\",\"\",MATCH($J442,OFFSET(BASE!$C$5,,,MAX(BASE!$B:$B)),0))","v":18},{"$f":"IF($AA442=\"\",\"\",60*($AA442-1)+COUNTIF($AA$9:$AA442,$AA442))","v":1029},"D1",1,"D",null,"عبد الفتاح ",null," عبد الفتاح "]
[440," ",1100613270269400,null,null,"أنثى","2006-09-16","مغنية","نصف داخلي","2لغات /إسبا",null,null,null,"ثانية","لغات أجنبية إسبانية",1,440,"D2",null,"مزرعة هواري احمد - مغنية -  ",null,null,null,null,null,null,{"$f":"IF($J443=\"\",\"\",MATCH($J443,OFFSET(BASE!$C$5,,,MAX(BASE!$B:$B)),0))","v":18},{"$f":"IF($AA443=\"\",\"\",60*($AA443-1)+COUNTIF($AA$9:$AA443,$AA443))","v":1030},"D2",2,"D",null,"فريد ",null," فريد "]
[441," ",1100613270269200,null,null,"أنثى","2006-09-16","مغنية","خارجي","2لغات /إسبا",null,null,null,"ثانية","لغات أجنبية إسبانية",1,441,"E2",null,"رقم 10 حي الشهداء - مغنية -  ",null,null,null,null,null,null,{"$f":"IF($J444=\"\",\"\",MATCH($J444,OFFSET(BASE!$C$5,,,MAX(BASE!$B:$B)),0))","v":18},{"$f":"IF($AA444=\"\",\"\",60*($AA444-1)+COUNTIF($AA$9:$AA444,$AA444))","v":1031},"E2",2,"E",null,"رشيد ",null," رشيد "]
[442," ",1100613270170400,null,null,"أنثى","2006-06-26","مغنية","خارجي","2لغات /إسبا",null,null,null,"ثانية","لغات أجنبية إسبانية",1,442,"E2",null,"شارع 25 حي الشهداء  - مغنية - ",null,null,null,null,null,null,{"$f":"IF($J445=\"\",\"\",MATCH($J445,OFFSET(BASE!$C$5,,,MAX(BASE!$B:$B)),0))","v":18},{"$f":"IF($AA445=\"\",\"\",60*($AA445-1)+COUNTIF($AA$9:$AA445,$AA445))","v":1032},"E2",2,"E",null,"بوعمامة ",null," بوعمامة "]
[443," ",1000613350135100,null,null,"ذكر","2006-10-25","سبدو","خارجي","2لغات /إسبا",null,null,null,"ثانية","لغات أجنبية إسبانية",1,443,"E1",null,"حي العرابي علي سبدو تلمسان ",null,null,null,null,null,null,{"$f":"IF($J446=\"\",\"\",MATCH($J446,OFFSET(BASE!$C$5,,,MAX(BASE!$B:$B)),0))","v":18},{"$f":"IF($AA446=\"\",\"\",60*($AA446-1)+COUNTIF($AA$9:$AA446,$AA446))","v":1033},"E1",1,"E",null,"مامون ",null," مامون "]
[444," ",1000413270066600,null,null,"ذكر","2004-03-20","مغنية","خارجي","2لغات /إسبا",null,null,null,"ثانية","لغات أجنبية إسبانية",1,444,"E1",null,"19 حي الشهداء - مغنية -  ",null,null,null,null,null,null,{"$f":"IF($J447=\"\",\"\",MATCH($J447,OFFSET(BASE!$C$5,,,MAX(BASE!$B:$B)),0))","v":18},{"$f":"IF($AA447=\"\",\"\",60*($AA447-1)+COUNTIF($AA$9:$AA447,$AA447))","v":1034},"E1",1,"E",null,"لخضر ",null," لخضر "]
[445," ",1100613270012400,null,null,"أنثى","2006-01-13","مغنية","خارجي","2لغات /إسبا",null,null,null,"ثانية","لغات أجنبية إسبانية",1,445,"E2",null,"مزرعة شعبان حمدون - مغنية -  ",null,null,null,null,null,null,{"$f":"IF($J448=\"\",\"\",MATCH($J448,OFFSET(BASE!$C$5,,,MAX(BASE!$B:$B)),0))","v":18},{"$f":"IF($AA448=\"\",\"\",60*($AA448-1)+COUNTIF($AA$9:$AA448,$AA448))","v":1035},"E2",2,"E",null,"محمد ",null," محمد "]
[446," ",1100613270311200,null,null,"أنثى","2006-10-21","مغنية","خارجي","2لغات /إسبا",null,null,null,"ثانية","لغات أجنبية إسبانية",1,446,"E2",null,"تعاونية الحواس رقم 27 حي الشهداء - مغنية -  ",null,null,null,null,null,null,{"$f":"IF($J449=\"\",\"\",MATCH($J449,OFFSET(BASE!$C$5,,,MAX(BASE!$B:$B)),0))","v":18},{"$f":"IF($AA449=\"\",\"\",60*($AA449-1)+COUNTIF($AA$9:$AA449,$AA449))","v":1036},"E2",2,"E",null,"مصطفى ",null," مصطفى "]
[447," ",1100613270179600,null,null,"أنثى","2006-07-02","مغنية","خارجي","2لغات /إسبا",null,null,null,"ثانية","لغات أجنبية إسبانية",1,447,"E2",null,"سيدي مجاهد بني بوسعيد تلمسان ",null,null,null,null,null,null,{"$f":"IF($J450=\"\",\"\",MATCH($J450,OFFSET(BASE!$C$5,,,MAX(BASE!$B:$B)),0))","v":18},{"$f":"IF($AA450=\"\",\"\",60*($AA450-1)+COUNTIF($AA$9:$AA450,$AA450))","v":1037},"E2",2,"E",null,"رشيد ",null," رشيد "]
[448," ",1000713270167800,null,null,"ذكر","2007-06-22","مغنية","خارجي","2لغات /إسبا",null,null,null,"ثانية","لغات أجنبية إسبانية",1,448,"E1",null," ",null,null,null,null,null,null,{"$f":"IF($J451=\"\",\"\",MATCH($J451,OFFSET(BASE!$C$5,,,MAX(BASE!$B:$B)),0))","v":18},{"$f":"IF($AA451=\"\",\"\",60*($AA451-1)+COUNTIF($AA$9:$AA451,$AA451))","v":1038},"E1",1,"E",null,"حمدون ",null," حمدون "]
[449,{"$f":"D452& \" \" &E452","v":" "},1000813270005700,null,null,"ذكر","2008-01-09","مغنية","نصف داخلي","ج م ع تك01",null,null,null,"أولى","جدع مشترك علوم وتكنولوجيا ",1,449,"D1",null,"الطريق الوطني رقم 35 لكفاف - مغنية -  ",null,null,null,null,null,null,{"$f":"IF($J452=\"\",\"\",MATCH($J452,OFFSET(BASE!$C$5,,,MAX(BASE!$B:$B)),0))","v":19},{"$f":"IF($AA452=\"\",\"\",60*($AA452-1)+COUNTIF($AA$9:$AA452,$AA452))","v":1081},"D1",1,"D",null,"مصطفى ",null," مصطفى "]
[450," ",1100713270144800,null,null,"أنثى","2007-06-04","مغنية","نصف داخلي","ج م ع تك01",null,null,null,"أولى","جدع مشترك علوم وتكنولوجيا ",1,450,"D2",null,"قرية البطيم-مغنية- ",null,null,null,null,null,null,{"$f":"IF($J453=\"\",\"\",MATCH($J453,OFFSET(BASE!$C$5,,,MAX(BASE!$B:$B)),0))","v":19},{"$f":"IF($AA453=\"\",\"\",60*($AA453-1)+COUNTIF($AA$9:$AA453,$AA453))","v":1082},"D2",2,"D",null,"بن اعمر ",null," بن اعمر "]
[451," ",1000713270169500,null,null,"ذكر","2007-06-25","مغنية","نصف داخلي","ج م ع تك01",null,null,null,"أولى","جدع مشترك علوم وتكنولوجيا ",1,451,"D1",null,"قرية العقيد عباس مغنية ",null,null,null,null,null,null,{"$f":"IF($J454=\"\",\"\",MATCH($J454,OFFSET(BASE!$C$5,,,MAX(BASE!$B:$B)),0))","v":19},{"$f":"IF($AA454=\"\",\"\",60*($AA454-1)+COUNTIF($AA$9:$AA454,$AA454))","v":1083},"D1",1,"D",null,"بلخير ",null," بلخير "]
[452," ",1100613270168100,null,null,"أنثى","2006-06-24","مغنية","نصف داخلي","ج م ع تك01",null,null,null,"أولى","جدع مشترك علوم وتكنولوجيا ",1,452,"D2",null,"قرية البطيم ",null,null,null,null,null,null,{"$f":"IF($J455=\"\",\"\",MATCH($J455,OFFSET(BASE!$C$5,,,MAX(BASE!$B:$B)),0))","v":19},{"$f":"IF($AA455=\"\",\"\",60*($AA455-1)+COUNTIF($AA$9:$AA455,$AA455))","v":1084},"D2",2,"D",null,"رشيد ",null," رشيد "]
[453," ",1100713270045100,null,null,"أنثى","2007-02-20","مغنية","نصف داخلي","ج م ع تك01",null,null,null,"أولى","جدع مشترك علوم وتكنولوجيا ",1,453,"D2",null,"اولاد معيذر ",null,null,null,null,null,null,{"$f":"IF($J456=\"\",\"\",MATCH($J456,OFFSET(BASE!$C$5,,,MAX(BASE!$B:$B)),0))","v":19},{"$f":"IF($AA456=\"\",\"\",60*($AA456-1)+COUNTIF($AA$9:$AA456,$AA456))","v":1085},"D2",2,"D",null,"ميلود ",null," ميلود "]
[454," ",1100813270014700,null,null,"أنثى","2008-01-19","مغنية","نصف داخلي","ج م ع تك01",null,null,null,"أولى","جدع مشترك علوم وتكنولوجيا ",1,454,"D2",null,"رقم 30 حي الشهداء - مغنية - ",null,null,null,null,null,null,{"$f":"IF($J457=\"\",\"\",MATCH($J457,OFFSET(BASE!$C$5,,,MAX(BASE!$B:$B)),0))","v":19},{"$f":"IF($AA457=\"\",\"\",60*($AA457-1)+COUNTIF($AA$9:$AA457,$AA457))","v":1086},"D2",2,"D",null,"كمال ",null,{"$f":"D457 & \" \" & AG457","v":" كمال "}]
[455," ",1100813270048100,null,null,"أنثى","2008-03-06","مغنية","نصف داخلي","ج م ع تك01",null,null,null,"أولى","جدع مشترك علوم وتكنولوجيا ",1,455,"D2",null,"قرية البطيم-مغنية- ",null,null,null,null,null,null,{"$f":"IF($J458=\"\",\"\",MATCH($J458,OFFSET(BASE!$C$5,,,MAX(BASE!$B:$B)),0))","v":19},{"$f":"IF($AA458=\"\",\"\",60*($AA458-1)+COUNTIF($AA$9:$AA458,$AA458))","v":1087},{"$f":"AE458&AD458","v":"D2"},{"$f":"IF(F458=\"أنثى\",2,1)","v":2},{"$f":"IF(I458=\"نصف داخلي\",\"D\",\"E\")","v":"D"},null,"الشيخ ",null," الشيخ "]
[456," ",1000713270118300,null,null,"ذكر","2007-05-11","مغنية","نصف داخلي","ج م ع تك01",null,null,null,"أولى","جدع مشترك علوم وتكنولوجيا ",1,456,"D1",null,"قرية المصامدة - مغنية - تلمسان ",null,null,null,null,null,null,{"$f":"IF($J459=\"\",\"\",MATCH($J459,OFFSET(BASE!$C$5,,,MAX(BASE!$B:$B)),0))","v":19},{"$f":"IF($AA459=\"\",\"\",60*($AA459-1)+COUNTIF($AA$9:$AA459,$AA459))","v":1088},"D1",1,"D",null,"العيد ",null," العيد "]
[457," ",1000813270024700,null,null,"ذكر","2008-02-01","مغنية","نصف داخلي","ج م ع تك01",null,null,null,"أولى","جدع مشترك علوم وتكنولوجيا ",1,457,"D1",null,"قرية العقيد لطفي ",null,null,null,null,null,null,{"$f":"IF($J460=\"\",\"\",MATCH($J460,OFFSET(BASE!$C$5,,,MAX(BASE!$B:$B)),0))","v":19},{"$f":"IF($AA460=\"\",\"\",60*($AA460-1)+COUNTIF($AA$9:$AA460,$AA460))","v":1089},"D1",1,"D",null,"عمر ",null," عمر "]
[458," ",1000713270227800,null,null,"ذكر","2007-08-14","مغنية","نصف داخلي","ج م ع تك01",null,null,null,"أولى","جدع مشترك علوم وتكنولوجيا ",1,458,"D1",null,"أولاد الشارف مغنية - ",null,null,null,null,null,null,{"$f":"IF($J461=\"\",\"\",MATCH($J461,OFFSET(BASE!$C$5,,,MAX(BASE!$B:$B)),0))","v":19},{"$f":"IF($AA461=\"\",\"\",60*($AA461-1)+COUNTIF($AA$9:$AA461,$AA461))","v":1090},"D1",1,"D",null,"محمد ",null," محمد "]
[459," ",1000613270240300,null,null,"ذكر","2006-04-14","تلمسان","نصف داخلي","ج م ع تك01",null,null,null,"أولى","جدع مشترك علوم وتكنولوجيا ",1,459,"D1",null,"قرية المصامدة  -مغنية- ",null,null,null,null,null,null,{"$f":"IF($J462=\"\",\"\",MATCH($J462,OFFSET(BASE!$C$5,,,MAX(BASE!$B:$B)),0))","v":19},{"$f":"IF($AA462=\"\",\"\",60*($AA462-1)+COUNTIF($AA$9:$AA462,$AA462))","v":1091},"D1",1,"D",null,"لخضر ",null," لخضر "]
[460," ",1000713270113600,null,null,"ذكر","2007-05-07","مغنية","نصف داخلي","ج م ع تك01",null,null,null,"أولى","جدع مشترك علوم وتكنولوجيا ",1,460,"D1",null,"قرية المصامدة - مغنية - تلمسان ",null,null,null,null,null,null,{"$f":"IF($J463=\"\",\"\",MATCH($J463,OFFSET(BASE!$C$5,,,MAX(BASE!$B:$B)),0))","v":19},{"$f":"IF($AA463=\"\",\"\",60*($AA463-1)+COUNTIF($AA$9:$AA463,$AA463))","v":1092},"D1",1,"D",null,"جمال ",null," جمال "]
[461," ",1000613270191800,null,null,"ذكر","2006-07-12","مغنية","نصف داخلي","ج م ع تك01",null,null,null,"أولى","جدع مشترك علوم وتكنولوجيا ",1,461,"D1",null,"قرية البطيم مغنية ",null,null,null,null,null,null,{"$f":"IF($J464=\"\",\"\",MATCH($J464,OFFSET(BASE!$C$5,,,MAX(BASE!$B:$B)),0))","v":19},{"$f":"IF($AA464=\"\",\"\",60*($AA464-1)+COUNTIF($AA$9:$AA464,$AA464))","v":1093},"D1",1,"D",null,"أحمد ",null," أحمد "]
[462," ",1000513270294100,null,null,"ذكر","2005-10-04","مغنية","نصف داخلي","ج م ع تك01",null,null,null,"أولى","جدع مشترك علوم وتكنولوجيا ",1,462,"D1",null,"قرية المصامدة - مغنية - تلمسان ",null,null,null,null,null,null,{"$f":"IF($J465=\"\",\"\",MATCH($J465,OFFSET(BASE!$C$5,,,MAX(BASE!$B:$B)),0))","v":19},{"$f":"IF($AA465=\"\",\"\",60*($AA465-1)+COUNTIF($AA$9:$AA465,$AA465))","v":1094},"D1",1,"D",null,"محمد ",null," محمد "]
[463," ",1100713270176900,null,null,"أنثى","2007-07-01","مغنية","نصف داخلي","ج م ع تك01",null,null,null,"أولى","جدع مشترك علوم وتكنولوجيا ",1,463,"D2",null," ",null,null,null,null,null,null,{"$f":"IF($J466=\"\",\"\",MATCH($J466,OFFSET(BASE!$C$5,,,MAX(BASE!$B:$B)),0))","v":19},{"$f":"IF($AA466=\"\",\"\",60*($AA466-1)+COUNTIF($AA$9:$AA466,$AA466))","v":1095},"D2",2,"D",null,"قدور ",null," قدور "]
[464," ",1100713270011000,null,null,"أنثى","2007-01-11","مغنية","نصف داخلي","ج م ع تك01",null,null,null,"أولى","جدع مشترك علوم وتكنولوجيا ",1,464,"D2",null,"07 طريق الزوية حي الشهداء - مغنية -  ",null,null,null,null,null,null,{"$f":"IF($J467=\"\",\"\",MATCH($J467,OFFSET(BASE!$C$5,,,MAX(BASE!$B:$B)),0))","v":19},{"$f":"IF($AA467=\"\",\"\",60*($AA467-1)+COUNTIF($AA$9:$AA467,$AA467))","v":1096},"D2",2,"D",null,"عبد السلام ",null," عبد السلام "]
[465," ",1100720010220100,null,null,"أنثى","2007-05-15","سعيدة","نصف داخلي","ج م ع تك01",null,null,null,"أولى","جدع مشترك علوم وتكنولوجيا ",1,465,"D2",null,"قرية المصامدة - مغنية - تلمسان ",null,null,null,null,null,null,{"$f":"IF($J468=\"\",\"\",MATCH($J468,OFFSET(BASE!$C$5,,,MAX(BASE!$B:$B)),0))","v":19},{"$f":"IF($AA468=\"\",\"\",60*($AA468-1)+COUNTIF($AA$9:$AA468,$AA468))","v":1097},"D2",2,"D",null,"محمد ",null," محمد "]
[466," ",1100713270353400,null,null,"أنثى","2007-12-16","مغنية","نصف داخلي","ج م ع تك01",null,null,null,"أولى","جدع مشترك علوم وتكنولوجيا ",1,466,"D2",null,"قرية العقيد عباس  - مغنية -  ",null,null,null,null,null,null,{"$f":"IF($J469=\"\",\"\",MATCH($J469,OFFSET(BASE!$C$5,,,MAX(BASE!$B:$B)),0))","v":19},{"$f":"IF($AA469=\"\",\"\",60*($AA469-1)+COUNTIF($AA$9:$AA469,$AA469))","v":1098},"D2",2,"D",null,"أحمد ",null," أحمد "]
[467," ",1100713270067800,null,null,"أنثى","2007-03-19","مغنية","نصف داخلي","ج م ع تك01",null,null,null,"أولى","جدع مشترك علوم وتكنولوجيا ",1,467,"D2",null,"قرية البطيم مغنية ",null,null,null,null,null,null,{"$f":"IF($J470=\"\",\"\",MATCH($J470,OFFSET(BASE!$C$5,,,MAX(BASE!$B:$B)),0))","v":19},{"$f":"IF($AA470=\"\",\"\",60*($AA470-1)+COUNTIF($AA$9:$AA470,$AA470))","v":1099},"D2",2,"D",null,"واسيني ",null," واسيني "]
[468," ",1100713270092400,null,null,"أنثى","2007-04-15","مغنية","نصف داخلي","ج م ع تك01",null,null,null,"أولى","جدع مشترك علوم وتكنولوجيا ",1,468,"D2",null,"قرية البطيم-مغنية- ",null,null,null,null,null,null,{"$f":"IF($J471=\"\",\"\",MATCH($J471,OFFSET(BASE!$C$5,,,MAX(BASE!$B:$B)),0))","v":19},{"$f":"IF($AA471=\"\",\"\",60*($AA471-1)+COUNTIF($AA$9:$AA471,$AA471))","v":1100},"D2",2,"D",null,"علي ",null," علي "]
[469," ",1000713011024300,null,null,"ذكر","2007-12-21","تلمسان","نصف داخلي","ج م ع تك01",null,null,null,"أولى","جدع مشترك علوم وتكنولوجيا ",1,469,"D1",null,"أولاد الشارف مغنية  ",null,null,null,null,null,null,{"$f":"IF($J472=\"\",\"\",MATCH($J472,OFFSET(BASE!$C$5,,,MAX(BASE!$B:$B)),0))","v":19},{"$f":"IF($AA472=\"\",\"\",60*($AA472-1)+COUNTIF($AA$9:$AA472,$AA472))","v":1101},"D1",1,"D",null,"رشيد ",null," رشيد "]
[470," ",1000713011024200,null,null,"ذكر","2007-12-21","تلمسان","نصف داخلي","ج م ع تك01",null,null,null,"أولى","جدع مشترك علوم وتكنولوجيا ",1,470,"D1",null,"أولاد الشارف مغنية ",null,null,null,null,null,null,{"$f":"IF($J473=\"\",\"\",MATCH($J473,OFFSET(BASE!$C$5,,,MAX(BASE!$B:$B)),0))","v":19},{"$f":"IF($AA473=\"\",\"\",60*($AA473-1)+COUNTIF($AA$9:$AA473,$AA473))","v":1102},"D1",1,"D",null,"رشيد ",null," رشيد "]
[471," ",1000713270018700,null,null,"ذكر","2007-01-19","مغنية","نصف داخلي","ج م ع تك01",null,null,null,"أولى","جدع مشترك علوم وتكنولوجيا ",1,471,"D1",null,"قرية البطيم-مغنية- ",null,null,null,null,null,null,{"$f":"IF($J474=\"\",\"\",MATCH($J474,OFFSET(BASE!$C$5,,,MAX(BASE!$B:$B)),0))","v":19},{"$f":"IF($AA474=\"\",\"\",60*($AA474-1)+COUNTIF($AA$9:$AA474,$AA474))","v":1103},"D1",1,"D",null,"محمد ",null," محمد "]
[472," ",1000713270218100,null,null,"ذكر","2007-05-20","مغنية","نصف داخلي","ج م ع تك01",null,null,null,"أولى","جدع مشترك علوم وتكنولوجيا ",1,472,"D1",null,"مزرعة شعبان حمدون مغنية ",null,null,null,null,null,null,{"$f":"IF($J475=\"\",\"\",MATCH($J475,OFFSET(BASE!$C$5,,,MAX(BASE!$B:$B)),0))","v":19},{"$f":"IF($AA475=\"\",\"\",60*($AA475-1)+COUNTIF($AA$9:$AA475,$AA475))","v":1104},"D1",1,"D",null,"حبيب ",null," حبيب "]
[473," ",1100713010707400,null,null,"أنثى","2007-08-30","تلمسان","نصف داخلي","ج م ع تك01",null,null,null,"أولى","جدع مشترك علوم وتكنولوجيا ",1,473,"D2",null,"قرية البطيم-مغنية- ",null,null,null,null,null,null,{"$f":"IF($J476=\"\",\"\",MATCH($J476,OFFSET(BASE!$C$5,,,MAX(BASE!$B:$B)),0))","v":19},{"$f":"IF($AA476=\"\",\"\",60*($AA476-1)+COUNTIF($AA$9:$AA476,$AA476))","v":1105},"D2",2,"D",null,"واسيني ",null," واسيني "]
[474," ",1000513270117400,null,null,"ذكر","2005-05-19","مغنية","خارجي","ج م ع تك01",null,null,null,"أولى","جدع مشترك علوم وتكنولوجيا ",1,474,"E1",null,"قرية اولاد قدور ",null,null,null,null,null,null,{"$f":"IF($J477=\"\",\"\",MATCH($J477,OFFSET(BASE!$C$5,,,MAX(BASE!$B:$B)),0))","v":19},{"$f":"IF($AA477=\"\",\"\",60*($AA477-1)+COUNTIF($AA$9:$AA477,$AA477))","v":1106},"E1",1,"E",null,"لحسن ",null," لحسن "]
[475," ",1000713270177900,null,null,"ذكر","2007-07-01","مغنية","خارجي","ج م ع تك01",null,null,null,"أولى","جدع مشترك علوم وتكنولوجيا ",1,475,"E1",null,"حي الشهداء - مغنية -  ",null,null,null,null,null,null,{"$f":"IF($J478=\"\",\"\",MATCH($J478,OFFSET(BASE!$C$5,,,MAX(BASE!$B:$B)),0))","v":19},{"$f":"IF($AA478=\"\",\"\",60*($AA478-1)+COUNTIF($AA$9:$AA478,$AA478))","v":1107},"E1",1,"E",null,"ميلود ",null," ميلود "]
[476," ",1000713270177800,null,null,"ذكر","2007-07-01","مغنية","خارجي","ج م ع تك01",null,null,null,"أولى","جدع مشترك علوم وتكنولوجيا ",1,476,"E1",null,"حي الشهداء - مغنية -  ",null,null,null,null,null,null,{"$f":"IF($J479=\"\",\"\",MATCH($J479,OFFSET(BASE!$C$5,,,MAX(BASE!$B:$B)),0))","v":19},{"$f":"IF($AA479=\"\",\"\",60*($AA479-1)+COUNTIF($AA$9:$AA479,$AA479))","v":1108},"E1",1,"E",null,"ميلود ",null," ميلود "]
[477," ",1000713270011500,null,null,"ذكر","2007-01-12","مغنية","خارجي","ج م ع تك01",null,null,null,"أولى","جدع مشترك علوم وتكنولوجيا ",1,477,"E1",null,"حي الشهداء - مغنية -  ",null,null,null,null,null,null,{"$f":"IF($J480=\"\",\"\",MATCH($J480,OFFSET(BASE!$C$5,,,MAX(BASE!$B:$B)),0))","v":19},{"$f":"IF($AA480=\"\",\"\",60*($AA480-1)+COUNTIF($AA$9:$AA480,$AA480))","v":1109},"E1",1,"E",null,"عبد اللطيف ",null," عبد اللطيف "]
[478," ",1100713270501900,null,null,"أنثى","2007-11-26","مغنية","خارجي","ج م ع تك01",null,null,null,"أولى","جدع مشترك علوم وتكنولوجيا ",1,478,"E2",null,"رقم 01 حي الشهداء - مغنية -  ",null,null,null,null,null,null,{"$f":"IF($J481=\"\",\"\",MATCH($J481,OFFSET(BASE!$C$5,,,MAX(BASE!$B:$B)),0))","v":19},{"$f":"IF($AA481=\"\",\"\",60*($AA481-1)+COUNTIF($AA$9:$AA481,$AA481))","v":1110},"E2",2,"E",null,"احمد ",null," احمد "]
[479," ",1000705420159100,null,null,"ذكر","2007-06-23","بريكة","خارجي","ج م ع تك01",null,null,null,"أولى","جدع مشترك علوم وتكنولوجيا ",1,479,"E1",null,"قرية المصامدة - مغنية - تلمسان ",null,null,null,null,null,null,{"$f":"IF($J482=\"\",\"\",MATCH($J482,OFFSET(BASE!$C$5,,,MAX(BASE!$B:$B)),0))","v":19},{"$f":"IF($AA482=\"\",\"\",60*($AA482-1)+COUNTIF($AA$9:$AA482,$AA482))","v":1111},"E1",1,"E",null,"جمال ",null," جمال "]
[480," ",1100813270045300,null,null,"أنثى","2008-03-02","مغنية","خارجي","ج م ع تك01",null,null,null,"أولى","جدع مشترك علوم وتكنولوجيا ",1,480,"E2",null,"رقم 02 حي الشهداء  -  مغنية  - ",null,null,null,null,null,null,{"$f":"IF($J483=\"\",\"\",MATCH($J483,OFFSET(BASE!$C$5,,,MAX(BASE!$B:$B)),0))","v":19},{"$f":"IF($AA483=\"\",\"\",60*($AA483-1)+COUNTIF($AA$9:$AA483,$AA483))","v":1112},"E2",2,"E",null,"احمد ",null," احمد "]
[481," ",1000613270366800,null,null,"ذكر","2006-12-16","مغنية","خارجي","ج م ع تك01",null,null,null,"أولى","جدع مشترك علوم وتكنولوجيا ",1,481,"E1",null,"شارع 25 منزل رقم 04 حي الشهداء - مغنية - ",null,null,null,null,null,null,{"$f":"IF($J484=\"\",\"\",MATCH($J484,OFFSET(BASE!$C$5,,,MAX(BASE!$B:$B)),0))","v":19},{"$f":"IF($AA484=\"\",\"\",60*($AA484-1)+COUNTIF($AA$9:$AA484,$AA484))","v":1113},"E1",1,"E",null,"محمد ",null," محمد "]
[482," ",1100713270142400,null,null,"أنثى","2007-06-02","مغنية","خارجي","ج م ع تك01",null,null,null,"أولى","جدع مشترك علوم وتكنولوجيا ",1,482,"E2",null," ",null,null,null,null,null,null,{"$f":"IF($J485=\"\",\"\",MATCH($J485,OFFSET(BASE!$C$5,,,MAX(BASE!$B:$B)),0))","v":19},{"$f":"IF($AA485=\"\",\"\",60*($AA485-1)+COUNTIF($AA$9:$AA485,$AA485))","v":1114},"E2",2,"E",null,"واسيني ",null," واسيني "]
[483," ",1100613270269100,null,null,"أنثى","2006-09-15","مغنية","خارجي","ج م ع تك01",null,null,null,"أولى","جدع مشترك علوم وتكنولوجيا ",1,483,"E2",null,"قرية البطيم مغنية ",null,null,null,null,null,null,{"$f":"IF($J486=\"\",\"\",MATCH($J486,OFFSET(BASE!$C$5,,,MAX(BASE!$B:$B)),0))","v":19},{"$f":"IF($AA486=\"\",\"\",60*($AA486-1)+COUNTIF($AA$9:$AA486,$AA486))","v":1115},"E2",2,"E",null,"مصطفى ",null," مصطفى "]
[484," ",1100713270104000,null,null,"أنثى","2007-04-26","مغنية","نصف داخلي","ج م ع تك02",null,null,null,"أولى","جدع مشترك علوم وتكنولوجيا ",2,484,"D2",null,"أولاد زيان العقيد لطفي ",null,null,null,null,null,null,{"$f":"IF($J487=\"\",\"\",MATCH($J487,OFFSET(BASE!$C$5,,,MAX(BASE!$B:$B)),0))","v":20},{"$f":"IF($AA487=\"\",\"\",60*($AA487-1)+COUNTIF($AA$9:$AA487,$AA487))","v":1141},"D2",2,"D",null,"عكاشة ",null," عكاشة "]
[485," ",1000613270254200,null,null,"ذكر","2006-09-03","مغنية","نصف داخلي","ج م ع تك02",null,null,null,"أولى","جدع مشترك علوم وتكنولوجيا ",2,485,"D1",null,"قرية العقيد عباس - مغنية -  ",null,null,null,null,null,null,{"$f":"IF($J488=\"\",\"\",MATCH($J488,OFFSET(BASE!$C$5,,,MAX(BASE!$B:$B)),0))","v":20},{"$f":"IF($AA488=\"\",\"\",60*($AA488-1)+COUNTIF($AA$9:$AA488,$AA488))","v":1142},"D1",1,"D",null,"محمد ",null," محمد "]
[486," ",1000713270217600,null,null,"ذكر","2007-08-04","مغنية","نصف داخلي","ج م ع تك02",null,null,null,"أولى","جدع مشترك علوم وتكنولوجيا ",2,486,"D1",null,"قرية العقيد عباس  - مغنية -  ",null,null,null,null,null,null,{"$f":"IF($J489=\"\",\"\",MATCH($J489,OFFSET(BASE!$C$5,,,MAX(BASE!$B:$B)),0))","v":20},{"$f":"IF($AA489=\"\",\"\",60*($AA489-1)+COUNTIF($AA$9:$AA489,$AA489))","v":1143},"D1",1,"D",null,"ميلود ",null," ميلود "]
[487," ",1100713270329800,null,null,"أنثى","2007-11-24","مغنية","نصف داخلي","ج م ع تك02",null,null,null,"أولى","جدع مشترك علوم وتكنولوجيا ",2,487,"D2",null,"قرية المصامدة - مغنية -  ",null,null,null,null,"D1",null,{"$f":"IF($J490=\"\",\"\",MATCH($J490,OFFSET(BASE!$C$5,,,MAX(BASE!$B:$B)),0))","v":20},{"$f":"IF($AA490=\"\",\"\",60*($AA490-1)+COUNTIF($AA$9:$AA490,$AA490))","v":1144},"D2",2,"D",null,"حسين ",null," حسين "]
[488," ",1100713270193100,null,null,"أنثى","2007-07-16","مغنية","نصف داخلي","ج م ع تك02",null,null,null,"أولى","جدع مشترك علوم وتكنولوجيا ",2,488,"D2",null,"اولاد معيدر ",null,null,null,null,null,null,{"$f":"IF($J491=\"\",\"\",MATCH($J491,OFFSET(BASE!$C$5,,,MAX(BASE!$B:$B)),0))","v":20},{"$f":"IF($AA491=\"\",\"\",60*($AA491-1)+COUNTIF($AA$9:$AA491,$AA491))","v":1145},"D2",2,"D",null,"عبد القادر ",null," عبد القادر "]
[489," ",1100713010715500,null,null,"أنثى","2007-09-02","تلمسان","نصف داخلي","ج م ع تك02",null,null,null,"أولى","جدع مشترك علوم وتكنولوجيا ",2,489,"D2",null,"قرية البطيم-مغنية- ",null,null,null,null,null,null,{"$f":"IF($J492=\"\",\"\",MATCH($J492,OFFSET(BASE!$C$5,,,MAX(BASE!$B:$B)),0))","v":20},{"$f":"IF($AA492=\"\",\"\",60*($AA492-1)+COUNTIF($AA$9:$AA492,$AA492))","v":1146},"D2",2,"D",null,"بن اعمر ",null," بن اعمر "]
[490," ",1000713270216000,null,null,"ذكر","2007-08-04","مغنية","نصف داخلي","ج م ع تك02",null,null,null,"أولى","جدع مشترك علوم وتكنولوجيا ",2,490,"D1",null,"قرية العقيد لطفي ",null,null,null,null,null,null,{"$f":"IF($J493=\"\",\"\",MATCH($J493,OFFSET(BASE!$C$5,,,MAX(BASE!$B:$B)),0))","v":20},{"$f":"IF($AA493=\"\",\"\",60*($AA493-1)+COUNTIF($AA$9:$AA493,$AA493))","v":1147},"D1",1,"D",null,"بن اعمر ",null," بن اعمر "]
[491," ",1000613010032400,null,null,"ذكر","2006-01-13","تلمسان","نصف داخلي","ج م ع تك02",null,null,null,"أولى","جدع مشترك علوم وتكنولوجيا ",2,491,"D1",null,"قرية البطيم مغنية ",null,null,null,null,null,null,{"$f":"IF($J494=\"\",\"\",MATCH($J494,OFFSET(BASE!$C$5,,,MAX(BASE!$B:$B)),0))","v":20},{"$f":"IF($AA494=\"\",\"\",60*($AA494-1)+COUNTIF($AA$9:$AA494,$AA494))","v":1148},"D1",1,"D",null,"رشيد ",null," رشيد "]
[492," ",1100713070061300,null,null,"أنثى","2007-07-23","الغزوات","نصف داخلي","ج م ع تك02",null,null,null,"أولى","جدع مشترك علوم وتكنولوجيا ",2,492,"D2",null,"قرية المصامدة - مغنية - تلمسان ",null,null,null,null,null,null,{"$f":"IF($J495=\"\",\"\",MATCH($J495,OFFSET(BASE!$C$5,,,MAX(BASE!$B:$B)),0))","v":20},{"$f":"IF($AA495=\"\",\"\",60*($AA495-1)+COUNTIF($AA$9:$AA495,$AA495))","v":1149},"D2",2,"D",null,"محمد ",null," محمد "]
[493," ",1100713010898000,null,null,"أنثى","2007-11-03","تلمسان","نصف داخلي","ج م ع تك02",null,null,null,"أولى","جدع مشترك علوم وتكنولوجيا ",2,493,"D2",null,"قرية المصامدة - مغنية - تلمسان ",null,null,null,null,null,null,{"$f":"IF($J496=\"\",\"\",MATCH($J496,OFFSET(BASE!$C$5,,,MAX(BASE!$B:$B)),0))","v":20},{"$f":"IF($AA496=\"\",\"\",60*($AA496-1)+COUNTIF($AA$9:$AA496,$AA496))","v":1150},"D2",2,"D",null,"محمد ",null," محمد "]
[494," ",1100613270327300,null,null,"أنثى","2006-11-03","مغنية","نصف داخلي","ج م ع تك02",null,null,null,"أولى","جدع مشترك علوم وتكنولوجيا ",2,494,"D2",null,"قرية العقيد عباس - مغنية -  ",null,null,null,null,null,null,{"$f":"IF($J497=\"\",\"\",MATCH($J497,OFFSET(BASE!$C$5,,,MAX(BASE!$B:$B)),0))","v":20},{"$f":"IF($AA497=\"\",\"\",60*($AA497-1)+COUNTIF($AA$9:$AA497,$AA497))","v":1151},"D2",2,"D",null,"عبد الله ",null," عبد الله "]
[495," ",1100713270034100,null,null,"أنثى","2007-02-06","مغنية","نصف داخلي","ج م ع تك02",null,null,null,"أولى","جدع مشترك علوم وتكنولوجيا ",2,495,"D2",null,"قرية البطيم ",null,null,null,null,null,null,{"$f":"IF($J498=\"\",\"\",MATCH($J498,OFFSET(BASE!$C$5,,,MAX(BASE!$B:$B)),0))","v":20},{"$f":"IF($AA498=\"\",\"\",60*($AA498-1)+COUNTIF($AA$9:$AA498,$AA498))","v":1152},"D2",2,"D",null,"محمد ",null," محمد "]
[496," ",1000713270333300,null,null,"ذكر","2007-11-26","مغنية","نصف داخلي","ج م ع تك02",null,null,null,"أولى","جدع مشترك علوم وتكنولوجيا ",2,496,"D1",null,"قرية أولاد الشارف -  مغنية - ",null,null,null,null,null,null,{"$f":"IF($J499=\"\",\"\",MATCH($J499,OFFSET(BASE!$C$5,,,MAX(BASE!$B:$B)),0))","v":20},{"$f":"IF($AA499=\"\",\"\",60*($AA499-1)+COUNTIF($AA$9:$AA499,$AA499))","v":1153},"D1",1,"D",null,"محمد ",null," محمد "]
[497," ",1100713270324100,null,null,"أنثى","2007-11-15","مغنية","نصف داخلي","ج م ع تك02",null,null,null,"أولى","جدع مشترك علوم وتكنولوجيا ",2,497,"D2",null,"اولاد الشارف مغنية ",null,null,null,null,null,null,{"$f":"IF($J500=\"\",\"\",MATCH($J500,OFFSET(BASE!$C$5,,,MAX(BASE!$B:$B)),0))","v":20},{"$f":"IF($AA500=\"\",\"\",60*($AA500-1)+COUNTIF($AA$9:$AA500,$AA500))","v":1154},"D2",2,"D",null,"لخضر ",null," لخضر "]
[498," ",1000613270167200,null,null,"ذكر","2006-06-24","مغنية","نصف داخلي","ج م ع تك02",null,null,null,"أولى","جدع مشترك علوم وتكنولوجيا ",2,498,"D1",null,"قرية العقيد عباس - مغنية -  ",null,null,null,null,null,null,{"$f":"IF($J501=\"\",\"\",MATCH($J501,OFFSET(BASE!$C$5,,,MAX(BASE!$B:$B)),0))","v":20},{"$f":"IF($AA501=\"\",\"\",60*($AA501-1)+COUNTIF($AA$9:$AA501,$AA501))","v":1155},"D1",1,"D",null,"نصر الدين ",null," نصر الدين "]
[499," ",1100813280000100,null,null,"أنثى","2008-01-02","حمام بوغرارة","نصف داخلي","ج م ع تك02",null,null,null,"أولى","جدع مشترك علوم وتكنولوجيا ",2,499,"D2",null,"قرية أولاد الشارف - مغنية - ",null,null,null,null,null,null,{"$f":"IF($J502=\"\",\"\",MATCH($J502,OFFSET(BASE!$C$5,,,MAX(BASE!$B:$B)),0))","v":20},{"$f":"IF($AA502=\"\",\"\",60*($AA502-1)+COUNTIF($AA$9:$AA502,$AA502))","v":1156},"D2",2,"D",null,"رشيد ",null," رشيد "]
[500," ",1000613270355200,null,null,"ذكر","2006-12-01","مغنية","نصف داخلي","ج م ع تك02",null,null,null,"أولى","جدع مشترك علوم وتكنولوجيا ",2,500,"D1",null,"أولاد الشارف -مغنية- ",null,null,null,null,null,null,{"$f":"IF($J503=\"\",\"\",MATCH($J503,OFFSET(BASE!$C$5,,,MAX(BASE!$B:$B)),0))","v":20},{"$f":"IF($AA503=\"\",\"\",60*($AA503-1)+COUNTIF($AA$9:$AA503,$AA503))","v":1157},"D1",1,"D",null,"ختير ",null," ختير "]
[501," ",1000713270149800,null,null,"ذكر","2007-06-07","مغنية","نصف داخلي","ج م ع تك02",null,null,null,"أولى","جدع مشترك علوم وتكنولوجيا ",2,501,"D1",null,"44 حي الشهداء - مغنية -  ",null,null,null,null,null,null,{"$f":"IF($J504=\"\",\"\",MATCH($J504,OFFSET(BASE!$C$5,,,MAX(BASE!$B:$B)),0))","v":20},{"$f":"IF($AA504=\"\",\"\",60*($AA504-1)+COUNTIF($AA$9:$AA504,$AA504))","v":1158},"D1",1,"D",null,"عبد الصمد ",null," عبد الصمد "]
[502," ",1000713270072700,null,null,"ذكر","2007-03-24","مغنية","نصف داخلي","ج م ع تك02",null,null,null,"أولى","جدع مشترك علوم وتكنولوجيا ",2,502,"D1",null,"قرية اولاد الشارف  - مغنية -  ",null,null,null,null,null,null,{"$f":"IF($J505=\"\",\"\",MATCH($J505,OFFSET(BASE!$C$5,,,MAX(BASE!$B:$B)),0))","v":20},{"$f":"IF($AA505=\"\",\"\",60*($AA505-1)+COUNTIF($AA$9:$AA505,$AA505))","v":1159},"D1",1,"D",null,"عبد القادر ",null," عبد القادر "]
[503," ",1300713010460100,null,null,"أنثى","2007-06-19","تلمسان","نصف داخلي","ج م ع تك02",null,null,null,"أولى","جدع مشترك علوم وتكنولوجيا ",2,503,"D2",null,"دوار المرازقة  - مغنية -  ",null,null,null,null,null,null,{"$f":"IF($J506=\"\",\"\",MATCH($J506,OFFSET(BASE!$C$5,,,MAX(BASE!$B:$B)),0))","v":20},{"$f":"IF($AA506=\"\",\"\",60*($AA506-1)+COUNTIF($AA$9:$AA506,$AA506))","v":1160},"D2",2,"D",null,"حاج ",null," حاج "]
[504," ",1000713270155700,null,null,"ذكر","2007-06-11","مغنية","نصف داخلي","ج م ع تك02",null,null,null,"أولى","جدع مشترك علوم وتكنولوجيا ",2,504,"D1",null,"زاوية تغاليمت - سيدي مجاهد - ",null,null,null,null,null,null,{"$f":"IF($J507=\"\",\"\",MATCH($J507,OFFSET(BASE!$C$5,,,MAX(BASE!$B:$B)),0))","v":20},{"$f":"IF($AA507=\"\",\"\",60*($AA507-1)+COUNTIF($AA$9:$AA507,$AA507))","v":1161},"D1",1,"D",null,"العيد ",null," العيد "]
[505," ",1100813270060200,null,null,"أنثى","2008-03-25","مغنية","نصف داخلي","ج م ع تك02",null,null,null,"أولى","جدع مشترك علوم وتكنولوجيا ",2,505,"D2",null,"حي الشهداء - مغنية - ",null,null,null,null,null,null,{"$f":"IF($J508=\"\",\"\",MATCH($J508,OFFSET(BASE!$C$5,,,MAX(BASE!$B:$B)),0))","v":20},{"$f":"IF($AA508=\"\",\"\",60*($AA508-1)+COUNTIF($AA$9:$AA508,$AA508))","v":1162},"D2",2,"D",null,"محمد ",null," محمد "]
[506," ",1100713270068400,null,null,"أنثى","2007-03-20","مغنية","نصف داخلي","ج م ع تك02",null,null,null,"أولى","جدع مشترك علوم وتكنولوجيا ",2,506,"D2",null,"قرية العقيد عباس  - مغنية -  ",null,null,null,null,null,null,{"$f":"IF($J509=\"\",\"\",MATCH($J509,OFFSET(BASE!$C$5,,,MAX(BASE!$B:$B)),0))","v":20},{"$f":"IF($AA509=\"\",\"\",60*($AA509-1)+COUNTIF($AA$9:$AA509,$AA509))","v":1163},"D2",2,"D",null,"محمد ",null," محمد "]
[507," ",1100713270094200,null,null,"أنثى","2007-04-16","مغنية","نصف داخلي","ج م ع تك02",null,null,null,"أولى","جدع مشترك علوم وتكنولوجيا ",2,507,"D2",null,"قرية اولاد الشارف - مغنية -  ",null,null,null,null,null,null,{"$f":"IF($J510=\"\",\"\",MATCH($J510,OFFSET(BASE!$C$5,,,MAX(BASE!$B:$B)),0))","v":20},{"$f":"IF($AA510=\"\",\"\",60*($AA510-1)+COUNTIF($AA$9:$AA510,$AA510))","v":1164},"D2",2,"D",null,"واسيني ",null," واسيني "]
[508," ",1000713270068600,null,null,"ذكر","2007-03-20","مغنية","نصف داخلي","ج م ع تك02",null,null,null,"أولى","جدع مشترك علوم وتكنولوجيا ",2,508,"D1",null,"شارع عبد الله عبيد رقم 02 فلاوسن  ",null,null,null,null,null,null,{"$f":"IF($J511=\"\",\"\",MATCH($J511,OFFSET(BASE!$C$5,,,MAX(BASE!$B:$B)),0))","v":20},{"$f":"IF($AA511=\"\",\"\",60*($AA511-1)+COUNTIF($AA$9:$AA511,$AA511))","v":1165},"D1",1,"D",null,"احمد ",null," احمد "]
[509," ",1000713270275800,null,null,"ذكر","2007-09-27","مغنية","نصف داخلي","ج م ع تك02",null,null,null,"أولى","جدع مشترك علوم وتكنولوجيا ",2,509,"D1",null,"قرية البطيم-مغنية- ",null,null,null,null,null,null,{"$f":"IF($J512=\"\",\"\",MATCH($J512,OFFSET(BASE!$C$5,,,MAX(BASE!$B:$B)),0))","v":20},{"$f":"IF($AA512=\"\",\"\",60*($AA512-1)+COUNTIF($AA$9:$AA512,$AA512))","v":1166},"D1",1,"D",null,"عبد الناصر ",null," عبد الناصر "]
[510," ",1100713270239000,null,null,"أنثى","2007-08-22","مغنية","نصف داخلي","ج م ع تك02",null,null,null,"أولى","جدع مشترك علوم وتكنولوجيا ",2,510,"D2",null,"قرية المصامدة - مغنية - تلمسان ",null,null,null,null,null,null,{"$f":"IF($J513=\"\",\"\",MATCH($J513,OFFSET(BASE!$C$5,,,MAX(BASE!$B:$B)),0))","v":20},{"$f":"IF($AA513=\"\",\"\",60*($AA513-1)+COUNTIF($AA$9:$AA513,$AA513))","v":1167},"D2",2,"D",null,"أحمد ",null," أحمد "]
[511," ",1100813270047400,null,null,"أنثى","2008-03-05","مغنية","نصف داخلي","ج م ع تك02",null,null,null,"أولى","جدع مشترك علوم وتكنولوجيا ",2,511,"D2",null,"قرية البطيم-مغنية- ",null,null,null,null,null,null,{"$f":"IF($J514=\"\",\"\",MATCH($J514,OFFSET(BASE!$C$5,,,MAX(BASE!$B:$B)),0))","v":20},{"$f":"IF($AA514=\"\",\"\",60*($AA514-1)+COUNTIF($AA$9:$AA514,$AA514))","v":1168},"D2",2,"D",null,"محمد ",null," محمد "]
[512," ",1100813270016500,null,null,"أنثى","2008-01-22","مغنية","نصف داخلي","ج م ع تك02",null,null,null,"أولى","جدع مشترك علوم وتكنولوجيا ",2,512,"D2",null," ",null,null,null,null,null,null,{"$f":"IF($J515=\"\",\"\",MATCH($J515,OFFSET(BASE!$C$5,,,MAX(BASE!$B:$B)),0))","v":20},{"$f":"IF($AA515=\"\",\"\",60*($AA515-1)+COUNTIF($AA$9:$AA515,$AA515))","v":1169},"D2",2,"D",null,"سيد أحمد ",null," سيد أحمد "]
[513,{"$f":"D516& \" \" &E516","v":" "},1000713270032500,null,null,"ذكر","2007-02-05","مغنية","خارجي","ج م ع تك02",null,null,null,"أولى","جدع مشترك علوم وتكنولوجيا ",2,513,"E1",null,"نهج محمد خميستي الحماية المدنية سابقا-مغنية ",null,null,null,null,null,null,{"$f":"IF($J516=\"\",\"\",MATCH($J516,OFFSET(BASE!$C$5,,,MAX(BASE!$B:$B)),0))","v":20},{"$f":"IF($AA516=\"\",\"\",60*($AA516-1)+COUNTIF($AA$9:$AA516,$AA516))","v":1170},"E1",1,"E",null,"مجاهد ",null," مجاهد "]
[514," ",1000713010852500,null,null,"ذكر","2007-10-18","تلمسان","خارجي","ج م ع تك02",null,null,null,"أولى","جدع مشترك علوم وتكنولوجيا ",2,514,"E1",null,"رقم 10 حي الشهداء  - مغنية - ",null,null,null,null,null,null,{"$f":"IF($J517=\"\",\"\",MATCH($J517,OFFSET(BASE!$C$5,,,MAX(BASE!$B:$B)),0))","v":20},{"$f":"IF($AA517=\"\",\"\",60*($AA517-1)+COUNTIF($AA$9:$AA517,$AA517))","v":1171},"E1",1,"E",null,"بوفلجة ",null," بوفلجة "]
[515," ",1100713010852400,null,null,"أنثى","2007-10-18","تلمسان","خارجي","ج م ع تك02",null,null,null,"أولى","جدع مشترك علوم وتكنولوجيا ",2,515,"E2",null," ",null,null,null,null,null,null,{"$f":"IF($J518=\"\",\"\",MATCH($J518,OFFSET(BASE!$C$5,,,MAX(BASE!$B:$B)),0))","v":20},{"$f":"IF($AA518=\"\",\"\",60*($AA518-1)+COUNTIF($AA$9:$AA518,$AA518))","v":1172},"E2",2,"E",null,"بوفلجة ",null," بوفلجة "]
[516," ",1000613270072600,null,null,"ذكر","2006-03-28","مغنية","خارجي","ج م ع تك02",null,null,null,"أولى","جدع مشترك علوم وتكنولوجيا ",2,516,"E1",null,"شارع 29 المنطقة رقم 60 طريق المصامدة - مغنية - ",null,null,null,null,null,null,{"$f":"IF($J519=\"\",\"\",MATCH($J519,OFFSET(BASE!$C$5,,,MAX(BASE!$B:$B)),0))","v":20},{"$f":"IF($AA519=\"\",\"\",60*($AA519-1)+COUNTIF($AA$9:$AA519,$AA519))","v":1173},"E1",1,"E",null,"نور الدين ",null," نور الدين "]
[517," ",1100713270155500,null,null,"أنثى","2007-06-11","مغنية","خارجي","ج م ع تك02",null,null,null,"أولى","جدع مشترك علوم وتكنولوجيا ",2,517,"E2",null,"حي الشهداء - مغنية - ",null,null,null,null,null,null,{"$f":"IF($J520=\"\",\"\",MATCH($J520,OFFSET(BASE!$C$5,,,MAX(BASE!$B:$B)),0))","v":20},{"$f":"IF($AA520=\"\",\"\",60*($AA520-1)+COUNTIF($AA$9:$AA520,$AA520))","v":1174},"E2",2,"E",null,"خليد ",null," خليد "]
[518," ",1000816060080800,null,null,"ذكر","2008-04-18","الحمامات","خارجي","ج م ع تك02",null,null,null,"أولى","جدع مشترك علوم وتكنولوجيا ",2,518,"E1",null,"حي محمد خميستي الحناية تلمسان ",null,null,null,null,null,null,{"$f":"IF($J521=\"\",\"\",MATCH($J521,OFFSET(BASE!$C$5,,,MAX(BASE!$B:$B)),0))","v":20},{"$f":"IF($AA521=\"\",\"\",60*($AA521-1)+COUNTIF($AA$9:$AA521,$AA521))","v":1175},"E1",1,"E",null,"العيد ",null,{"$f":"D521 & \" \" & AG521","v":" العيد "}]
[519," ",1100713010520700,null,null,"أنثى","2007-07-06","تلمسان","خارجي","ج م ع تك02",null,null,null,"أولى","جدع مشترك علوم وتكنولوجيا ",2,519,"E2",null,"حي شعبان حمدون - مغنية -  ",null,null,null,null,null,null,{"$f":"IF($J522=\"\",\"\",MATCH($J522,OFFSET(BASE!$C$5,,,MAX(BASE!$B:$B)),0))","v":20},{"$f":"IF($AA522=\"\",\"\",60*($AA522-1)+COUNTIF($AA$9:$AA522,$AA522))","v":1176},{"$f":"AE522&AD522","v":"E2"},{"$f":"IF(F522=\"أنثى\",2,1)","v":2},{"$f":"IF(I522=\"نصف داخلي\",\"D\",\"E\")","v":"E"},null,"لحسن ",null," لحسن "]
[520," ",1000713270157200,null,null,"ذكر","2007-06-13","مغنية","خارجي","ج م ع تك02",null,null,null,"أولى","جدع مشترك علوم وتكنولوجيا ",2,520,"E1",null,"128 حي بلال مغنية ",null,null,null,null,null,null,{"$f":"IF($J523=\"\",\"\",MATCH($J523,OFFSET(BASE!$C$5,,,MAX(BASE!$B:$B)),0))","v":20},{"$f":"IF($AA523=\"\",\"\",60*($AA523-1)+COUNTIF($AA$9:$AA523,$AA523))","v":1177},"E1",1,"E",null,"دانيال يحي ",null," دانيال يحي "]
[521," ",1000613270654100,null,null,"ذكر","2006-05-09","مغنية","خارجي","ج م ع تك02",null,null,null,"أولى","جدع مشترك علوم وتكنولوجيا ",2,521,"E1",null,"قرية العقيد عباس - مغنية -  ",null,null,null,null,null,null,{"$f":"IF($J524=\"\",\"\",MATCH($J524,OFFSET(BASE!$C$5,,,MAX(BASE!$B:$B)),0))","v":20},{"$f":"IF($AA524=\"\",\"\",60*($AA524-1)+COUNTIF($AA$9:$AA524,$AA524))","v":1178},"E1",1,"E",null,"عبد القادر ",null," عبد القادر "]
[522," ",1100713270040500,null,null,"أنثى","2007-02-14","مغنية","نصف داخلي","ج م ع تك03",null,null,null,"أولى","جدع مشترك علوم وتكنولوجيا ",3,522,"D2",null,"قرية العقيد عباس مغنية ",null,null,null,null,null,null,{"$f":"IF($J525=\"\",\"\",MATCH($J525,OFFSET(BASE!$C$5,,,MAX(BASE!$B:$B)),0))","v":21},{"$f":"IF($AA525=\"\",\"\",60*($AA525-1)+COUNTIF($AA$9:$AA525,$AA525))","v":1201},"D2",2,"D",null,"بن اعمر ",null," بن اعمر "]
[523," ",1100713010679900,null,null,"أنثى","2007-08-22","تلمسان","نصف داخلي","ج م ع تك03",null,null,null,"أولى","جدع مشترك علوم وتكنولوجيا ",3,523,"D2",null,"طريق الزوية - المصامدة -  -مغنية- ",null,null,null,null,null,null,{"$f":"IF($J526=\"\",\"\",MATCH($J526,OFFSET(BASE!$C$5,,,MAX(BASE!$B:$B)),0))","v":21},{"$f":"IF($AA526=\"\",\"\",60*($AA526-1)+COUNTIF($AA$9:$AA526,$AA526))","v":1202},"D2",2,"D",null,"عبد اللطيف ",null," عبد اللطيف "]
[524," ",1100613270025600,null,null,"أنثى","2006-01-27","مغنية","نصف داخلي","ج م ع تك03",null,null,null,"أولى","جدع مشترك علوم وتكنولوجيا ",3,524,"D2",null,"قرية أولاد الشارف - مغنية -  ",null,null,null,null,null,null,{"$f":"IF($J527=\"\",\"\",MATCH($J527,OFFSET(BASE!$C$5,,,MAX(BASE!$B:$B)),0))","v":21},{"$f":"IF($AA527=\"\",\"\",60*($AA527-1)+COUNTIF($AA$9:$AA527,$AA527))","v":1203},"D2",2,"D",null,"علي ",null," علي "]
[525," ",1100613270196100,null,null,"أنثى","2006-07-15","مغنية","نصف داخلي","ج م ع تك03",null,null,null,"أولى","جدع مشترك علوم وتكنولوجيا ",3,525,"D2",null,"حي الحمري مغنية ",null,null,null,null,null,null,{"$f":"IF($J528=\"\",\"\",MATCH($J528,OFFSET(BASE!$C$5,,,MAX(BASE!$B:$B)),0))","v":21},{"$f":"IF($AA528=\"\",\"\",60*($AA528-1)+COUNTIF($AA$9:$AA528,$AA528))","v":1204},"D2",2,"D",null,"أعمر ",null," أعمر "]
[526," ",1100713270114700,null,null,"أنثى","2007-05-07","مغنية","نصف داخلي","ج م ع تك03",null,null,null,"أولى","جدع مشترك علوم وتكنولوجيا ",3,526,"D2",null,"دوار المرازقة -  مغنية -  ",null,null,null,null,null,null,{"$f":"IF($J529=\"\",\"\",MATCH($J529,OFFSET(BASE!$C$5,,,MAX(BASE!$B:$B)),0))","v":21},{"$f":"IF($AA529=\"\",\"\",60*($AA529-1)+COUNTIF($AA$9:$AA529,$AA529))","v":1205},"D2",2,"D",null,"عبد القادر ",null," عبد القادر "]
[527," ",1100713270066300,null,null,"أنثى","2007-03-17","مغنية","نصف داخلي","ج م ع تك03",null,null,null,"أولى","جدع مشترك علوم وتكنولوجيا ",3,527,"D2",null," ",null,null,null,null,null,null,{"$f":"IF($J530=\"\",\"\",MATCH($J530,OFFSET(BASE!$C$5,,,MAX(BASE!$B:$B)),0))","v":21},{"$f":"IF($AA530=\"\",\"\",60*($AA530-1)+COUNTIF($AA$9:$AA530,$AA530))","v":1206},"D2",2,"D",null,"امحمد ",null," امحمد "]
[528," ",1100713270085100,null,null,"أنثى","2007-04-08","مغنية","نصف داخلي","ج م ع تك03",null,null,null,"أولى","جدع مشترك علوم وتكنولوجيا ",3,528,"D2",null,"قرية المصامدة - مغنية - تلمسان ",null,null,null,null,null,null,{"$f":"IF($J531=\"\",\"\",MATCH($J531,OFFSET(BASE!$C$5,,,MAX(BASE!$B:$B)),0))","v":21},{"$f":"IF($AA531=\"\",\"\",60*($AA531-1)+COUNTIF($AA$9:$AA531,$AA531))","v":1207},"D2",2,"D",null,"مجاهد ",null," مجاهد "]
[529," ",1000613270258000,null,null,"ذكر","2006-09-06","مغنية","نصف داخلي","ج م ع تك03",null,null,null,"أولى","جدع مشترك علوم وتكنولوجيا ",3,529,"D1",null,"التلالسة ",null,null,null,null,null,null,{"$f":"IF($J532=\"\",\"\",MATCH($J532,OFFSET(BASE!$C$5,,,MAX(BASE!$B:$B)),0))","v":21},{"$f":"IF($AA532=\"\",\"\",60*($AA532-1)+COUNTIF($AA$9:$AA532,$AA532))","v":1208},"D1",1,"D",null,"يحي ",null," يحي "]
[530," ",1100813270017900,null,null,"أنثى","2008-01-23","مغنية","نصف داخلي","ج م ع تك03",null,null,null,"أولى","جدع مشترك علوم وتكنولوجيا ",3,530,"D2",null,"قرية أولاد الشارف - مغنية - ",null,null,null,null,null,null,{"$f":"IF($J533=\"\",\"\",MATCH($J533,OFFSET(BASE!$C$5,,,MAX(BASE!$B:$B)),0))","v":21},{"$f":"IF($AA533=\"\",\"\",60*($AA533-1)+COUNTIF($AA$9:$AA533,$AA533))","v":1209},"D2",2,"D",null,"عبد القادر ",null," عبد القادر "]
[531," ",1100713270255400,null,null,"أنثى","2007-09-08","مغنية","نصف داخلي","ج م ع تك03",null,null,null,"أولى","جدع مشترك علوم وتكنولوجيا ",3,531,"D2",null,"قرية أولاد الشارف - مغنية - ",null,null,null,null,null,null,{"$f":"IF($J534=\"\",\"\",MATCH($J534,OFFSET(BASE!$C$5,,,MAX(BASE!$B:$B)),0))","v":21},{"$f":"IF($AA534=\"\",\"\",60*($AA534-1)+COUNTIF($AA$9:$AA534,$AA534))","v":1210},"D2",2,"D",null,"جمال ",null," جمال "]
[532," ",1000713270292600,null,null,"ذكر","2007-10-14","مغنية","نصف داخلي","ج م ع تك03",null,null,null,"أولى","جدع مشترك علوم وتكنولوجيا ",3,532,"D1",null,"قرية العقيد عباس مغنية ",null,null,null,null,null,null,{"$f":"IF($J535=\"\",\"\",MATCH($J535,OFFSET(BASE!$C$5,,,MAX(BASE!$B:$B)),0))","v":21},{"$f":"IF($AA535=\"\",\"\",60*($AA535-1)+COUNTIF($AA$9:$AA535,$AA535))","v":1211},"D1",1,"D",null,"هواري بومدين ",null," هواري بومدين "]
[533," ",1000613270276100,null,null,"ذكر","2006-12-02","السوقر","نصف داخلي","ج م ع تك03",null,null,null,"أولى","جدع مشترك علوم وتكنولوجيا ",3,533,"D1",null,"قرية أولاد الشارف - مغنية -  ",null,null,null,null,null,null,{"$f":"IF($J536=\"\",\"\",MATCH($J536,OFFSET(BASE!$C$5,,,MAX(BASE!$B:$B)),0))","v":21},{"$f":"IF($AA536=\"\",\"\",60*($AA536-1)+COUNTIF($AA$9:$AA536,$AA536))","v":1212},"D1",1,"D",null,"عبد الجليل ",null," عبد الجليل "]
[534," ",1000713270166300,null,null,"ذكر","2007-06-21","مغنية","نصف داخلي","ج م ع تك03",null,null,null,"أولى","جدع مشترك علوم وتكنولوجيا ",3,534,"D1",null,"قرية أولاد الشارف  - مغنية -  ",null,null,null,null,null,null,{"$f":"IF($J537=\"\",\"\",MATCH($J537,OFFSET(BASE!$C$5,,,MAX(BASE!$B:$B)),0))","v":21},{"$f":"IF($AA537=\"\",\"\",60*($AA537-1)+COUNTIF($AA$9:$AA537,$AA537))","v":1213},"D1",1,"D",null,"أحمد ",null," أحمد "]
[535," ",1100713270308700,null,null,"أنثى","2007-10-31","مغنية","نصف داخلي","ج م ع تك03",null,null,null,"أولى","جدع مشترك علوم وتكنولوجيا ",3,535,"D2",null,"قرية البطيم مغنية ",null,null,null,null,null,null,{"$f":"IF($J538=\"\",\"\",MATCH($J538,OFFSET(BASE!$C$5,,,MAX(BASE!$B:$B)),0))","v":21},{"$f":"IF($AA538=\"\",\"\",60*($AA538-1)+COUNTIF($AA$9:$AA538,$AA538))","v":1214},"D2",2,"D",null,"محمد ",null," محمد "]
[536," ",1000713270226800,null,null,"ذكر","2007-08-13","مغنية","نصف داخلي","ج م ع تك03",null,null,null,"أولى","جدع مشترك علوم وتكنولوجيا ",3,536,"D1",null,"اولاد الشارف - مغنية - ",null,null,null,null,null,null,{"$f":"IF($J539=\"\",\"\",MATCH($J539,OFFSET(BASE!$C$5,,,MAX(BASE!$B:$B)),0))","v":21},{"$f":"IF($AA539=\"\",\"\",60*($AA539-1)+COUNTIF($AA$9:$AA539,$AA539))","v":1215},"D1",1,"D",null,"لحسن ",null," لحسن "]
[537," ",1000813270050500,null,null,"ذكر","2008-03-09","مغنية","نصف داخلي","ج م ع تك03",null,null,null,"أولى","جدع مشترك علوم وتكنولوجيا ",3,537,"D1",null,"قرية أولاد الشارف - مغنية - ",null,null,null,null,null,null,{"$f":"IF($J540=\"\",\"\",MATCH($J540,OFFSET(BASE!$C$5,,,MAX(BASE!$B:$B)),0))","v":21},{"$f":"IF($AA540=\"\",\"\",60*($AA540-1)+COUNTIF($AA$9:$AA540,$AA540))","v":1216},"D1",1,"D",null,"عبد الوهاب ",null," عبد الوهاب "]
[538," ",1100713270111100,null,null,"أنثى","2007-05-05","مغنية","نصف داخلي","ج م ع تك03",null,null,null,"أولى","جدع مشترك علوم وتكنولوجيا ",3,538,"D2",null,"قرية المصامدة - مغنية - تلمسان ",null,null,null,null,null,null,{"$f":"IF($J541=\"\",\"\",MATCH($J541,OFFSET(BASE!$C$5,,,MAX(BASE!$B:$B)),0))","v":21},{"$f":"IF($AA541=\"\",\"\",60*($AA541-1)+COUNTIF($AA$9:$AA541,$AA541))","v":1217},"D2",2,"D",null,"براهيم ",null," براهيم "]
[539," ",1100713270272300,null,null,"أنثى","2007-09-24","مغنية","نصف داخلي","ج م ع تك03",null,null,null,"أولى","جدع مشترك علوم وتكنولوجيا ",3,539,"D2",null,"قرية اولاد الشارف - مغنية - ",null,null,null,null,null,null,{"$f":"IF($J542=\"\",\"\",MATCH($J542,OFFSET(BASE!$C$5,,,MAX(BASE!$B:$B)),0))","v":21},{"$f":"IF($AA542=\"\",\"\",60*($AA542-1)+COUNTIF($AA$9:$AA542,$AA542))","v":1218},"D2",2,"D",null,"احمد ",null," احمد "]
[540," ",1100713070069200,null,null,"أنثى","2007-08-14","الغزوات","نصف داخلي","ج م ع تك03",null,null,null,"أولى","جدع مشترك علوم وتكنولوجيا ",3,540,"D2",null,"ثانوية الخوارزمي  - حي الشهداء - مغنية - ",null,null,null,null,null,null,{"$f":"IF($J543=\"\",\"\",MATCH($J543,OFFSET(BASE!$C$5,,,MAX(BASE!$B:$B)),0))","v":21},{"$f":"IF($AA543=\"\",\"\",60*($AA543-1)+COUNTIF($AA$9:$AA543,$AA543))","v":1219},"D2",2,"D",null,"مراد ",null," مراد "]
[541," ",1000613270051600,null,null,"ذكر","2006-02-28","مغنية","نصف داخلي","ج م ع تك03",null,null,null,"أولى","جدع مشترك علوم وتكنولوجيا ",3,541,"D1",null,"قرية البطيم مغنية ",null,null,null,null,null,null,{"$f":"IF($J544=\"\",\"\",MATCH($J544,OFFSET(BASE!$C$5,,,MAX(BASE!$B:$B)),0))","v":21},{"$f":"IF($AA544=\"\",\"\",60*($AA544-1)+COUNTIF($AA$9:$AA544,$AA544))","v":1220},"D1",1,"D",null,"محمد ",null," محمد "]
[542," ",1000613010321400,null,null,"ذكر","2006-05-29","تلمسان","نصف داخلي","ج م ع تك03",null,null,null,"أولى","جدع مشترك علوم وتكنولوجيا ",3,542,"D1",null,"قرية العقيد لطفي - مغنية -  ",null,null,null,null,null,null,{"$f":"IF($J545=\"\",\"\",MATCH($J545,OFFSET(BASE!$C$5,,,MAX(BASE!$B:$B)),0))","v":21},{"$f":"IF($AA545=\"\",\"\",60*($AA545-1)+COUNTIF($AA$9:$AA545,$AA545))","v":1221},"D1",1,"D",null,"محمد ",null," محمد "]
[543," ",1000713270097300,null,null,"ذكر","2007-04-19","مغنية","نصف داخلي","ج م ع تك03",null,null,null,"أولى","جدع مشترك علوم وتكنولوجيا ",3,543,"D1",null,"قرية المصامدة - مغنية - تلمسان ",null,null,null,null,null,null,{"$f":"IF($J546=\"\",\"\",MATCH($J546,OFFSET(BASE!$C$5,,,MAX(BASE!$B:$B)),0))","v":21},{"$f":"IF($AA546=\"\",\"\",60*($AA546-1)+COUNTIF($AA$9:$AA546,$AA546))","v":1222},"D1",1,"D",null,"هواري ",null," هواري "]
[544," ",1100631050017700,null,null,"أنثى","2006-10-12","السانية","نصف داخلي","ج م ع تك03",null,null,null,"أولى","جدع مشترك علوم وتكنولوجيا ",3,544,"D2",null,"قرية العقيد عباس - مغنية -  ",null,null,null,null,null,null,{"$f":"IF($J547=\"\",\"\",MATCH($J547,OFFSET(BASE!$C$5,,,MAX(BASE!$B:$B)),0))","v":21},{"$f":"IF($AA547=\"\",\"\",60*($AA547-1)+COUNTIF($AA$9:$AA547,$AA547))","v":1223},"D2",2,"D",null,"امحمد ",null," امحمد "]
[545," ",1100713270096000,null,null,"أنثى","2007-04-18","مغنية","نصف داخلي","ج م ع تك03",null,null,null,"أولى","جدع مشترك علوم وتكنولوجيا ",3,545,"D2",null,"قرية العقيد عباس  - مغنية - ",null,null,null,null,null,null,{"$f":"IF($J548=\"\",\"\",MATCH($J548,OFFSET(BASE!$C$5,,,MAX(BASE!$B:$B)),0))","v":21},{"$f":"IF($AA548=\"\",\"\",60*($AA548-1)+COUNTIF($AA$9:$AA548,$AA548))","v":1224},"D2",2,"D",null,"ميلود ",null," ميلود "]
[546," ",1100713270540100,null,null,"أنثى","2007-07-11","تلمسان","نصف داخلي","ج م ع تك03",null,null,null,"أولى","جدع مشترك علوم وتكنولوجيا ",3,546,"D2",null,"قرية أولاد الشارف -  مغنية -  ",null,null,null,null,null,null,{"$f":"IF($J549=\"\",\"\",MATCH($J549,OFFSET(BASE!$C$5,,,MAX(BASE!$B:$B)),0))","v":21},{"$f":"IF($AA549=\"\",\"\",60*($AA549-1)+COUNTIF($AA$9:$AA549,$AA549))","v":1225},"D2",2,"D",null,"عبد المجيد ",null," عبد المجيد "]
[547," ",1100713270879600,null,null,"أنثى","2007-10-27","تلمسان","نصف داخلي","ج م ع تك03",null,null,null,"أولى","جدع مشترك علوم وتكنولوجيا ",3,547,"D2",null,"قرية البطيم ",null,null,null,null,null,null,{"$f":"IF($J550=\"\",\"\",MATCH($J550,OFFSET(BASE!$C$5,,,MAX(BASE!$B:$B)),0))","v":21},{"$f":"IF($AA550=\"\",\"\",60*($AA550-1)+COUNTIF($AA$9:$AA550,$AA550))","v":1226},"D2",2,"D",null,"واسيني ",null," واسيني "]
[548," ",1000713270237600,null,null,"ذكر","2007-08-21","مغنية","نصف داخلي","ج م ع تك03",null,null,null,"أولى","جدع مشترك علوم وتكنولوجيا ",3,549,"D1",null,"قرية العقيد عباس مغنية ",null,null,null,null,null,null,{"$f":"IF($J551=\"\",\"\",MATCH($J551,OFFSET(BASE!$C$5,,,MAX(BASE!$B:$B)),0))","v":21},{"$f":"IF($AA551=\"\",\"\",60*($AA551-1)+COUNTIF($AA$9:$AA551,$AA551))","v":1227},"D1",1,"D",null,"ميلود ",null," ميلود "]
[549," ",1100713270167000,null,null,"أنثى","2007-06-23","مغنية","نصف داخلي","ج م ع تك03",null,null,null,"أولى","جدع مشترك علوم وتكنولوجيا ",3,549,"D2",null,"قرية أولاد الشارف  - مغنية - ",null,null,null,null,null,null,{"$f":"IF($J552=\"\",\"\",MATCH($J552,OFFSET(BASE!$C$5,,,MAX(BASE!$B:$B)),0))","v":21},{"$f":"IF($AA552=\"\",\"\",60*($AA552-1)+COUNTIF($AA$9:$AA552,$AA552))","v":1228},"D2",2,"D",null,"محمد ",null," محمد "]
[550," ",1100813270315900,null,null,"أنثى","2007-11-08","مغنية","نصف داخلي","ج م ع تك03",null,null,null,"أولى","جدع مشترك علوم وتكنولوجيا ",3,550,"D2",null,"قرية العقيد عباس مغنية ",null,null,null,null,null,null,{"$f":"IF($J553=\"\",\"\",MATCH($J553,OFFSET(BASE!$C$5,,,MAX(BASE!$B:$B)),0))","v":21},{"$f":"IF($AA553=\"\",\"\",60*($AA553-1)+COUNTIF($AA$9:$AA553,$AA553))","v":1229},"D2",2,"D",null,"حسين ",null," حسين "]
[551," ",1100813010398800,null,null,"أنثى","2008-05-23","تلمسان","خارجي","ج م ع تك03",null,null,null,"أولى","جدع مشترك علوم وتكنولوجيا ",3,551,"E2",null," ",null,null,null,null,null,null,{"$f":"IF($J554=\"\",\"\",MATCH($J554,OFFSET(BASE!$C$5,,,MAX(BASE!$B:$B)),0))","v":21},{"$f":"IF($AA554=\"\",\"\",60*($AA554-1)+COUNTIF($AA$9:$AA554,$AA554))","v":1230},"E2",2,"E",null,"جيلالي ",null," جيلالي "]
[552," ",1000613270325300,null,null,"ذكر","2006-11-02","مغنية","خارجي","ج م ع تك03",null,null,null,"أولى","جدع مشترك علوم وتكنولوجيا ",3,552,"E1",null,"مزرعة شرقاوي العيد - مغنية -  ",null,null,null,null,null,null,{"$f":"IF($J555=\"\",\"\",MATCH($J555,OFFSET(BASE!$C$5,,,MAX(BASE!$B:$B)),0))","v":21},{"$f":"IF($AA555=\"\",\"\",60*($AA555-1)+COUNTIF($AA$9:$AA555,$AA555))","v":1231},"E1",1,"E",null,"مفداد ",null," مفداد "]
[553," ",1000313270250800,null,null,"ذكر","2003-10-25","مغنية","خارجي","ج م ع تك03",null,null,null,"أولى","جدع مشترك علوم وتكنولوجيا ",3,554,"E1",null,"طريق المستشفى  حي الشهداء  -  مغنية -  ",null,null,null,null,null,null,{"$f":"IF($J556=\"\",\"\",MATCH($J556,OFFSET(BASE!$C$5,,,MAX(BASE!$B:$B)),0))","v":21},{"$f":"IF($AA556=\"\",\"\",60*($AA556-1)+COUNTIF($AA$9:$AA556,$AA556))","v":1232},"E1",1,"E",null,"محمد ",null," محمد "]
[554," ",1100713270083600,null,null,"أنثى","2007-04-06","مغنية","خارجي","ج م ع تك03",null,null,null,"أولى","جدع مشترك علوم وتكنولوجيا ",3,554,"E2",null,"شارع 04 منزل رقم 16  حي الشهداء - مغنية - ",null,null,null,null,"E1",null,{"$f":"IF($J557=\"\",\"\",MATCH($J557,OFFSET(BASE!$C$5,,,MAX(BASE!$B:$B)),0))","v":21},{"$f":"IF($AA557=\"\",\"\",60*($AA557-1)+COUNTIF($AA$9:$AA557,$AA557))","v":1233},"E2",2,"E",null,"منصور ",null," منصور "]
[555," ",1100613270192500,null,null,"أنثى","2006-07-12","مغنية","خارجي","ج م ع تك03",null,null,null,"أولى","جدع مشترك علوم وتكنولوجيا ",3,555,"E2",null,"رقم 21 حي الشهداء  - مغنية -  ",null,null,null,null,null,null,{"$f":"IF($J558=\"\",\"\",MATCH($J558,OFFSET(BASE!$C$5,,,MAX(BASE!$B:$B)),0))","v":21},{"$f":"IF($AA558=\"\",\"\",60*($AA558-1)+COUNTIF($AA$9:$AA558,$AA558))","v":1234},"E2",2,"E",null,"حسين ",null," حسين "]
[556," ",1100713270149400,null,null,"أنثى","2007-06-07","مغنية","خارجي","ج م ع تك03",null,null,null,"أولى","جدع مشترك علوم وتكنولوجيا ",3,556,"E2",null," ",null,null,null,null,null,null,{"$f":"IF($J559=\"\",\"\",MATCH($J559,OFFSET(BASE!$C$5,,,MAX(BASE!$B:$B)),0))","v":21},{"$f":"IF($AA559=\"\",\"\",60*($AA559-1)+COUNTIF($AA$9:$AA559,$AA559))","v":1235},"E2",2,"E",null,"محمد ",null," محمد "]
[557," ",1100713270175400,null,null,"أنثى","2007-06-30","مغنية","نصف داخلي","ج م ع تك04",null,null,null,"أولى","جدع مشترك علوم وتكنولوجيا ",4,557,"D2",null,"قرية أولاد الشارف - مغنية -  ",null,null,null,null,null,null,{"$f":"IF($J560=\"\",\"\",MATCH($J560,OFFSET(BASE!$C$5,,,MAX(BASE!$B:$B)),0))","v":22},{"$f":"IF($AA560=\"\",\"\",60*($AA560-1)+COUNTIF($AA$9:$AA560,$AA560))","v":1261},"D2",2,"D",null,"فتحي ",null," فتحي "]
[558," ",1000713010300500,null,null,"ذكر","2007-05-04","تلمسان","نصف داخلي","ج م ع تك04",null,null,null,"أولى","جدع مشترك علوم وتكنولوجيا ",4,558,"D1",null,"قرية العقيد عباس مغنية ",null,null,null,null,null,null,{"$f":"IF($J561=\"\",\"\",MATCH($J561,OFFSET(BASE!$C$5,,,MAX(BASE!$B:$B)),0))","v":22},{"$f":"IF($AA561=\"\",\"\",60*($AA561-1)+COUNTIF($AA$9:$AA561,$AA561))","v":1262},"D1",1,"D",null,"عبدالله ",null," عبدالله "]
[559," ",1100713270315600,null,null,"أنثى","2007-11-07","مغنية","نصف داخلي","ج م ع تك04",null,null,null,"أولى","جدع مشترك علوم وتكنولوجيا ",4,559,"D2",null,"قرية العقيد عباس - مغنية - ",null,null,null,null,null,null,{"$f":"IF($J562=\"\",\"\",MATCH($J562,OFFSET(BASE!$C$5,,,MAX(BASE!$B:$B)),0))","v":22},{"$f":"IF($AA562=\"\",\"\",60*($AA562-1)+COUNTIF($AA$9:$AA562,$AA562))","v":1263},"D2",2,"D",null,"الشيخ ",null," الشيخ "]
[560," ",1100713270472300,null,null,"أنثى","2007-05-22","تلمسان","نصف داخلي","ج م ع تك04",null,null,null,"أولى","جدع مشترك علوم وتكنولوجيا ",4,560,"D2",null,"قرية العقيد عباس -  مغنية -  ",null,null,null,null,null,null,{"$f":"IF($J563=\"\",\"\",MATCH($J563,OFFSET(BASE!$C$5,,,MAX(BASE!$B:$B)),0))","v":22},{"$f":"IF($AA563=\"\",\"\",60*($AA563-1)+COUNTIF($AA$9:$AA563,$AA563))","v":1264},"D2",2,"D",null,"الصافي ",null," الصافي "]
[561," ",1100813010052100,null,null,"أنثى","2008-01-20","تلمسان","نصف داخلي","ج م ع تك04",null,null,null,"أولى","جدع مشترك علوم وتكنولوجيا ",4,561,"D2",null,"قرية المصامدة - مغنية - تلمسان ",null,null,null,null,null,null,{"$f":"IF($J564=\"\",\"\",MATCH($J564,OFFSET(BASE!$C$5,,,MAX(BASE!$B:$B)),0))","v":22},{"$f":"IF($AA564=\"\",\"\",60*($AA564-1)+COUNTIF($AA$9:$AA564,$AA564))","v":1265},"D2",2,"D",null,"جمال ",null," جمال "]
[562," ",1000608010297400,null,null,"ذكر","2006-09-18","بشار","نصف داخلي","ج م ع تك04",null,null,null,"أولى","جدع مشترك علوم وتكنولوجيا ",4,562,"D1",null,"قرية اولاد الشارف - مغنية -  ",null,null,null,null,null,null,{"$f":"IF($J565=\"\",\"\",MATCH($J565,OFFSET(BASE!$C$5,,,MAX(BASE!$B:$B)),0))","v":22},{"$f":"IF($AA565=\"\",\"\",60*($AA565-1)+COUNTIF($AA$9:$AA565,$AA565))","v":1266},"D1",1,"D",null,"جمال ",null," جمال "]
[563," ",1100713270075600,null,null,"أنثى","2007-03-27","مغنية","نصف داخلي","ج م ع تك04",null,null,null,"أولى","جدع مشترك علوم وتكنولوجيا ",4,564,"D2",null,"مزرعة شعبان حمدون  - مغنية -  ",null,null,null,null,null,null,{"$f":"IF($J566=\"\",\"\",MATCH($J566,OFFSET(BASE!$C$5,,,MAX(BASE!$B:$B)),0))","v":22},{"$f":"IF($AA566=\"\",\"\",60*($AA566-1)+COUNTIF($AA$9:$AA566,$AA566))","v":1267},"D2",2,"D",null,"يوسف ",null," يوسف "]
[564," ",1000713270163200,null,null,"ذكر","2007-06-18","مغنية","نصف داخلي","ج م ع تك04",null,null,null,"أولى","جدع مشترك علوم وتكنولوجيا ",4,565,"D1",null,"قرية المصامدة - مغنية - تلمسان ",null,null,null,null,null,null,{"$f":"IF($J567=\"\",\"\",MATCH($J567,OFFSET(BASE!$C$5,,,MAX(BASE!$B:$B)),0))","v":22},{"$f":"IF($AA567=\"\",\"\",60*($AA567-1)+COUNTIF($AA$9:$AA567,$AA567))","v":1268},"D1",1,"D",null,"نور الدين ",null," نور الدين "]
[565," ",1100613270130100,null,null,"أنثى","2006-05-28","مغنية","نصف داخلي","ج م ع تك04",null,null,null,"أولى","جدع مشترك علوم وتكنولوجيا ",4,565,"D2",null,"قرية المصامدة - مغنية - تلمسان ",null,null,null,null,null,null,{"$f":"IF($J568=\"\",\"\",MATCH($J568,OFFSET(BASE!$C$5,,,MAX(BASE!$B:$B)),0))","v":22},{"$f":"IF($AA568=\"\",\"\",60*($AA568-1)+COUNTIF($AA$9:$AA568,$AA568))","v":1269},"D2",2,"D",null,"عبد الرحيم ",null," عبد الرحيم "]
[566," ",1000713270107700,null,null,"ذكر","2007-04-30","مغنية","نصف داخلي","ج م ع تك04",null,null,null,"أولى","جدع مشترك علوم وتكنولوجيا ",4,566,"D1",null,"اولاد الشارف ",null,null,null,null,null,null,{"$f":"IF($J569=\"\",\"\",MATCH($J569,OFFSET(BASE!$C$5,,,MAX(BASE!$B:$B)),0))","v":22},{"$f":"IF($AA569=\"\",\"\",60*($AA569-1)+COUNTIF($AA$9:$AA569,$AA569))","v":1270},"D1",1,"D",null,"عبد الرزاق ",null," عبد الرزاق "]
[567," ",1100713010976900,null,null,"أنثى","2007-12-02","تلمسان","نصف داخلي","ج م ع تك04",null,null,null,"أولى","جدع مشترك علوم وتكنولوجيا ",4,567,"D2",null,"حي سيدي الزواوي اولاد ميمون ",null,null,null,null,null,null,{"$f":"IF($J570=\"\",\"\",MATCH($J570,OFFSET(BASE!$C$5,,,MAX(BASE!$B:$B)),0))","v":22},{"$f":"IF($AA570=\"\",\"\",60*($AA570-1)+COUNTIF($AA$9:$AA570,$AA570))","v":1271},"D2",2,"D",null,"عبد الواحد ",null," عبد الواحد "]
[568," ",1100713270309500,null,null,"أنثى","2007-11-01","مغنية","نصف داخلي","ج م ع تك04",null,null,null,"أولى","جدع مشترك علوم وتكنولوجيا ",4,568,"D2",null,"قرية أولاد الشارف - مغنية - ",null,null,null,null,null,null,{"$f":"IF($J571=\"\",\"\",MATCH($J571,OFFSET(BASE!$C$5,,,MAX(BASE!$B:$B)),0))","v":22},{"$f":"IF($AA571=\"\",\"\",60*($AA571-1)+COUNTIF($AA$9:$AA571,$AA571))","v":1272},"D2",2,"D",null,"سعيد ",null," سعيد "]
[569," ",1100713270330600,null,null,"أنثى","2007-11-23","مغنية","نصف داخلي","ج م ع تك04",null,null,null,"أولى","جدع مشترك علوم وتكنولوجيا ",4,569,"D2",null,"قرية المصامدة - مغنية - تلمسان ",null,null,null,null,null,null,{"$f":"IF($J572=\"\",\"\",MATCH($J572,OFFSET(BASE!$C$5,,,MAX(BASE!$B:$B)),0))","v":22},{"$f":"IF($AA572=\"\",\"\",60*($AA572-1)+COUNTIF($AA$9:$AA572,$AA572))","v":1273},"D2",2,"D",null,"عكاشة ",null," عكاشة "]
[570," ",1000813270037200,null,null,"ذكر","2008-02-20","مغنية","نصف داخلي","ج م ع تك04",null,null,null,"أولى","جدع مشترك علوم وتكنولوجيا ",4,570,"D1",null,"قرية أولاد الشارف - مغنية - ",null,null,null,null,null,null,{"$f":"IF($J573=\"\",\"\",MATCH($J573,OFFSET(BASE!$C$5,,,MAX(BASE!$B:$B)),0))","v":22},{"$f":"IF($AA573=\"\",\"\",60*($AA573-1)+COUNTIF($AA$9:$AA573,$AA573))","v":1274},"D1",1,"D",null,"محمد ",null," محمد "]
[571," ",1000713010492600,null,null,"ذكر","2007-06-28","تلمسان","نصف داخلي","ج م ع تك04",null,null,null,"أولى","جدع مشترك علوم وتكنولوجيا ",4,571,"D1",null,"قرية البطيم مغنية ",null,null,null,null,null,null,{"$f":"IF($J574=\"\",\"\",MATCH($J574,OFFSET(BASE!$C$5,,,MAX(BASE!$B:$B)),0))","v":22},{"$f":"IF($AA574=\"\",\"\",60*($AA574-1)+COUNTIF($AA$9:$AA574,$AA574))","v":1275},"D1",1,"D",null,"عبدالقادر ",null," عبدالقادر "]
[572," ",1000613270411000,null,null,"ذكر","2006-06-12","مغنية","نصف داخلي","ج م ع تك04",null,null,null,"أولى","جدع مشترك علوم وتكنولوجيا ",4,572,"D1",null,"قرية أولاد الشارف - مغنية - ",null,null,null,null,null,null,{"$f":"IF($J575=\"\",\"\",MATCH($J575,OFFSET(BASE!$C$5,,,MAX(BASE!$B:$B)),0))","v":22},{"$f":"IF($AA575=\"\",\"\",60*($AA575-1)+COUNTIF($AA$9:$AA575,$AA575))","v":1276},"D1",1,"D",null,"جمال ",null," جمال "]
[573," ",1000613130034900,null,null,"ذكر","2006-07-17","أولاد ميمون","نصف داخلي","ج م ع تك04",null,null,null,"أولى","جدع مشترك علوم وتكنولوجيا ",4,573,"D1",null," ",null,null,null,null,null,null,{"$f":"IF($J576=\"\",\"\",MATCH($J576,OFFSET(BASE!$C$5,,,MAX(BASE!$B:$B)),0))","v":22},{"$f":"IF($AA576=\"\",\"\",60*($AA576-1)+COUNTIF($AA$9:$AA576,$AA576))","v":1277},"D1",1,"D",null,"موفق ",null," موفق "]
[574," ",1100713270265400,null,null,"أنثى","2007-09-17","مغنية","نصف داخلي","ج م ع تك04",null,null,null,"أولى","جدع مشترك علوم وتكنولوجيا ",4,574,"D2",null,"أولاد الشارف مغنية ",null,null,null,null,null,null,{"$f":"IF($J577=\"\",\"\",MATCH($J577,OFFSET(BASE!$C$5,,,MAX(BASE!$B:$B)),0))","v":22},{"$f":"IF($AA577=\"\",\"\",60*($AA577-1)+COUNTIF($AA$9:$AA577,$AA577))","v":1278},"D2",2,"D",null,"عبد الحليم ",null," عبد الحليم "]
[575," ",1100713270275000,null,null,"أنثى","2007-09-26","مغنية","نصف داخلي","ج م ع تك04",null,null,null,"أولى","جدع مشترك علوم وتكنولوجيا ",4,575,"D2",null,"قرية اولاد الشارف  -  مغنية -  ",null,null,null,null,null,null,{"$f":"IF($J578=\"\",\"\",MATCH($J578,OFFSET(BASE!$C$5,,,MAX(BASE!$B:$B)),0))","v":22},{"$f":"IF($AA578=\"\",\"\",60*($AA578-1)+COUNTIF($AA$9:$AA578,$AA578))","v":1279},"D2",2,"D",null,"علي ",null," علي "]
[576," ",1100813270250800,null,null,"أنثى","2008-09-21","مغنية","نصف داخلي","ج م ع تك04",null,null,null,"أولى","جدع مشترك علوم وتكنولوجيا ",4,576,"D2",null,"قرية العقيد عباس مغنية ",null,null,null,null,null,null,{"$f":"IF($J579=\"\",\"\",MATCH($J579,OFFSET(BASE!$C$5,,,MAX(BASE!$B:$B)),0))","v":22},{"$f":"IF($AA579=\"\",\"\",60*($AA579-1)+COUNTIF($AA$9:$AA579,$AA579))","v":1280},"D2",2,"D",null,"عبدالله ",null," عبدالله "]
[577,{"$f":"D580& \" \" &E580","v":" "},1100813270020700,null,null,"أنثى","2008-01-27","مغنية","نصف داخلي","ج م ع تك04",null,null,null,"أولى","جدع مشترك علوم وتكنولوجيا ",4,577,"D2",null,"قرية المصامدة - مغنية - تلمسان ",null,null,null,null,null,null,{"$f":"IF($J580=\"\",\"\",MATCH($J580,OFFSET(BASE!$C$5,,,MAX(BASE!$B:$B)),0))","v":22},{"$f":"IF($AA580=\"\",\"\",60*($AA580-1)+COUNTIF($AA$9:$AA580,$AA580))","v":1281},"D2",2,"D",null,"أحمد ",null," أحمد "]
[578," ",1100713270125600,null,null,"أنثى","2007-05-19","مغنية","نصف داخلي","ج م ع تك04",null,null,null,"أولى","جدع مشترك علوم وتكنولوجيا ",4,578,"D2",null,"قرية أولاد الشارف - مغنية -  ",null,null,null,null,null,null,{"$f":"IF($J581=\"\",\"\",MATCH($J581,OFFSET(BASE!$C$5,,,MAX(BASE!$B:$B)),0))","v":22},{"$f":"IF($AA581=\"\",\"\",60*($AA581-1)+COUNTIF($AA$9:$AA581,$AA581))","v":1282},"D2",2,"D",null,"نور الدين ",null," نور الدين "]
[579," ",1100713270231200,null,null,"أنثى","2007-08-16","مغنية","نصف داخلي","ج م ع تك04",null,null,null,"أولى","جدع مشترك علوم وتكنولوجيا ",4,579,"D2",null,"قرية العقيد عباس - مغنية -  ",null,null,null,null,null,null,{"$f":"IF($J582=\"\",\"\",MATCH($J582,OFFSET(BASE!$C$5,,,MAX(BASE!$B:$B)),0))","v":22},{"$f":"IF($AA582=\"\",\"\",60*($AA582-1)+COUNTIF($AA$9:$AA582,$AA582))","v":1283},"D2",2,"D",null,"بلقاسم ",null," بلقاسم "]
[580," ",1100813270032700,null,null,"أنثى","2008-02-14","مغنية","نصف داخلي","ج م ع تك04",null,null,null,"أولى","جدع مشترك علوم وتكنولوجيا ",4,580,"D2",null,"دوار المرازقة - مغنية -  ",null,null,null,null,null,null,{"$f":"IF($J583=\"\",\"\",MATCH($J583,OFFSET(BASE!$C$5,,,MAX(BASE!$B:$B)),0))","v":22},{"$f":"IF($AA583=\"\",\"\",60*($AA583-1)+COUNTIF($AA$9:$AA583,$AA583))","v":1284},"D2",2,"D",null,"عبد القادر ",null," عبد القادر "]
[581," ",1000613270342200,null,null,"ذكر","2006-11-18","مغنية","نصف داخلي","ج م ع تك04",null,null,null,"أولى","جدع مشترك علوم وتكنولوجيا ",4,581,"D1",null,"قرية العقيد لطفي ",null,null,null,null,null,null,{"$f":"IF($J584=\"\",\"\",MATCH($J584,OFFSET(BASE!$C$5,,,MAX(BASE!$B:$B)),0))","v":22},{"$f":"IF($AA584=\"\",\"\",60*($AA584-1)+COUNTIF($AA$9:$AA584,$AA584))","v":1285},"D1",1,"D",null,"عبد العزيز ",null," عبد العزيز "]
[582," ",1100713270232200,null,null,"أنثى","2007-08-17","مغنية","نصف داخلي","ج م ع تك04",null,null,null,"أولى","جدع مشترك علوم وتكنولوجيا ",4,582,"D2",null,"حي المقراني مغنية ",null,null,null,null,null,null,{"$f":"IF($J585=\"\",\"\",MATCH($J585,OFFSET(BASE!$C$5,,,MAX(BASE!$B:$B)),0))","v":22},{"$f":"IF($AA585=\"\",\"\",60*($AA585-1)+COUNTIF($AA$9:$AA585,$AA585))","v":1286},"D2",2,"D",null,"عبد القادر ",null,{"$f":"D585 & \" \" & AG585","v":" عبد القادر "}]
[583," ",1100613130024900,null,null,"أنثى","2006-06-02","اولاد ميمون","نصف داخلي","ج م ع تك04",null,null,null,"أولى","جدع مشترك علوم وتكنولوجيا ",4,583,"D2",null,"قرية البخاتة ",null,null,null,null,null,null,{"$f":"IF($J586=\"\",\"\",MATCH($J586,OFFSET(BASE!$C$5,,,MAX(BASE!$B:$B)),0))","v":22},{"$f":"IF($AA586=\"\",\"\",60*($AA586-1)+COUNTIF($AA$9:$AA586,$AA586))","v":1287},{"$f":"AE586&AD586","v":"D2"},{"$f":"IF(F586=\"أنثى\",2,1)","v":2},{"$f":"IF(I586=\"نصف داخلي\",\"D\",\"E\")","v":"D"},null,"احمد ",null," احمد "]
[584," ",1100613270327600,null,null,"أنثى","2006-11-04","مغنية","خارجي","ج م ع تك04",null,null,null,"أولى","جدع مشترك علوم وتكنولوجيا ",4,584,"E2",null,"مزرعة شعبان حمدون - مغنية -  ",null,null,null,null,null,null,{"$f":"IF($J587=\"\",\"\",MATCH($J587,OFFSET(BASE!$C$5,,,MAX(BASE!$B:$B)),0))","v":22},{"$f":"IF($AA587=\"\",\"\",60*($AA587-1)+COUNTIF($AA$9:$AA587,$AA587))","v":1288},"E2",2,"E",null,"محمد ",null," محمد "]
[585," ",1100813270015000,null,null,"أنثى","2008-01-20","مغنية","خارجي","ج م ع تك04",null,null,null,"أولى","جدع مشترك علوم وتكنولوجيا ",4,585,"E2",null,"شارع 25 رقم 02 حي الشهداء  - مغنية - ",null,null,null,null,null,null,{"$f":"IF($J588=\"\",\"\",MATCH($J588,OFFSET(BASE!$C$5,,,MAX(BASE!$B:$B)),0))","v":22},{"$f":"IF($AA588=\"\",\"\",60*($AA588-1)+COUNTIF($AA$9:$AA588,$AA588))","v":1289},"E2",2,"E",null,"عبد الغاني ",null," عبد الغاني "]
[586," ",1100713270246100,null,null,"أنثى","2007-08-29","مغنية","خارجي","ج م ع تك04",null,null,null,"أولى","جدع مشترك علوم وتكنولوجيا ",4,586,"E2",null,"حي الشهداء - مغنية - ",null,null,null,null,null,null,{"$f":"IF($J589=\"\",\"\",MATCH($J589,OFFSET(BASE!$C$5,,,MAX(BASE!$B:$B)),0))","v":22},{"$f":"IF($AA589=\"\",\"\",60*($AA589-1)+COUNTIF($AA$9:$AA589,$AA589))","v":1290},"E2",2,"E",null,"حاج ",null," حاج "]
[587," ",1000613010747300,null,null,"ذكر","2006-10-01","تلمسان","خارجي","ج م ع تك04",null,null,null,"أولى","جدع مشترك علوم وتكنولوجيا ",4,587,"E1",null,"شارع 27 حي الشهداء - مغنية - ",null,null,null,null,null,null,{"$f":"IF($J590=\"\",\"\",MATCH($J590,OFFSET(BASE!$C$5,,,MAX(BASE!$B:$B)),0))","v":22},{"$f":"IF($AA590=\"\",\"\",60*($AA590-1)+COUNTIF($AA$9:$AA590,$AA590))","v":1291},"E1",1,"E",null,"عبد المجيد ",null," عبد المجيد "]
[588," ",1100713270008100,null,null,"أنثى","2007-01-08","مغنية","خارجي","ج م ع تك04",null,null,null,"أولى","جدع مشترك علوم وتكنولوجيا ",4,588,"E2",null,"قرية العقيد عباس - مغنية -  ",null,null,null,null,null,null,{"$f":"IF($J591=\"\",\"\",MATCH($J591,OFFSET(BASE!$C$5,,,MAX(BASE!$B:$B)),0))","v":22},{"$f":"IF($AA591=\"\",\"\",60*($AA591-1)+COUNTIF($AA$9:$AA591,$AA591))","v":1292},"E2",2,"E",null,"علي ",null," علي "]
[589," ",1100713270186500,null,null,"أنثى","2007-07-08","مغنية","خارجي","ج م ع تك04",null,null,null,"أولى","جدع مشترك علوم وتكنولوجيا ",4,589,"E2",null,"حي الشهداء - مغنية -  ",null,null,null,null,null,null,{"$f":"IF($J592=\"\",\"\",MATCH($J592,OFFSET(BASE!$C$5,,,MAX(BASE!$B:$B)),0))","v":22},{"$f":"IF($AA592=\"\",\"\",60*($AA592-1)+COUNTIF($AA$9:$AA592,$AA592))","v":1293},"E2",2,"E",null,"حسين ",null," حسين "]
[590," ",1000713270045600,null,null,"ذكر","2007-02-21","مغنية","نصف داخلي","ج م ع تك05",null,null,null,"أولى","جدع مشترك علوم وتكنولوجيا ",5,590,"D1",null,"دوار المرازقة  مغنية ",null,null,null,null,null,null,{"$f":"IF($J593=\"\",\"\",MATCH($J593,OFFSET(BASE!$C$5,,,MAX(BASE!$B:$B)),0))","v":23},{"$f":"IF($AA593=\"\",\"\",60*($AA593-1)+COUNTIF($AA$9:$AA593,$AA593))","v":1321},"D1",1,"D",null,"يزيد ",null," يزيد "]
[591," ",1000713270202900,null,null,"ذكر","2007-07-24","مغنية","نصف داخلي","ج م ع تك05",null,null,null,"أولى","جدع مشترك علوم وتكنولوجيا ",5,591,"D1",null,"قرية العقيد عباس -   مغنية -  ",null,null,null,null,null,null,{"$f":"IF($J594=\"\",\"\",MATCH($J594,OFFSET(BASE!$C$5,,,MAX(BASE!$B:$B)),0))","v":23},{"$f":"IF($AA594=\"\",\"\",60*($AA594-1)+COUNTIF($AA$9:$AA594,$AA594))","v":1322},"D1",1,"D",null,"امحمد ",null," امحمد "]
[592," ",1100713010594000,null,null,"أنثى","2007-07-27","تلمسان","نصف داخلي","ج م ع تك05",null,null,null,"أولى","جدع مشترك علوم وتكنولوجيا ",5,592,"D2",null,"قرية العقيد لطفي ",null,null,null,null,null,null,{"$f":"IF($J595=\"\",\"\",MATCH($J595,OFFSET(BASE!$C$5,,,MAX(BASE!$B:$B)),0))","v":23},{"$f":"IF($AA595=\"\",\"\",60*($AA595-1)+COUNTIF($AA$9:$AA595,$AA595))","v":1323},"D2",2,"D",null,"عبد القادر ",null," عبد القادر "]
[593," ",1400613270226100,null,null,"ذكر","2006-08-09","مغنية","نصف داخلي","ج م ع تك05",null,null,null,"أولى","جدع مشترك علوم وتكنولوجيا ",5,593,"D1",null,"اولاد قدور -  مغنية -  ",null,null,null,null,null,null,{"$f":"IF($J596=\"\",\"\",MATCH($J596,OFFSET(BASE!$C$5,,,MAX(BASE!$B:$B)),0))","v":23},{"$f":"IF($AA596=\"\",\"\",60*($AA596-1)+COUNTIF($AA$9:$AA596,$AA596))","v":1324},"D1",1,"D",null,"العربي ",null," العربي "]
[594," ",1000613270164300,null,null,"ذكر","2006-06-22","مغنية","نصف داخلي","ج م ع تك05",null,null,null,"أولى","جدع مشترك علوم وتكنولوجيا ",5,594,"D1",null,"قرية المصامدة - مغنية - تلمسان ",null,null,null,null,null,null,{"$f":"IF($J597=\"\",\"\",MATCH($J597,OFFSET(BASE!$C$5,,,MAX(BASE!$B:$B)),0))","v":23},{"$f":"IF($AA597=\"\",\"\",60*($AA597-1)+COUNTIF($AA$9:$AA597,$AA597))","v":1325},"D1",1,"D",null,"عبد الرحمن ",null," عبد الرحمن "]
[595," ",1000613010003300,null,null,null,null,null,null,"ج م ع تك05",null,null,null,null,null,null,595,"E1",null,null,null,null,null,null,null,null,{"$f":"IF($J598=\"\",\"\",MATCH($J598,OFFSET(BASE!$C$5,,,MAX(BASE!$B:$B)),0))","v":23},{"$f":"IF($AA598=\"\",\"\",60*($AA598-1)+COUNTIF($AA$9:$AA598,$AA598))","v":1326},"E1",1,"E",null,null,null," "]
[596," ",1100613270079600,null,null,"أنثى","2006-04-07","مغنية","نصف داخلي","ج م ع تك05",null,null,null,"أولى","جدع مشترك علوم وتكنولوجيا ",5,596,"D2",null,"قرية العقيد عباس - مغنية -  ",null,null,null,null,null,null,{"$f":"IF($J599=\"\",\"\",MATCH($J599,OFFSET(BASE!$C$5,,,MAX(BASE!$B:$B)),0))","v":23},{"$f":"IF($AA599=\"\",\"\",60*($AA599-1)+COUNTIF($AA$9:$AA599,$AA599))","v":1327},"D2",2,"D",null,"لخضير ",null," لخضير "]
[597," ",1000613270360000,null,null,"ذكر","2006-12-07","مغنية","نصف داخلي","ج م ع تك05",null,null,null,"أولى","جدع مشترك علوم وتكنولوجيا ",5,597,"D1",null,"قرية العقيد عباس مغنية ",null,null,null,null,null,null,{"$f":"IF($J600=\"\",\"\",MATCH($J600,OFFSET(BASE!$C$5,,,MAX(BASE!$B:$B)),0))","v":23},{"$f":"IF($AA600=\"\",\"\",60*($AA600-1)+COUNTIF($AA$9:$AA600,$AA600))","v":1328},"D1",1,"D",null,"بن اعمر ",null," بن اعمر "]
[598," ",1000713270287400,null,null,"ذكر","2007-10-08","مغنية","نصف داخلي","ج م ع تك05",null,null,null,"أولى","جدع مشترك علوم وتكنولوجيا ",5,598,"D1",null,"قرية المصامدة - مغنية - تلمسان ",null,null,null,null,null,null,{"$f":"IF($J601=\"\",\"\",MATCH($J601,OFFSET(BASE!$C$5,,,MAX(BASE!$B:$B)),0))","v":23},{"$f":"IF($AA601=\"\",\"\",60*($AA601-1)+COUNTIF($AA$9:$AA601,$AA601))","v":1329},"D1",1,"D",null,"كريم ",null," كريم "]
[599," ",1100713270341900,null,null,"أنثى","2007-12-05","مغنية","نصف داخلي","ج م ع تك05",null,null,null,"أولى","جدع مشترك علوم وتكنولوجيا ",5,599,"D2",null,"قرية البطيم-مغنية- ",null,null,null,null,null,null,{"$f":"IF($J602=\"\",\"\",MATCH($J602,OFFSET(BASE!$C$5,,,MAX(BASE!$B:$B)),0))","v":23},{"$f":"IF($AA602=\"\",\"\",60*($AA602-1)+COUNTIF($AA$9:$AA602,$AA602))","v":1330},"D2",2,"D",null,"نور الدين ",null," نور الدين "]
[600," ",1100713271049300,null,null,"أنثى","2007-12-30","تلمسان","نصف داخلي","ج م ع تك05",null,null,null,"أولى","جدع مشترك علوم وتكنولوجيا ",5,600,"D2",null,"قرية البطيم ",null,null,null,null,null,null,{"$f":"IF($J603=\"\",\"\",MATCH($J603,OFFSET(BASE!$C$5,,,MAX(BASE!$B:$B)),0))","v":23},{"$f":"IF($AA603=\"\",\"\",60*($AA603-1)+COUNTIF($AA$9:$AA603,$AA603))","v":1331},"D2",2,"D",null,"عبد الفتاح ",null," عبد الفتاح "]
[601," ",1100813270014200,null,null,"أنثى","2008-01-19","مغنية","نصف داخلي","ج م ع تك05",null,null,null,"أولى","جدع مشترك علوم وتكنولوجيا ",5,601,"D2",null,"قرية العقيد لطفي ",null,null,null,null,null,null,{"$f":"IF($J604=\"\",\"\",MATCH($J604,OFFSET(BASE!$C$5,,,MAX(BASE!$B:$B)),0))","v":23},{"$f":"IF($AA604=\"\",\"\",60*($AA604-1)+COUNTIF($AA$9:$AA604,$AA604))","v":1332},"D2",2,"D",null,"بن عبد الله ",null," بن عبد الله "]
[602," ",1000613270083600,null,null,"ذكر","2006-04-11","مغنية","نصف داخلي","ج م ع تك05",null,null,null,"أولى","جدع مشترك علوم وتكنولوجيا ",5,602,"D1",null,"قرية المصامدة - مغنية - تلمسان ",null,null,null,null,null,null,{"$f":"IF($J605=\"\",\"\",MATCH($J605,OFFSET(BASE!$C$5,,,MAX(BASE!$B:$B)),0))","v":23},{"$f":"IF($AA605=\"\",\"\",60*($AA605-1)+COUNTIF($AA$9:$AA605,$AA605))","v":1333},"D1",1,"D",null,"عبد الله ",null," عبد الله "]
[603," ",1000713270080400,null,null,"ذكر","2007-04-02","مغنية","نصف داخلي","ج م ع تك05",null,null,null,"أولى","جدع مشترك علوم وتكنولوجيا ",5,603,"D1",null,"قرية العقيد عباس مغنية ",null,null,null,null,null,null,{"$f":"IF($J606=\"\",\"\",MATCH($J606,OFFSET(BASE!$C$5,,,MAX(BASE!$B:$B)),0))","v":23},{"$f":"IF($AA606=\"\",\"\",60*($AA606-1)+COUNTIF($AA$9:$AA606,$AA606))","v":1334},"D1",1,"D",null,"يوسف ",null," يوسف "]
[604," ",1000513270212000,null,null,"ذكر","2005-07-26","مغنية","نصف داخلي","ج م ع تك05",null,null,null,"أولى","جدع مشترك علوم وتكنولوجيا ",5,604,"D1",null,"قرية العقيد لطفي ",null,null,null,null,null,null,{"$f":"IF($J607=\"\",\"\",MATCH($J607,OFFSET(BASE!$C$5,,,MAX(BASE!$B:$B)),0))","v":23},{"$f":"IF($AA607=\"\",\"\",60*($AA607-1)+COUNTIF($AA$9:$AA607,$AA607))","v":1335},"D1",1,"D",null,"مرصلي ",null," مرصلي "]
[605," ",1100713270190400,null,null,"أنثى","2007-07-13","مغنية","نصف داخلي","ج م ع تك05",null,null,null,"أولى","جدع مشترك علوم وتكنولوجيا ",5,605,"D2",null,"قرية المصامدة - مغنية - تلمسان ",null,null,null,null,null,null,{"$f":"IF($J608=\"\",\"\",MATCH($J608,OFFSET(BASE!$C$5,,,MAX(BASE!$B:$B)),0))","v":23},{"$f":"IF($AA608=\"\",\"\",60*($AA608-1)+COUNTIF($AA$9:$AA608,$AA608))","v":1336},"D2",2,"D",null,"محمد ",null," محمد "]
[606," ",1300713270234200,null,null,"أنثى","2007-08-18","مغنية","نصف داخلي","ج م ع تك05",null,null,null,"أولى","جدع مشترك علوم وتكنولوجيا ",5,606,"D2",null,"قرية أولاد الشارف  - مغنية -  ",null,null,null,null,null,null,{"$f":"IF($J609=\"\",\"\",MATCH($J609,OFFSET(BASE!$C$5,,,MAX(BASE!$B:$B)),0))","v":23},{"$f":"IF($AA609=\"\",\"\",60*($AA609-1)+COUNTIF($AA$9:$AA609,$AA609))","v":1337},"D2",2,"D",null,"بلقاسم ",null," بلقاسم "]
[607," ",1100713270159900,null,null,"أنثى","2007-06-15","مغنية","نصف داخلي","ج م ع تك05",null,null,null,"أولى","جدع مشترك علوم وتكنولوجيا ",5,607,"D2",null,"قرية العقيد عباس مغنية ",null,null,null,null,null,null,{"$f":"IF($J610=\"\",\"\",MATCH($J610,OFFSET(BASE!$C$5,,,MAX(BASE!$B:$B)),0))","v":23},{"$f":"IF($AA610=\"\",\"\",60*($AA610-1)+COUNTIF($AA$9:$AA610,$AA610))","v":1338},"D2",2,"D",null,"نور الدين ",null," نور الدين "]
[608," ",1000413270264800,null,null,"ذكر","2004-12-23","مغنية","نصف داخلي","ج م ع تك05",null,null,null,"أولى","جدع مشترك علوم وتكنولوجيا ",5,608,"D1",null,"قرية اولاد الشارف - مغنية -  ",null,null,null,null,null,null,{"$f":"IF($J611=\"\",\"\",MATCH($J611,OFFSET(BASE!$C$5,,,MAX(BASE!$B:$B)),0))","v":23},{"$f":"IF($AA611=\"\",\"\",60*($AA611-1)+COUNTIF($AA$9:$AA611,$AA611))","v":1339},"D1",1,"D",null,"محمد ",null," محمد "]
[609," ",1000713270222700,null,null,"ذكر","2007-08-09","مغنية","نصف داخلي","ج م ع تك05",null,null,null,"أولى","جدع مشترك علوم وتكنولوجيا ",5,609,"D1",null,"قرية البطيم-مغنية- ",null,null,null,null,null,null,{"$f":"IF($J612=\"\",\"\",MATCH($J612,OFFSET(BASE!$C$5,,,MAX(BASE!$B:$B)),0))","v":23},{"$f":"IF($AA612=\"\",\"\",60*($AA612-1)+COUNTIF($AA$9:$AA612,$AA612))","v":1340},"D1",1,"D",null,"محمد ",null," محمد "]
[610," ",1100713270058700,null,null,"أنثى","2007-03-07","مغنية","نصف داخلي","ج م ع تك05",null,null,null,"أولى","جدع مشترك علوم وتكنولوجيا ",5,610,"D2",null,"حي الشهداء - مغنية - ",null,null,null,null,null,null,{"$f":"IF($J613=\"\",\"\",MATCH($J613,OFFSET(BASE!$C$5,,,MAX(BASE!$B:$B)),0))","v":23},{"$f":"IF($AA613=\"\",\"\",60*($AA613-1)+COUNTIF($AA$9:$AA613,$AA613))","v":1341},"D2",2,"D",null,"عبد القادر ",null," عبد القادر "]
[611," ",1100713270144100,null,null,"أنثى","2007-06-03","مغنية","نصف داخلي","ج م ع تك05",null,null,null,"أولى","جدع مشترك علوم وتكنولوجيا ",5,611,"D2",null,"قرية البطيم ",null,null,null,null,null,null,{"$f":"IF($J614=\"\",\"\",MATCH($J614,OFFSET(BASE!$C$5,,,MAX(BASE!$B:$B)),0))","v":23},{"$f":"IF($AA614=\"\",\"\",60*($AA614-1)+COUNTIF($AA$9:$AA614,$AA614))","v":1342},"D2",2,"D",null,"مجاهد ",null," مجاهد "]
[612," ",1000713270307400,null,null,"ذكر","2007-10-28","مغنية","نصف داخلي","ج م ع تك05",null,null,null,"أولى","جدع مشترك علوم وتكنولوجيا ",5,612,"D1",null,"قرية أولاد الشارف - مغنية -  ",null,null,null,null,null,null,{"$f":"IF($J615=\"\",\"\",MATCH($J615,OFFSET(BASE!$C$5,,,MAX(BASE!$B:$B)),0))","v":23},{"$f":"IF($AA615=\"\",\"\",60*($AA615-1)+COUNTIF($AA$9:$AA615,$AA615))","v":1343},"D1",1,"D",null,"محمد ",null," محمد "]
[613," ",1000713010808600,null,null,"ذكر","2007-10-02","تلمسان","نصف داخلي","ج م ع تك05",null,null,null,"أولى","جدع مشترك علوم وتكنولوجيا ",5,613,"D1",null,"قرية اولاد الشارف - مغنية -  ",null,null,null,null,null,null,{"$f":"IF($J616=\"\",\"\",MATCH($J616,OFFSET(BASE!$C$5,,,MAX(BASE!$B:$B)),0))","v":23},{"$f":"IF($AA616=\"\",\"\",60*($AA616-1)+COUNTIF($AA$9:$AA616,$AA616))","v":1344},"D1",1,"D",null,"جمال ",null," جمال "]
[614," ",1100713270082600,null,null,"أنثى","2007-04-05","مغنية","نصف داخلي","ج م ع تك05",null,null,null,"أولى","جدع مشترك علوم وتكنولوجيا ",5,614,"D2",null,"حي المد بحة مغنية ",null,null,null,null,null,null,{"$f":"IF($J617=\"\",\"\",MATCH($J617,OFFSET(BASE!$C$5,,,MAX(BASE!$B:$B)),0))","v":23},{"$f":"IF($AA617=\"\",\"\",60*($AA617-1)+COUNTIF($AA$9:$AA617,$AA617))","v":1345},"D2",2,"D",null,"ابن عمر ",null," ابن عمر "]
[615," ",1000713270206900,null,null,"ذكر","2007-07-28","مغنية","نصف داخلي","ج م ع تك05",null,null,null,"أولى","جدع مشترك علوم وتكنولوجيا ",5,615,"D1",null,"قرية البطيم-مغنية- ",null,null,null,null,null,null,{"$f":"IF($J618=\"\",\"\",MATCH($J618,OFFSET(BASE!$C$5,,,MAX(BASE!$B:$B)),0))","v":23},{"$f":"IF($AA618=\"\",\"\",60*($AA618-1)+COUNTIF($AA$9:$AA618,$AA618))","v":1346},"D1",1,"D",null,"عبد الحليم ",null," عبد الحليم "]
[616," ",1100713270072600,null,null,"أنثى","2007-03-24","مغنية","نصف داخلي","ج م ع تك05",null,null,null,"أولى","جدع مشترك علوم وتكنولوجيا ",5,616,"D2",null,"قرية العقيد عباس -  مغنية -  ",null,null,null,null,null,null,{"$f":"IF($J619=\"\",\"\",MATCH($J619,OFFSET(BASE!$C$5,,,MAX(BASE!$B:$B)),0))","v":23},{"$f":"IF($AA619=\"\",\"\",60*($AA619-1)+COUNTIF($AA$9:$AA619,$AA619))","v":1347},"D2",2,"D",null,"عبد الكريم ",null," عبد الكريم "]
[617," ",1000713270127700,null,null,"ذكر","2007-05-20","مغنية","خارجي","ج م ع تك05",null,null,null,"أولى","جدع مشترك علوم وتكنولوجيا ",5,617,"E1",null,"أولاد الشارف - مغنية - ",null,null,null,null,null,null,{"$f":"IF($J620=\"\",\"\",MATCH($J620,OFFSET(BASE!$C$5,,,MAX(BASE!$B:$B)),0))","v":23},{"$f":"IF($AA620=\"\",\"\",60*($AA620-1)+COUNTIF($AA$9:$AA620,$AA620))","v":1348},"E1",1,"E",null,"عبد الباقي ",null," عبد الباقي "]
[618," ",1000713270341600,null,null,"ذكر","2007-12-04","مغنية","خارجي","ج م ع تك05",null,null,null,"أولى","جدع مشترك علوم وتكنولوجيا ",5,618,"E1",null,"تعاونية الحواس حي الشهداء مغنية  ",null,null,null,null,null,null,{"$f":"IF($J621=\"\",\"\",MATCH($J621,OFFSET(BASE!$C$5,,,MAX(BASE!$B:$B)),0))","v":23},{"$f":"IF($AA621=\"\",\"\",60*($AA621-1)+COUNTIF($AA$9:$AA621,$AA621))","v":1349},"E1",1,"E",null,"جيلالي ",null," جيلالي "]
[619," ",1000713270107100,null,null,"ذكر","2007-04-29","مغنية","خارجي","ج م ع تك05",null,null,null,"أولى","جدع مشترك علوم وتكنولوجيا ",5,619,"E1",null,"حي الشهداء -  مغنية -  ",null,null,null,null,null,null,{"$f":"IF($J622=\"\",\"\",MATCH($J622,OFFSET(BASE!$C$5,,,MAX(BASE!$B:$B)),0))","v":23},{"$f":"IF($AA622=\"\",\"\",60*($AA622-1)+COUNTIF($AA$9:$AA622,$AA622))","v":1350},"E1",1,"E",null,"امحمد ",null," امحمد "]
[620," ",1100713270050900,null,null,"أنثى","2007-02-27","مغنية","خارجي","ج م ع تك05",null,null,null,"أولى","جدع مشترك علوم وتكنولوجيا ",5,620,"E2",null,"تعاونية الحواس حي الشهداء - مغنية -  ",null,null,null,null,null,null,{"$f":"IF($J623=\"\",\"\",MATCH($J623,OFFSET(BASE!$C$5,,,MAX(BASE!$B:$B)),0))","v":23},{"$f":"IF($AA623=\"\",\"\",60*($AA623-1)+COUNTIF($AA$9:$AA623,$AA623))","v":1351},"E2",2,"E",null,"واسيني ",null," واسيني "]
[621," ",1100713270081100,null,null,"أنثى","2007-04-03","مغنية","خارجي","ج م ع تك05",null,null,null,"أولى","جدع مشترك علوم وتكنولوجيا ",5,621,"E2",null,"شارع 15 رقم 05 حي الشهداء - مغنية -  ",null,null,null,null,null,null,{"$f":"IF($J624=\"\",\"\",MATCH($J624,OFFSET(BASE!$C$5,,,MAX(BASE!$B:$B)),0))","v":23},{"$f":"IF($AA624=\"\",\"\",60*($AA624-1)+COUNTIF($AA$9:$AA624,$AA624))","v":1352},"E2",2,"E",null,"حسين ",null," حسين "]
[622," ",1100613270225800,null,null,"أنثى","2006-08-11","مغنية","خارجي","ج م ع تك05",null,null,null,"أولى","جدع مشترك علوم وتكنولوجيا ",5,622,"E2",null,"رقم 54 شارع محطة القطار - مغنية - ",null,null,null,null,null,null,{"$f":"IF($J625=\"\",\"\",MATCH($J625,OFFSET(BASE!$C$5,,,MAX(BASE!$B:$B)),0))","v":23},{"$f":"IF($AA625=\"\",\"\",60*($AA625-1)+COUNTIF($AA$9:$AA625,$AA625))","v":1353},"E2",2,"E",null,"محمد ",null," محمد "]
[623," ",1100613270244700,null,null,"أنثى","2006-08-26","مغنية","نصف داخلي","ج م أ01",null,null,null,"أولى","جدع مشترك آداب  ",1,623,"D2",null,"قرية البطيم ",null,null,null,null,null,null,{"$f":"IF($J626=\"\",\"\",MATCH($J626,OFFSET(BASE!$C$5,,,MAX(BASE!$B:$B)),0))","v":24},{"$f":"IF($AA626=\"\",\"\",60*($AA626-1)+COUNTIF($AA$9:$AA626,$AA626))","v":1381},"D2",2,"D",null,"لحبيب ",null," لحبيب "]
[624," ",1100513270003500,null,null,"أنثى","2005-01-04","مغنية","نصف داخلي","ج م أ01",null,null,null,"أولى","جدع مشترك آداب  ",1,624,"D2",null,"قرية العقيد لطفي ",null,null,null,null,null,null,{"$f":"IF($J627=\"\",\"\",MATCH($J627,OFFSET(BASE!$C$5,,,MAX(BASE!$B:$B)),0))","v":24},{"$f":"IF($AA627=\"\",\"\",60*($AA627-1)+COUNTIF($AA$9:$AA627,$AA627))","v":1382},"D2",2,"D",null,"محمد ",null," محمد "]
[625," ",1100713270287100,null,null,"أنثى","2007-10-08","مغنية","نصف داخلي","ج م أ01",null,null,null,"أولى","جدع مشترك آداب  ",1,625,"D2",null,"قرية البطيم ",null,null,null,null,null,null,{"$f":"IF($J628=\"\",\"\",MATCH($J628,OFFSET(BASE!$C$5,,,MAX(BASE!$B:$B)),0))","v":24},{"$f":"IF($AA628=\"\",\"\",60*($AA628-1)+COUNTIF($AA$9:$AA628,$AA628))","v":1383},"D2",2,"D",null,"مصطفى ",null," مصطفى "]
[626," ",1100713270259700,null,null,"أنثى","2007-09-12","مغنية","نصف داخلي","ج م أ01",null,null,null,"أولى","جدع مشترك آداب  ",1,626,"D2",null,"قرية البطيم -مغنية- ",null,null,null,null,null,null,{"$f":"IF($J629=\"\",\"\",MATCH($J629,OFFSET(BASE!$C$5,,,MAX(BASE!$B:$B)),0))","v":24},{"$f":"IF($AA629=\"\",\"\",60*($AA629-1)+COUNTIF($AA$9:$AA629,$AA629))","v":1384},"D2",2,"D",null,"بلخير ",null," بلخير "]
[627," ",1000813010287500,null,null,"ذكر","2008-04-20","تلمسان","نصف داخلي","ج م أ01",null,null,null,"أولى","جدع مشترك آداب  ",1,627,"D1",null,"سيدي مجاهد بني بوسعيد تلمسان ",null,null,null,null,null,null,{"$f":"IF($J630=\"\",\"\",MATCH($J630,OFFSET(BASE!$C$5,,,MAX(BASE!$B:$B)),0))","v":24},{"$f":"IF($AA630=\"\",\"\",60*($AA630-1)+COUNTIF($AA$9:$AA630,$AA630))","v":1385},"D1",1,"D",null,"نور الدين ",null," نور الدين "]
[628," ",1100613270106700,null,null,"أنثى","2006-05-07","مغنية","نصف داخلي","ج م أ01",null,null,null,"أولى","جدع مشترك آداب  ",1,628,"D2",null,"قرية العقيد عباس - مغنية - ",null,null,null,null,null,null,{"$f":"IF($J631=\"\",\"\",MATCH($J631,OFFSET(BASE!$C$5,,,MAX(BASE!$B:$B)),0))","v":24},{"$f":"IF($AA631=\"\",\"\",60*($AA631-1)+COUNTIF($AA$9:$AA631,$AA631))","v":1386},"D2",2,"D",null,"شعبان ",null," شعبان "]
[629," ",1000713270020400,null,null,"ذكر","2007-01-22","مغنية","نصف داخلي","ج م أ01",null,null,null,"أولى","جدع مشترك آداب  ",1,629,"D1",null,"قرية العقيد عباس -  مغنية -  ",null,null,null,null,null,null,{"$f":"IF($J632=\"\",\"\",MATCH($J632,OFFSET(BASE!$C$5,,,MAX(BASE!$B:$B)),0))","v":24},{"$f":"IF($AA632=\"\",\"\",60*($AA632-1)+COUNTIF($AA$9:$AA632,$AA632))","v":1387},"D1",1,"D",null,"بن اعمر ",null," بن اعمر "]
[630," ",1100613270313000,null,null,"أنثى","2006-10-23","مغنية","نصف داخلي","ج م أ01",null,null,null,"أولى","جدع مشترك آداب  ",1,630,"D2",null,"قرية المصامدة - مغنية - تلمسان ",null,null,null,null,null,null,{"$f":"IF($J633=\"\",\"\",MATCH($J633,OFFSET(BASE!$C$5,,,MAX(BASE!$B:$B)),0))","v":24},{"$f":"IF($AA633=\"\",\"\",60*($AA633-1)+COUNTIF($AA$9:$AA633,$AA633))","v":1388},"D2",2,"D",null,"بن عبد الله  ",null," بن عبد الله  "]
[631," ",1000513270027600,null,null,"ذكر","2005-01-13","تلمسان","نصف داخلي","ج م أ01",null,null,null,"أولى","جدع مشترك آداب  ",1,631,"D1",null,"قرية البطيم-مغنية- ",null,null,null,null,null,null,{"$f":"IF($J634=\"\",\"\",MATCH($J634,OFFSET(BASE!$C$5,,,MAX(BASE!$B:$B)),0))","v":24},{"$f":"IF($AA634=\"\",\"\",60*($AA634-1)+COUNTIF($AA$9:$AA634,$AA634))","v":1389},"D1",1,"D",null,"جمال ",null," جمال "]
[632," ",1000713270206300,null,null,"ذكر","2007-07-27","مغنية","نصف داخلي","ج م أ01",null,null,null,"أولى","جدع مشترك آداب  ",1,632,"D1",null,"قرية المصامدة - مغنية - تلمسان ",null,null,null,null,null,null,{"$f":"IF($J635=\"\",\"\",MATCH($J635,OFFSET(BASE!$C$5,,,MAX(BASE!$B:$B)),0))","v":24},{"$f":"IF($AA635=\"\",\"\",60*($AA635-1)+COUNTIF($AA$9:$AA635,$AA635))","v":1390},"D1",1,"D",null,"امحمد ",null," امحمد "]
[633," ",1100713011004100,null,null,"أنثى","2007-12-12","تلمسان","نصف داخلي","ج م أ01",null,null,null,"أولى","جدع مشترك آداب  ",1,633,"D2",null,"قرية المصامدة - مغنية - تلمسان ",null,null,null,null,null,null,{"$f":"IF($J636=\"\",\"\",MATCH($J636,OFFSET(BASE!$C$5,,,MAX(BASE!$B:$B)),0))","v":24},{"$f":"IF($AA636=\"\",\"\",60*($AA636-1)+COUNTIF($AA$9:$AA636,$AA636))","v":1391},"D2",2,"D",null,"جواد ",null," جواد "]
[634," ",1100613270153000,null,null,"أنثى","2006-06-13","مغنية","نصف داخلي","ج م أ01",null,null,null,"أولى","جدع مشترك آداب  ",1,634,"D2",null,"قرية العقيد عباس -  مغنية - ",null,null,null,null,null,null,{"$f":"IF($J637=\"\",\"\",MATCH($J637,OFFSET(BASE!$C$5,,,MAX(BASE!$B:$B)),0))","v":24},{"$f":"IF($AA637=\"\",\"\",60*($AA637-1)+COUNTIF($AA$9:$AA637,$AA637))","v":1392},"D2",2,"D",null,"يوسف ",null," يوسف "]
[635," ",1000613270232800,null,null,"ذكر","2006-08-15","مغنية","نصف داخلي","ج م أ01",null,null,null,"أولى","جدع مشترك آداب  ",1,635,"D1",null,"قرية المصامدة - مغنية - تلمسان ",null,null,null,null,null,null,{"$f":"IF($J638=\"\",\"\",MATCH($J638,OFFSET(BASE!$C$5,,,MAX(BASE!$B:$B)),0))","v":24},{"$f":"IF($AA638=\"\",\"\",60*($AA638-1)+COUNTIF($AA$9:$AA638,$AA638))","v":1393},"D1",1,"D",null,"بوبكر ",null," بوبكر "]
[636," ",1100513270199600,null,null,"أنثى","2005-07-17","مغنية","نصف داخلي","ج م أ01",null,null,null,"أولى","جدع مشترك آداب  ",1,636,"D2",null,"قرية المصامدة - مغنية - تلمسان ",null,null,null,null,null,null,{"$f":"IF($J639=\"\",\"\",MATCH($J639,OFFSET(BASE!$C$5,,,MAX(BASE!$B:$B)),0))","v":24},{"$f":"IF($AA639=\"\",\"\",60*($AA639-1)+COUNTIF($AA$9:$AA639,$AA639))","v":1394},"D2",2,"D",null,"عبد القادر ",null," عبد القادر "]
[637," ",1100713270139600,null,null,"أنثى","2007-05-31","مغنية","نصف داخلي","ج م أ01",null,null,null,"أولى","جدع مشترك آداب  ",1,637,"D2",null,"قرية المصامدة - مغنية - ",null,null,null,null,null,null,{"$f":"IF($J640=\"\",\"\",MATCH($J640,OFFSET(BASE!$C$5,,,MAX(BASE!$B:$B)),0))","v":24},{"$f":"IF($AA640=\"\",\"\",60*($AA640-1)+COUNTIF($AA$9:$AA640,$AA640))","v":1395},"D2",2,"D",null,"مصطفى ",null," مصطفى "]
[638," ",1000413270331000,null,null,"ذكر","2004-12-01","مغنية","نصف داخلي","ج م أ01",null,null,null,"أولى","جدع مشترك آداب  ",1,638,"D1",null,"قرية البخاتة ",null,null,null,null,null,null,{"$f":"IF($J641=\"\",\"\",MATCH($J641,OFFSET(BASE!$C$5,,,MAX(BASE!$B:$B)),0))","v":24},{"$f":"IF($AA641=\"\",\"\",60*($AA641-1)+COUNTIF($AA$9:$AA641,$AA641))","v":1396},"D1",1,"D",null,"محمد ",null," محمد "]
[639," ",1100713270100900,null,null,"أنثى","2005-05-13","مغنية","نصف داخلي","ج م أ01",null,null,null,"أولى","جدع مشترك آداب  ",1,639,"D2",null,"قرية العقيد عباس مغنية ",null,null,null,null,null,null,{"$f":"IF($J642=\"\",\"\",MATCH($J642,OFFSET(BASE!$C$5,,,MAX(BASE!$B:$B)),0))","v":24},{"$f":"IF($AA642=\"\",\"\",60*($AA642-1)+COUNTIF($AA$9:$AA642,$AA642))","v":1397},"D2",2,"D",null,"محمد ",null," محمد "]
[640," ",1100513270110100,null,null,"أنثى","2007-04-23","مغنية","نصف داخلي","ج م أ01",null,null,null,"أولى","جدع مشترك آداب  ",1,640,"D2",null,"قرية العقيد لطفي ",null,null,null,null,null,null,{"$f":"IF($J643=\"\",\"\",MATCH($J643,OFFSET(BASE!$C$5,,,MAX(BASE!$B:$B)),0))","v":24},{"$f":"IF($AA643=\"\",\"\",60*($AA643-1)+COUNTIF($AA$9:$AA643,$AA643))","v":1398},"D2",2,"D",null,"جمال ",null," جمال "]
[641,{"$f":"D644& \" \" &E644","v":" "},1100713270156700,null,null,"أنثى","2007-06-12","مغنية","نصف داخلي","ج م أ01",null,null,null,"أولى","جدع مشترك آداب  ",1,641,"D2",null,"قرية المصامدة - مغنية - ",null,null,null,null,null,null,{"$f":"IF($J644=\"\",\"\",MATCH($J644,OFFSET(BASE!$C$5,,,MAX(BASE!$B:$B)),0))","v":24},{"$f":"IF($AA644=\"\",\"\",60*($AA644-1)+COUNTIF($AA$9:$AA644,$AA644))","v":1399},"D2",2,"D",null,"محمد ",null," محمد "]
[642," ",1000746230072800,null,null,"أنثى","2007-10-25","بني صاف","نصف داخلي","ج م أ01",null,null,null,"أولى","جدع مشترك آداب  ",1,642,"D2",null,"شارع 13 رقم 28 حي الشهيد قاضي محمد مغنية ",null,null,null,null,null,null,{"$f":"IF($J645=\"\",\"\",MATCH($J645,OFFSET(BASE!$C$5,,,MAX(BASE!$B:$B)),0))","v":24},{"$f":"IF($AA645=\"\",\"\",60*($AA645-1)+COUNTIF($AA$9:$AA645,$AA645))","v":1400},"D2",2,"D",null,"منصور ",null," منصور "]
[643," ",1100613270348400,null,null,"أنثى","2006-11-24","مغنية","نصف داخلي","ج م أ01",null,null,null,"أولى","جدع مشترك آداب  ",1,643,"D2",null,"قرية البطيم مغنية ",null,null,null,null,null,null,{"$f":"IF($J646=\"\",\"\",MATCH($J646,OFFSET(BASE!$C$5,,,MAX(BASE!$B:$B)),0))","v":24},{"$f":"IF($AA646=\"\",\"\",60*($AA646-1)+COUNTIF($AA$9:$AA646,$AA646))","v":1401},"D2",2,"D",null,"يوسف ",null," يوسف "]
[644," ",1100513270270500,null,null,"أنثى","2005-09-19","مغنية","نصف داخلي","ج م أ01",null,null,null,"أولى","جدع مشترك آداب  ",1,644,"D2",null,"قرية المصامدة - مغنية - تلمسان ",null,null,null,null,null,null,{"$f":"IF($J647=\"\",\"\",MATCH($J647,OFFSET(BASE!$C$5,,,MAX(BASE!$B:$B)),0))","v":24},{"$f":"IF($AA647=\"\",\"\",60*($AA647-1)+COUNTIF($AA$9:$AA647,$AA647))","v":1402},"D2",2,"D",null,"طيب ",null," طيب "]
[645," ",1000613270304800,null,null,"ذكر","2006-10-15","مغنية","نصف داخلي","ج م أ01",null,null,null,"أولى","جدع مشترك آداب  ",1,645,"D1",null,"قرية البطيم مغنية ",null,null,null,null,null,null,{"$f":"IF($J648=\"\",\"\",MATCH($J648,OFFSET(BASE!$C$5,,,MAX(BASE!$B:$B)),0))","v":24},{"$f":"IF($AA648=\"\",\"\",60*($AA648-1)+COUNTIF($AA$9:$AA648,$AA648))","v":1403},"D1",1,"D",null,"الشيخ ",null," الشيخ "]
[646," ",1100613270084600,null,null,"أنثى","2006-04-12","مغنية","نصف داخلي","ج م أ01",null,null,null,"أولى","جدع مشترك آداب  ",1,646,"D2",null,"اولاد معيذر ",null,null,null,null,null,null,{"$f":"IF($J649=\"\",\"\",MATCH($J649,OFFSET(BASE!$C$5,,,MAX(BASE!$B:$B)),0))","v":24},{"$f":"IF($AA649=\"\",\"\",60*($AA649-1)+COUNTIF($AA$9:$AA649,$AA649))","v":1404},"D2",2,"D",null,"صديق ",null,{"$f":"D649 & \" \" & AG649","v":" صديق "}]
[647," ",1000613270211800,null,null,"ذكر","2006-07-28","مغنية","نصف داخلي","ج م أ01",null,null,null,"أولى","جدع مشترك آداب  ",1,647,"D1",null,"قرية البطيم ",null,null,null,null,null,null,{"$f":"IF($J650=\"\",\"\",MATCH($J650,OFFSET(BASE!$C$5,,,MAX(BASE!$B:$B)),0))","v":24},{"$f":"IF($AA650=\"\",\"\",60*($AA650-1)+COUNTIF($AA$9:$AA650,$AA650))","v":1405},{"$f":"AE650&AD650","v":"D1"},{"$f":"IF(F650=\"أنثى\",2,1)","v":1},{"$f":"IF(I650=\"نصف داخلي\",\"D\",\"E\")","v":"D"},null,"محمد ",null," محمد "]
[648," ",1000613270218600,null,null,"ذكر","2006-08-03","مغنية","نصف داخلي","ج م أ01",null,null,null,"أولى","جدع مشترك آداب  ",1,648,"D1",null,"قرية المصامدة - مغنية - تلمسان ",null,null,null,null,null,null,{"$f":"IF($J651=\"\",\"\",MATCH($J651,OFFSET(BASE!$C$5,,,MAX(BASE!$B:$B)),0))","v":24},{"$f":"IF($AA651=\"\",\"\",60*($AA651-1)+COUNTIF($AA$9:$AA651,$AA651))","v":1406},"D1",1,"D",null,"حبيب ",null," حبيب "]
[649," ",1000513270306800,null,null,"ذكر","2005-10-16","مغنية","نصف داخلي","ج م أ01",null,null,null,"أولى","جدع مشترك آداب  ",1,649,"D1",null,"قرية البطيم مغنية ",null,null,null,null,null,null,{"$f":"IF($J652=\"\",\"\",MATCH($J652,OFFSET(BASE!$C$5,,,MAX(BASE!$B:$B)),0))","v":24},{"$f":"IF($AA652=\"\",\"\",60*($AA652-1)+COUNTIF($AA$9:$AA652,$AA652))","v":1407},"D1",1,"D",null,"بلخير ",null," بلخير "]
[650," ",1100613270481700,null,null,"أنثى","2006-01-07","مغنية","نصف داخلي","ج م أ01",null,null,null,"أولى","جدع مشترك آداب  ",1,650,"D2",null,"حي عمر الختار -مغنية ",null,null,null,null,null,null,{"$f":"IF($J653=\"\",\"\",MATCH($J653,OFFSET(BASE!$C$5,,,MAX(BASE!$B:$B)),0))","v":24},{"$f":"IF($AA653=\"\",\"\",60*($AA653-1)+COUNTIF($AA$9:$AA653,$AA653))","v":1408},"D2",2,"D",null,"حسن ",null," حسن "]
[651," ",5900507600182700,null,null,"أنثى","2005-01-01","سوريا","خارجي","ج م أ01",null,null,null,"أولى","جدع مشترك آداب  ",1,651,"E2",null,"حي الشهداء - مغنية -  ",null,null,null,null,null,null,{"$f":"IF($J654=\"\",\"\",MATCH($J654,OFFSET(BASE!$C$5,,,MAX(BASE!$B:$B)),0))","v":24},{"$f":"IF($AA654=\"\",\"\",60*($AA654-1)+COUNTIF($AA$9:$AA654,$AA654))","v":1409},"E2",2,"E",null,"حسن ",null," حسن "]
[652," ",1000713010777200,null,null,"ذكر","2007-09-23","تلمسان","خارجي","ج م أ01",null,null,null,"أولى","جدع مشترك آداب  ",1,652,"E1",null,"مسجد الامام البوخاري حي الشهداء - مغنية -  ",null,null,null,null,null,null,{"$f":"IF($J655=\"\",\"\",MATCH($J655,OFFSET(BASE!$C$5,,,MAX(BASE!$B:$B)),0))","v":24},{"$f":"IF($AA655=\"\",\"\",60*($AA655-1)+COUNTIF($AA$9:$AA655,$AA655))","v":1410},"E1",1,"E",null,"عبد الحميد ",null," عبد الحميد "]
[653," ",1000520010518900,null,null,"ذكر","2005-11-22","سعيدة","خارجي","ج م أ01",null,null,null,"أولى","جدع مشترك آداب  ",1,653,"E1",null,"قرية المصامدة - مغنية - تلمسان ",null,null,null,null,null,null,{"$f":"IF($J656=\"\",\"\",MATCH($J656,OFFSET(BASE!$C$5,,,MAX(BASE!$B:$B)),0))","v":24},{"$f":"IF($AA656=\"\",\"\",60*($AA656-1)+COUNTIF($AA$9:$AA656,$AA656))","v":1411},"E1",1,"E",null,"الحبيب ",null," الحبيب "]
[654," ",1100613270057700,null,null,"أنثى","2006-03-09","مغنية","خارجي","ج م أ01",null,null,null,"أولى","جدع مشترك آداب  ",1,654,"E2",null,"حي الشهداء - مغنية - ",null,null,null,null,null,null,{"$f":"IF($J657=\"\",\"\",MATCH($J657,OFFSET(BASE!$C$5,,,MAX(BASE!$B:$B)),0))","v":24},{"$f":"IF($AA657=\"\",\"\",60*($AA657-1)+COUNTIF($AA$9:$AA657,$AA657))","v":1412},"E2",2,"E",null,"مصطفى ",null," مصطفى "]
[655," ",1000513270229800,null,null,"ذكر","2005-08-10","مغنية","خارجي","ج م أ01",null,null,null,"أولى","جدع مشترك آداب  ",1,655,"E1",null,"قرية العقيد عباس  - مغنية - ",null,null,null,null,null,null,{"$f":"IF($J658=\"\",\"\",MATCH($J658,OFFSET(BASE!$C$5,,,MAX(BASE!$B:$B)),0))","v":24},{"$f":"IF($AA658=\"\",\"\",60*($AA658-1)+COUNTIF($AA$9:$AA658,$AA658))","v":1413},"E1",1,"E",null,"البكاي ",null," البكاي "]
[656," ",1000413270193100,null,null,"ذكر","2004-07-22","مغنية","خارجي","ج م أ01",null,null,null,"أولى","جدع مشترك آداب  ",1,656,"E1",null,"شارع 23 رقم 6 حي الشهداء - مغنية -  ",null,null,null,null,null,null,{"$f":"IF($J659=\"\",\"\",MATCH($J659,OFFSET(BASE!$C$5,,,MAX(BASE!$B:$B)),0))","v":24},{"$f":"IF($AA659=\"\",\"\",60*($AA659-1)+COUNTIF($AA$9:$AA659,$AA659))","v":1414},"E1",1,"E",null,"عمر ",null," عمر "]
[657," ",1000613270176900,null,null,"ذكر","2006-07-01","مغنية","نصف داخلي","ج م أ02",null,null,null,"أولى","جدع مشترك آداب  ",2,657,"D1",null,"قرية البطيم مغنية ",null,null,null,null,null,null,{"$f":"IF($J660=\"\",\"\",MATCH($J660,OFFSET(BASE!$C$5,,,MAX(BASE!$B:$B)),0))","v":25},{"$f":"IF($AA660=\"\",\"\",60*($AA660-1)+COUNTIF($AA$9:$AA660,$AA660))","v":1441},"D1",1,"D",null,"مسعود ",null," مسعود "]
[658," ",1100713270178300,null,null,"أنثى","2007-07-02","مغنية","نصف داخلي","ج م أ02",null,null,null,"أولى","جدع مشترك آداب  ",2,658,"D2",null,"قرية العقيد لطفي ",null,null,null,null,null,null,{"$f":"IF($J661=\"\",\"\",MATCH($J661,OFFSET(BASE!$C$5,,,MAX(BASE!$B:$B)),0))","v":25},{"$f":"IF($AA661=\"\",\"\",60*($AA661-1)+COUNTIF($AA$9:$AA661,$AA661))","v":1442},"D2",2,"D",null,"عبد النبي ",null," عبد النبي "]
[659," ",1100613270349000,null,null,"أنثى","2006-11-25","مغنية","نصف داخلي","ج م أ02",null,null,null,"أولى","جدع مشترك آداب  ",2,659,"D2",null,"مزرعة شرقاوي العيد  - مغنية -  ",null,null,null,null,null,null,{"$f":"IF($J662=\"\",\"\",MATCH($J662,OFFSET(BASE!$C$5,,,MAX(BASE!$B:$B)),0))","v":25},{"$f":"IF($AA662=\"\",\"\",60*($AA662-1)+COUNTIF($AA$9:$AA662,$AA662))","v":1443},"D2",2,"D",null,"محمد ",null," محمد "]
[660," ",1100613270754200,null,null,"أنثى","2006-09-03","مغنية","نصف داخلي","ج م أ02",null,null,null,"أولى","جدع مشترك آداب  ",2,660,"D2",null,"العقيد عباس - مغنية -  ",null,null,null,null,null,null,{"$f":"IF($J663=\"\",\"\",MATCH($J663,OFFSET(BASE!$C$5,,,MAX(BASE!$B:$B)),0))","v":25},{"$f":"IF($AA663=\"\",\"\",60*($AA663-1)+COUNTIF($AA$9:$AA663,$AA663))","v":1444},"D2",2,"D",null,"طيب ",null," طيب "]
[661," ",1000813010150900,null,null,"ذكر","2008-02-29","تلمسان","نصف داخلي","ج م أ02",null,null,null,"أولى","جدع مشترك آداب  ",2,661,"D1",null,"حي الركيزة حمام بوغرارة ",null,null,null,null,null,null,{"$f":"IF($J664=\"\",\"\",MATCH($J664,OFFSET(BASE!$C$5,,,MAX(BASE!$B:$B)),0))","v":25},{"$f":"IF($AA664=\"\",\"\",60*($AA664-1)+COUNTIF($AA$9:$AA664,$AA664))","v":1445},"D1",1,"D",null,"توهامي ",null," توهامي "]
[662," ",1100713270298100,null,null,"أنثى","2007-10-19","مغنية","نصف داخلي","ج م أ02",null,null,null,"أولى","جدع مشترك آداب  ",2,662,"D2",null,"العقيد لطفي ",null,null,null,null,null,null,{"$f":"IF($J665=\"\",\"\",MATCH($J665,OFFSET(BASE!$C$5,,,MAX(BASE!$B:$B)),0))","v":25},{"$f":"IF($AA665=\"\",\"\",60*($AA665-1)+COUNTIF($AA$9:$AA665,$AA665))","v":1446},"D2",2,"D",null,"حميد ",null," حميد "]
[663," ",1100731011129300,null,null,"أنثى","2007-09-09","وهران","نصف داخلي","ج م أ02",null,null,null,"أولى","جدع مشترك آداب  ",2,663,"D2",null,null,null,null,null,null,null,null,{"$f":"IF($J666=\"\",\"\",MATCH($J666,OFFSET(BASE!$C$5,,,MAX(BASE!$B:$B)),0))","v":25},{"$f":"IF($AA666=\"\",\"\",60*($AA666-1)+COUNTIF($AA$9:$AA666,$AA666))","v":1447},"D2",2,"D",null,null,null," "]
[664," ",1000313270250900,null,null,"ذكر","2003-10-26","مغنية","نصف داخلي","ج م أ02",null,null,null,"أولى","جدع مشترك آداب  ",2,664,"D1",null,"قرية العقيد عباس  - مغنية -  تلمسان ",null,null,null,null,null,null,{"$f":"IF($J667=\"\",\"\",MATCH($J667,OFFSET(BASE!$C$5,,,MAX(BASE!$B:$B)),0))","v":25},{"$f":"IF($AA667=\"\",\"\",60*($AA667-1)+COUNTIF($AA$9:$AA667,$AA667))","v":1448},"D1",1,"D",null,"محمد ",null," محمد "]
[665," ",1100613270354800,null,null,"أنثى","2006-12-01","مغنية","نصف داخلي","ج م أ02",null,null,null,"أولى","جدع مشترك آداب  ",2,665,"D2",null,"قرية العقيد لطفي ",null,null,null,null,null,null,{"$f":"IF($J668=\"\",\"\",MATCH($J668,OFFSET(BASE!$C$5,,,MAX(BASE!$B:$B)),0))","v":25},{"$f":"IF($AA668=\"\",\"\",60*($AA668-1)+COUNTIF($AA$9:$AA668,$AA668))","v":1449},"D2",2,"D",null,"ميلود ",null," ميلود "]
[666," ",1100713270196900,null,null,"أنثى","2007-07-19","مغنية","نصف داخلي","ج م أ02",null,null,null,"أولى","جدع مشترك آداب  ",2,666,"D2",null,"قرية العقيد عباس مغنية ",null,null,null,null,null,null,{"$f":"IF($J669=\"\",\"\",MATCH($J669,OFFSET(BASE!$C$5,,,MAX(BASE!$B:$B)),0))","v":25},{"$f":"IF($AA669=\"\",\"\",60*($AA669-1)+COUNTIF($AA$9:$AA669,$AA669))","v":1450},"D2",2,"D",null,"عبد القادر ",null," عبد القادر "]
[667," ",1100513270302900,null,null,"أنثى","2005-10-12","مغنية","نصف داخلي","ج م أ02",null,null,null,"أولى","جدع مشترك آداب  ",2,667,"D2",null,"قرية المصامدة - مغنية - تلمسان ",null,null,null,null,null,null,{"$f":"IF($J670=\"\",\"\",MATCH($J670,OFFSET(BASE!$C$5,,,MAX(BASE!$B:$B)),0))","v":25},{"$f":"IF($AA670=\"\",\"\",60*($AA670-1)+COUNTIF($AA$9:$AA670,$AA670))","v":1451},"D2",2,"D",null,"بن عبد الله ",null," بن عبد الله "]
[668," ",1100713270120600,null,null,"أنثى","2007-05-13","مغنية","نصف داخلي","ج م أ02",null,null,null,"أولى","جدع مشترك آداب  ",2,668,"D2",null,"قرية العقيد عباس مغنية ",null,null,null,null,null,null,{"$f":"IF($J671=\"\",\"\",MATCH($J671,OFFSET(BASE!$C$5,,,MAX(BASE!$B:$B)),0))","v":25},{"$f":"IF($AA671=\"\",\"\",60*($AA671-1)+COUNTIF($AA$9:$AA671,$AA671))","v":1452},"D2",2,"D",null,"واسيني ",null," واسيني "]
[669," ",1000408010253900,null,null,"ذكر","2004-08-20","بشار","نصف داخلي","ج م أ02",null,null,null,"أولى","جدع مشترك آداب  ",2,669,"D1",null,"قرية البطيم مغنية ",null,null,null,null,null,null,{"$f":"IF($J672=\"\",\"\",MATCH($J672,OFFSET(BASE!$C$5,,,MAX(BASE!$B:$B)),0))","v":25},{"$f":"IF($AA672=\"\",\"\",60*($AA672-1)+COUNTIF($AA$9:$AA672,$AA672))","v":1453},"D1",1,"D",null,"يوسف ",null," يوسف "]
[670," ",1100713270348600,null,null,"أنثى","2007-12-11","مغنية","نصف داخلي","ج م أ02",null,null,null,"أولى","جدع مشترك آداب  ",2,670,"D2",null,"قرية البطيم-مغنية- ",null,null,null,null,null,null,{"$f":"IF($J673=\"\",\"\",MATCH($J673,OFFSET(BASE!$C$5,,,MAX(BASE!$B:$B)),0))","v":25},{"$f":"IF($AA673=\"\",\"\",60*($AA673-1)+COUNTIF($AA$9:$AA673,$AA673))","v":1454},"D2",2,"D",null,"محمد ",null," محمد "]
[671," ",1100613270104700,null,null,"أنثى","2006-05-05","مغنية","نصف داخلي","ج م أ02",null,null,null,"أولى","جدع مشترك آداب  ",2,671,"D2",null,"قرية العقيد لطفي ",null,null,null,null,null,null,{"$f":"IF($J674=\"\",\"\",MATCH($J674,OFFSET(BASE!$C$5,,,MAX(BASE!$B:$B)),0))","v":25},{"$f":"IF($AA674=\"\",\"\",60*($AA674-1)+COUNTIF($AA$9:$AA674,$AA674))","v":1455},"D2",2,"D",null,"عبد القادر ",null," عبد القادر "]
[672," ",1100713270165500,null,null,"أنثى","2007-06-21","مغنية","نصف داخلي","ج م أ02",null,null,null,"أولى","جدع مشترك آداب  ",2,672,"D2",null,"قرية البطيم ",null,null,null,null,null,null,{"$f":"IF($J675=\"\",\"\",MATCH($J675,OFFSET(BASE!$C$5,,,MAX(BASE!$B:$B)),0))","v":25},{"$f":"IF($AA675=\"\",\"\",60*($AA675-1)+COUNTIF($AA$9:$AA675,$AA675))","v":1456},"D2",2,"D",null,"عبد اله ",null," عبد اله "]
[673," ",1100513270242600,null,null,"أنثى","2005-08-21","مغنية","نصف داخلي","ج م أ02",null,null,null,"أولى","جدع مشترك آداب  ",2,673,"D2",null,"اولاد معيذر ",null,null,null,null,null,null,{"$f":"IF($J676=\"\",\"\",MATCH($J676,OFFSET(BASE!$C$5,,,MAX(BASE!$B:$B)),0))","v":25},{"$f":"IF($AA676=\"\",\"\",60*($AA676-1)+COUNTIF($AA$9:$AA676,$AA676))","v":1457},"D2",2,"D",null,"رضوان  ",null," رضوان  "]
[674," ",1100513270315800,null,null,"أنثى","2005-10-28","مغنية","نصف داخلي","ج م أ02",null,null,null,"أولى","جدع مشترك آداب  ",2,674,"D2",null,"قرية البطيم -مغنية- ",null,null,null,null,null,null,{"$f":"IF($J677=\"\",\"\",MATCH($J677,OFFSET(BASE!$C$5,,,MAX(BASE!$B:$B)),0))","v":25},{"$f":"IF($AA677=\"\",\"\",60*($AA677-1)+COUNTIF($AA$9:$AA677,$AA677))","v":1458},"D2",2,"D",null,"عبد المجيد ",null," عبد المجيد "]
[675," ",1000713270207700,null,null,"ذكر","2007-07-28","مغنية","نصف داخلي","ج م أ02",null,null,null,"أولى","جدع مشترك آداب  ",2,675,"D1",null,"قرية أولاد الشارف - مغنية -  ",null,null,null,null,null,null,{"$f":"IF($J678=\"\",\"\",MATCH($J678,OFFSET(BASE!$C$5,,,MAX(BASE!$B:$B)),0))","v":25},{"$f":"IF($AA678=\"\",\"\",60*($AA678-1)+COUNTIF($AA$9:$AA678,$AA678))","v":1459},"D1",1,"D",null,"عبد الحميد ",null," عبد الحميد "]
[676," ",1100713270034000,null,null,"أنثى","2007-02-06","مغنية","نصف داخلي","ج م أ02",null,null,null,"أولى","جدع مشترك آداب  ",2,676,"D2",null,"قرية العقيد عباس - مغنية - ",null,null,null,null,null,null,{"$f":"IF($J679=\"\",\"\",MATCH($J679,OFFSET(BASE!$C$5,,,MAX(BASE!$B:$B)),0))","v":25},{"$f":"IF($AA679=\"\",\"\",60*($AA679-1)+COUNTIF($AA$9:$AA679,$AA679))","v":1460},"D2",2,"D",null,"حبيب ",null," حبيب "]
[677," ",1000613270209400,null,null,"أنثى","2006-07-17","عين تموشنت","نصف داخلي","ج م أ02",null,null,null,"أولى","جدع مشترك آداب  ",2,677,"D2",null,"قرية أولاد الشارف - مغنية -  ",null,null,null,null,null,null,{"$f":"IF($J680=\"\",\"\",MATCH($J680,OFFSET(BASE!$C$5,,,MAX(BASE!$B:$B)),0))","v":25},{"$f":"IF($AA680=\"\",\"\",60*($AA680-1)+COUNTIF($AA$9:$AA680,$AA680))","v":1461},"D2",2,"D",null,"عبد العزيز ",null," عبد العزيز "]
[678," ",1000713270296700,null,null,"ذكر","2007-05-01","تلمسان","نصف داخلي","ج م أ02",null,null,null,"أولى","جدع مشترك آداب  ",2,678,"D1",null,"قرية أولاد الشارف - مغنية - ",null,null,null,null,null,null,{"$f":"IF($J681=\"\",\"\",MATCH($J681,OFFSET(BASE!$C$5,,,MAX(BASE!$B:$B)),0))","v":25},{"$f":"IF($AA681=\"\",\"\",60*($AA681-1)+COUNTIF($AA$9:$AA681,$AA681))","v":1462},"D1",1,"D",null,"بلعيد ",null," بلعيد "]
[679," ",1100613270320700,null,null,"أنثى","2006-10-29","مغنية","نصف داخلي","ج م أ02",null,null,null,"أولى","جدع مشترك آداب  ",2,679,"D2",null,"قرية البطيم ",null,null,null,null,null,null,{"$f":"IF($J682=\"\",\"\",MATCH($J682,OFFSET(BASE!$C$5,,,MAX(BASE!$B:$B)),0))","v":25},{"$f":"IF($AA682=\"\",\"\",60*($AA682-1)+COUNTIF($AA$9:$AA682,$AA682))","v":1463},"D2",2,"D",null,"الهاشمي ",null," الهاشمي "]
[680," ",1100613270130900,null,null,"أنثى","2006-05-27","مغنية","نصف داخلي","ج م أ02",null,null,null,"أولى","جدع مشترك آداب  ",2,680,"D2",null,"قرية المصامدة - مغنية - تلمسان ",null,null,null,null,null,null,{"$f":"IF($J683=\"\",\"\",MATCH($J683,OFFSET(BASE!$C$5,,,MAX(BASE!$B:$B)),0))","v":25},{"$f":"IF($AA683=\"\",\"\",60*($AA683-1)+COUNTIF($AA$9:$AA683,$AA683))","v":1464},"D2",2,"D",null,"يحي ",null," يحي "]
[681," ",1000613010140300,null,null,"ذكر","2006-03-01","تلمسان","خارجي","ج م أ02",null,null,null,"أولى","جدع مشترك آداب  ",2,681,"E1",null,"حي الشهداء - مغنية - ",null,null,null,null,null,null,{"$f":"IF($J684=\"\",\"\",MATCH($J684,OFFSET(BASE!$C$5,,,MAX(BASE!$B:$B)),0))","v":25},{"$f":"IF($AA684=\"\",\"\",60*($AA684-1)+COUNTIF($AA$9:$AA684,$AA684))","v":1465},"E1",1,"E",null,"محمد ",null," محمد "]
[682," ",1000713270222900,null,null,"ذكر","2007-08-09","مغنية","خارجي","ج م أ02",null,null,null,"أولى","جدع مشترك آداب  ",2,682,"E1",null,"حي الشهداء - مغنية - ",null,null,null,null,null,null,{"$f":"IF($J685=\"\",\"\",MATCH($J685,OFFSET(BASE!$C$5,,,MAX(BASE!$B:$B)),0))","v":25},{"$f":"IF($AA685=\"\",\"\",60*($AA685-1)+COUNTIF($AA$9:$AA685,$AA685))","v":1466},"E1",1,"E",null,"عبد القادر ",null," عبد القادر "]
[683," ",1100613270532100,null,null,"أنثى","2005-06-13","مغنية","خارجي","ج م أ02",null,null,null,"أولى","جدع مشترك آداب  ",2,683,"E2",null,"رقم 01 شارع تلمسان - مغنية -  ",null,null,null,null,null,null,{"$f":"IF($J686=\"\",\"\",MATCH($J686,OFFSET(BASE!$C$5,,,MAX(BASE!$B:$B)),0))","v":25},{"$f":"IF($AA686=\"\",\"\",60*($AA686-1)+COUNTIF($AA$9:$AA686,$AA686))","v":1467},"E2",2,"E",null,"عبد الناصر ",null," عبد الناصر "]
[684," ",1100613270087400,null,null,"أنثى","2006-04-15","مغنية","خارجي","ج م أ02",null,null,null,"أولى","جدع مشترك آداب  ",2,684,"E2",null,"قرية المصامدة - مغنية - تلمسان ",null,null,null,null,null,null,{"$f":"IF($J687=\"\",\"\",MATCH($J687,OFFSET(BASE!$C$5,,,MAX(BASE!$B:$B)),0))","v":25},{"$f":"IF($AA687=\"\",\"\",60*($AA687-1)+COUNTIF($AA$9:$AA687,$AA687))","v":1468},"E2",2,"E",null,"عبد اللطيف ",null," عبد اللطيف "]
[685," ",1000713270591100,null,null,"ذكر","2007-07-27","تلمسان","خارجي","ج م أ02",null,null,null,"أولى","جدع مشترك آداب  ",2,685,"E1",null,"حي الشهداء -مغنية- ",null,null,null,null,null,null,{"$f":"IF($J688=\"\",\"\",MATCH($J688,OFFSET(BASE!$C$5,,,MAX(BASE!$B:$B)),0))","v":25},{"$f":"IF($AA688=\"\",\"\",60*($AA688-1)+COUNTIF($AA$9:$AA688,$AA688))","v":1469},"E1",1,"E",null,"محمد ",null," محمد "]
[686," ",1100613270170000,null,null,"أنثى","2006-06-26","مغنية","خارجي","ج م أ02",null,null,null,"أولى","جدع مشترك آداب  ",2,686,"E2",null,"مزرعة جابر حي الشهداء  -  مغنية -  ",null,null,null,null,null,null,{"$f":"IF($J689=\"\",\"\",MATCH($J689,OFFSET(BASE!$C$5,,,MAX(BASE!$B:$B)),0))","v":25},{"$f":"IF($AA689=\"\",\"\",60*($AA689-1)+COUNTIF($AA$9:$AA689,$AA689))","v":1470},"E2",2,"E",null,"بن طلحة ",null," بن طلحة "]
[687," ",1100713011005800,null,null,"أنثى","2007-12-13","تلمسان","خارجي","ج م أ02",null,null,null,"أولى","جدع مشترك آداب  ",2,687,"E2",null,"حي الشهداء - مغنية -  ",null,null,null,null,null,null,{"$f":"IF($J690=\"\",\"\",MATCH($J690,OFFSET(BASE!$C$5,,,MAX(BASE!$B:$B)),0))","v":25},{"$f":"IF($AA690=\"\",\"\",60*($AA690-1)+COUNTIF($AA$9:$AA690,$AA690))","v":1471},"E2",2,"E",null,"فتحي ",null," فتحي "]
[688," ",1100713270023100,null,null,"أنثى","2007-01-24","مغنية","خارجي","ج م أ02",null,null,null,"أولى","جدع مشترك آداب  ",2,688,"E2",null,"مزرعة شعبان حمدون - مغنية -  ",null,null,null,null,null,null,{"$f":"IF($J691=\"\",\"\",MATCH($J691,OFFSET(BASE!$C$5,,,MAX(BASE!$B:$B)),0))","v":25},{"$f":"IF($AA691=\"\",\"\",60*($AA691-1)+COUNTIF($AA$9:$AA691,$AA691))","v":1472},"E2",2,"E",null,"مراد ",null," مراد "]
[689," ",1000631010385700,null,null,"ذكر","2006-04-08","وهران","خارجي","ج م أ02",null,null,null,"أولى","جدع مشترك آداب  ",2,689,"E1",null,"حي الشهداء - مغنية -  ",null,null,null,null,null,null,{"$f":"IF($J692=\"\",\"\",MATCH($J692,OFFSET(BASE!$C$5,,,MAX(BASE!$B:$B)),0))","v":25},{"$f":"IF($AA692=\"\",\"\",60*($AA692-1)+COUNTIF($AA$9:$AA692,$AA692))","v":1473},"E1",1,"E",null,"سنوسي ",null," سنوسي "]
[690," ",1000513270309400,null,null,"ذكر","2005-10-21","مغنية","خارجي","ج م أ02",null,null,null,"أولى","جدع مشترك آداب  ",2,690,"E1",null,"حي الشهداء - مغنية -  ",null,null,null,null,null,null,{"$f":"IF($J693=\"\",\"\",MATCH($J693,OFFSET(BASE!$C$5,,,MAX(BASE!$B:$B)),0))","v":25},{"$f":"IF($AA693=\"\",\"\",60*($AA693-1)+COUNTIF($AA$9:$AA693,$AA693))","v":1474},"E1",1,"E",null,"مجاهد ",null," مجاهد "]
[691," ",1100513270375700,null,null,"أنثى","2005-12-25","مغنية","نصف داخلي","ج م أ03",null,null,null,"أولى","جدع مشترك آداب  ",3,691,"D2",null,"قرية العقيد عباس - مغنية -  ",null,null,null,null,null,null,{"$f":"IF($J694=\"\",\"\",MATCH($J694,OFFSET(BASE!$C$5,,,MAX(BASE!$B:$B)),0))","v":26},{"$f":"IF($AA694=\"\",\"\",60*($AA694-1)+COUNTIF($AA$9:$AA694,$AA694))","v":1501},"D2",2,"D",null,"أحمد ",null," أحمد "]
[692," ",1000513270313500,null,null,"ذكر","2005-10-24","مغنية","نصف داخلي","ج م أ03",null,null,null,"أولى","جدع مشترك آداب  ",3,692,"D1",null,"شارع بلعيدي العيد صبرة ",null,null,null,null,null,null,{"$f":"IF($J695=\"\",\"\",MATCH($J695,OFFSET(BASE!$C$5,,,MAX(BASE!$B:$B)),0))","v":26},{"$f":"IF($AA695=\"\",\"\",60*($AA695-1)+COUNTIF($AA$9:$AA695,$AA695))","v":1502},"D1",1,"D",null,"كمال ",null," كمال "]
[693," ",1000613270252300,null,null,"ذكر","2006-09-02","مغنية","نصف داخلي","ج م أ03",null,null,null,"أولى","جدع مشترك آداب  ",3,693,"D1",null,"قرية البطيم مغنية ",null,null,null,null,null,null,{"$f":"IF($J696=\"\",\"\",MATCH($J696,OFFSET(BASE!$C$5,,,MAX(BASE!$B:$B)),0))","v":26},{"$f":"IF($AA696=\"\",\"\",60*($AA696-1)+COUNTIF($AA$9:$AA696,$AA696))","v":1503},"D1",1,"D",null,"محمد ",null," محمد "]
[694," ",1000613270076500,null,null,"ذكر","2006-02-09","مغنية","نصف داخلي","ج م أ03",null,null,null,"أولى","جدع مشترك آداب  ",3,694,"D1",null,"قرية العقيد عباس مغنية ",null,null,null,null,null,null,{"$f":"IF($J697=\"\",\"\",MATCH($J697,OFFSET(BASE!$C$5,,,MAX(BASE!$B:$B)),0))","v":26},{"$f":"IF($AA697=\"\",\"\",60*($AA697-1)+COUNTIF($AA$9:$AA697,$AA697))","v":1504},"D1",1,"D",null,"فتحي ",null," فتحي "]
[695," ",1300513270907800,null,null,"أنثى","2005-12-28","تلمسان","نصف داخلي","ج م أ03",null,null,null,"أولى","جدع مشترك آداب  ",3,695,"D2",null,"قرية العقيد لطفي ",null,null,null,null,null,null,{"$f":"IF($J698=\"\",\"\",MATCH($J698,OFFSET(BASE!$C$5,,,MAX(BASE!$B:$B)),0))","v":26},{"$f":"IF($AA698=\"\",\"\",60*($AA698-1)+COUNTIF($AA$9:$AA698,$AA698))","v":1505},"D2",2,"D",null,"برابح فاطمة ",null," برابح فاطمة "]
[696," ",1100513270274400,null,null,"أنثى","2005-09-17","مغنية","نصف داخلي","ج م أ03",null,null,null,"أولى","جدع مشترك آداب  ",3,696,"D2",null,"قرية العقيد عباس مغنية ",null,null,null,null,null,null,{"$f":"IF($J699=\"\",\"\",MATCH($J699,OFFSET(BASE!$C$5,,,MAX(BASE!$B:$B)),0))","v":26},{"$f":"IF($AA699=\"\",\"\",60*($AA699-1)+COUNTIF($AA$9:$AA699,$AA699))","v":1506},"D2",2,"D",null,"محمد ",null," محمد "]
[697," ",1000713010579700,null,null,"ذكر","2007-07-23","تلمسان","نصف داخلي","ج م أ03",null,null,null,"أولى","جدع مشترك آداب  ",3,697,"D1",null,"حي اولاد بن دامو  مغنية ",null,null,null,null,"E2",null,{"$f":"IF($J700=\"\",\"\",MATCH($J700,OFFSET(BASE!$C$5,,,MAX(BASE!$B:$B)),0))","v":26},{"$f":"IF($AA700=\"\",\"\",60*($AA700-1)+COUNTIF($AA$9:$AA700,$AA700))","v":1507},"D1",1,"D",null,"بن جبارة ",null," بن جبارة "]
[698," ",1100713270139900,null,null,"أنثى","2007-05-31","مغنية","نصف داخلي","ج م أ03",null,null,null,"أولى","جدع مشترك آداب  ",3,698,"D2",null,"قرية المصامدة - مغنية - تلمسان ",null,null,null,null,null,null,{"$f":"IF($J701=\"\",\"\",MATCH($J701,OFFSET(BASE!$C$5,,,MAX(BASE!$B:$B)),0))","v":26},{"$f":"IF($AA701=\"\",\"\",60*($AA701-1)+COUNTIF($AA$9:$AA701,$AA701))","v":1508},"D2",2,"D",null,"حاج ",null," حاج "]
[699," ",1000713270355800,null,null,"ذكر","2007-05-23","تلمسان","نصف داخلي","ج م أ03",null,null,null,"أولى","جدع مشترك آداب  ",3,699,"D1",null,"قرية البطيم-مغنية- ",null,null,null,null,null,null,{"$f":"IF($J702=\"\",\"\",MATCH($J702,OFFSET(BASE!$C$5,,,MAX(BASE!$B:$B)),0))","v":26},{"$f":"IF($AA702=\"\",\"\",60*($AA702-1)+COUNTIF($AA$9:$AA702,$AA702))","v":1509},"D1",1,"D",null,"بلخير ",null," بلخير "]
[700," ",1100613270206100,null,null,"أنثى","2006-07-24","مغنية","نصف داخلي","ج م أ03",null,null,null,"أولى","جدع مشترك آداب  ",3,700,"D2",null,"قرية البطيم ",null,null,null,null,null,null,{"$f":"IF($J703=\"\",\"\",MATCH($J703,OFFSET(BASE!$C$5,,,MAX(BASE!$B:$B)),0))","v":26},{"$f":"IF($AA703=\"\",\"\",60*($AA703-1)+COUNTIF($AA$9:$AA703,$AA703))","v":1510},"D2",2,"D",null,"سيدي محمد ",null," سيدي محمد "]
[701," ",1100713270201600,null,null,"أنثى","2007-07-23","مغنية","نصف داخلي","ج م أ03",null,null,null,"أولى","جدع مشترك آداب  ",3,701,"D2",null,"قرية العقيد عباس مغنية ",null,null,null,null,null,null,{"$f":"IF($J704=\"\",\"\",MATCH($J704,OFFSET(BASE!$C$5,,,MAX(BASE!$B:$B)),0))","v":26},{"$f":"IF($AA704=\"\",\"\",60*($AA704-1)+COUNTIF($AA$9:$AA704,$AA704))","v":1511},"D2",2,"D",null,"علي ",null," علي "]
[702," ",1100613270093900,null,null,"أنثى","2006-04-22","مغنية","نصف داخلي","ج م أ03",null,null,null,"أولى","جدع مشترك آداب  ",3,702,"D2",null,"قرية المصامدة - مغنية - تلمسان ",null,null,null,null,null,null,{"$f":"IF($J705=\"\",\"\",MATCH($J705,OFFSET(BASE!$C$5,,,MAX(BASE!$B:$B)),0))","v":26},{"$f":"IF($AA705=\"\",\"\",60*($AA705-1)+COUNTIF($AA$9:$AA705,$AA705))","v":1512},"D2",2,"D",null,"عبد الله ",null," عبد الله "]
[703," ",1100713270040800,null,null,"أنثى","2007-02-16","مغنية","نصف داخلي","ج م أ03",null,null,null,"أولى","جدع مشترك آداب  ",3,703,"D2",null,"قرية المصامدة - مغنية - تلمسان ",null,null,null,null,null,null,{"$f":"IF($J706=\"\",\"\",MATCH($J706,OFFSET(BASE!$C$5,,,MAX(BASE!$B:$B)),0))","v":26},{"$f":"IF($AA706=\"\",\"\",60*($AA706-1)+COUNTIF($AA$9:$AA706,$AA706))","v":1513},"D2",2,"D",null,"عبد المالك ",null," عبد المالك "]
[704," ",1100713270034500,null,null,"أنثى","2007-02-06","مغنية","نصف داخلي","ج م أ03",null,null,null,"أولى","جدع مشترك آداب  ",3,704,"D2",null,"قرية البطيم-مغنية- ",null,null,null,null,null,null,{"$f":"IF($J707=\"\",\"\",MATCH($J707,OFFSET(BASE!$C$5,,,MAX(BASE!$B:$B)),0))","v":26},{"$f":"IF($AA707=\"\",\"\",60*($AA707-1)+COUNTIF($AA$9:$AA707,$AA707))","v":1514},"D2",2,"D",null,"واسيني ",null," واسيني "]
[705,{"$f":"D708& \" \" &E708","v":" "},1100413270063500,null,null,"أنثى","2004-03-15","مغنية","نصف داخلي","ج م أ03",null,null,null,"أولى","جدع مشترك آداب  ",3,705,"D2",null,"أولاد الشارف - مغنية  ",null,null,null,null,"D1",null,{"$f":"IF($J708=\"\",\"\",MATCH($J708,OFFSET(BASE!$C$5,,,MAX(BASE!$B:$B)),0))","v":26},{"$f":"IF($AA708=\"\",\"\",60*($AA708-1)+COUNTIF($AA$9:$AA708,$AA708))","v":1515},"D2",2,"D",null,"واسيني ",null," واسيني "]
[706," ",1100713270345100,null,null,"أنثى","2007-12-08","مغنية","نصف داخلي","ج م أ03",null,null,null,"أولى","جدع مشترك آداب  ",3,706,"D2",null,"دوار المرازقة  - مغنية -  ",null,null,null,null,null,null,{"$f":"IF($J709=\"\",\"\",MATCH($J709,OFFSET(BASE!$C$5,,,MAX(BASE!$B:$B)),0))","v":26},{"$f":"IF($AA709=\"\",\"\",60*($AA709-1)+COUNTIF($AA$9:$AA709,$AA709))","v":1516},"D2",2,"D",null,"أحمد ",null," أحمد "]
[707," ",1100713270094600,null,null,"أنثى","2007-04-17","مغنية","نصف داخلي","ج م أ03",null,null,null,"أولى","جدع مشترك آداب  ",3,707,"D2",null,"قرية البطيم مغنية ",null,null,null,null,null,null,{"$f":"IF($J710=\"\",\"\",MATCH($J710,OFFSET(BASE!$C$5,,,MAX(BASE!$B:$B)),0))","v":26},{"$f":"IF($AA710=\"\",\"\",60*($AA710-1)+COUNTIF($AA$9:$AA710,$AA710))","v":1517},"D2",2,"D",null,"هبري ",null," هبري "]
[708," ",1000613270174500,null,null,"ذكر","2006-06-28","مغنية","نصف داخلي","ج م أ03",null,null,null,"أولى","جدع مشترك آداب  ",3,708,"D1",null,"العقيد عباس - مغنية - ",null,null,null,null,null,null,{"$f":"IF($J711=\"\",\"\",MATCH($J711,OFFSET(BASE!$C$5,,,MAX(BASE!$B:$B)),0))","v":26},{"$f":"IF($AA711=\"\",\"\",60*($AA711-1)+COUNTIF($AA$9:$AA711,$AA711))","v":1518},"D1",1,"D",null,"لحبيب ",null," لحبيب "]
[709," ",1100713270342300,null,null,"أنثى","2007-12-06","مغنية","نصف داخلي","ج م أ03",null,null,null,"أولى","جدع مشترك آداب  ",3,null,"D2",null,"قرية البطيم-مغنية- ",null,null,null,null,null,null,{"$f":"IF($J712=\"\",\"\",MATCH($J712,OFFSET(BASE!$C$5,,,MAX(BASE!$B:$B)),0))","v":26},{"$f":"IF($AA712=\"\",\"\",60*($AA712-1)+COUNTIF($AA$9:$AA712,$AA712))","v":1519},"D2",2,"D",null,"الميلود ",null," الميلود "]
[710," ",1100713270233300,null,null,"أنثى","2007-08-19","مغنية","نصف داخلي","ج م أ03",null,null,null,"أولى","جدع مشترك آداب  ",3,null,"D2",null,"قرية البطيم ",null,null,null,null,null,null,{"$f":"IF($J713=\"\",\"\",MATCH($J713,OFFSET(BASE!$C$5,,,MAX(BASE!$B:$B)),0))","v":26},{"$f":"IF($AA713=\"\",\"\",60*($AA713-1)+COUNTIF($AA$9:$AA713,$AA713))","v":1520},"D2",2,"D",null,"حميدة ",null,{"$f":"D713 & \" \" & AG713","v":" حميدة "}]
[711," ",1100713270082100,null,null,"أنثى","2007-04-04","مغنية","نصف داخلي","ج م أ03",null,null,null,"أولى","جدع مشترك آداب  ",3,null,"D2",null,"العقيد لطفي ",null,null,null,null,null,null,{"$f":"IF($J714=\"\",\"\",MATCH($J714,OFFSET(BASE!$C$5,,,MAX(BASE!$B:$B)),0))","v":26},{"$f":"IF($AA714=\"\",\"\",60*($AA714-1)+COUNTIF($AA$9:$AA714,$AA714))","v":1521},{"$f":"AE714&AD714","v":"D2"},{"$f":"IF(F714=\"أنثى\",2,1)","v":2},{"$f":"IF(I714=\"نصف داخلي\",\"D\",\"E\")","v":"D"},null,"واسيني ",null," واسيني "]
[712," ",1000313010537700,null,null,"ذكر","2003-08-23","تلمسان","نصف داخلي","ج م أ03",null,null,null,"أولى","جدع مشترك آداب  ",3,null,"D1",null,"قرية البطيم مغنية ",null,null,null,null,null,null,{"$f":"IF($J715=\"\",\"\",MATCH($J715,OFFSET(BASE!$C$5,,,MAX(BASE!$B:$B)),0))","v":26},{"$f":"IF($AA715=\"\",\"\",60*($AA715-1)+COUNTIF($AA$9:$AA715,$AA715))","v":1522},"D1",1,"D",null,"مراكشي عثارية ",null," مراكشي عثارية "]
[713," ",1100713270097500,null,null,"أنثى","2007-04-20","مغنية","نصف داخلي","ج م أ03",null,null,null,"أولى","جدع مشترك آداب  ",3,null,"D2",null,"قرية البطيم ",null,null,null,null,null,null,{"$f":"IF($J716=\"\",\"\",MATCH($J716,OFFSET(BASE!$C$5,,,MAX(BASE!$B:$B)),0))","v":26},{"$f":"IF($AA716=\"\",\"\",60*($AA716-1)+COUNTIF($AA$9:$AA716,$AA716))","v":1523},"D2",2,"D",null,"علي ",null," علي "]
[714," ",1100613270065200,null,null,"أنثى","2006-06-20","مغنية","خارجي","ج م أ03",null,null,null,"أولى","جدع مشترك آداب  ",3,null,"E2",null,"قرية أولاد الشارف - مغنية -  ",null,null,null,null,null,null,{"$f":"IF($J717=\"\",\"\",MATCH($J717,OFFSET(BASE!$C$5,,,MAX(BASE!$B:$B)),0))","v":26},{"$f":"IF($AA717=\"\",\"\",60*($AA717-1)+COUNTIF($AA$9:$AA717,$AA717))","v":1524},"E2",2,"E",null,"عبد الكريم  ",null," عبد الكريم  "]
[715," ",1000613130051900,null,null,"ذكر","2006-10-20","اولاد ميمون","خارجي","ج م أ03",null,null,null,"أولى","جدع مشترك آداب  ",3,null,"E1",null,"العلوية سيدي العبدلي ",null,null,null,null,null,null,{"$f":"IF($J718=\"\",\"\",MATCH($J718,OFFSET(BASE!$C$5,,,MAX(BASE!$B:$B)),0))","v":26},{"$f":"IF($AA718=\"\",\"\",60*($AA718-1)+COUNTIF($AA$9:$AA718,$AA718))","v":1525},"E1",1,"E",null,"موفق ",null," موفق "]
[716," ",1100813010002000,null,null,"أنثى","2008-01-01","تلمسان","خارجي","ج م أ03",null,null,null,"أولى","جدع مشترك آداب  ",3,null,"E2",null,"حي عمر المختار- مغنية - ",null,null,null,null,null,null,{"$f":"IF($J719=\"\",\"\",MATCH($J719,OFFSET(BASE!$C$5,,,MAX(BASE!$B:$B)),0))","v":26},{"$f":"IF($AA719=\"\",\"\",60*($AA719-1)+COUNTIF($AA$9:$AA719,$AA719))","v":1526},"E2",2,"E",null,"أحمد ",null," أحمد "]
[717," ",1000613270077000,null,null,"ذكر","2006-04-03","مغنية","خارجي","ج م أ03",null,null,null,"أولى","جدع مشترك آداب  ",3,null,"E1",null,"قرية البطيم مغنية ",null,null,null,null,null,null,{"$f":"IF($J720=\"\",\"\",MATCH($J720,OFFSET(BASE!$C$5,,,MAX(BASE!$B:$B)),0))","v":26},{"$f":"IF($AA720=\"\",\"\",60*($AA720-1)+COUNTIF($AA$9:$AA720,$AA720))","v":1527},"E1",1,"E",null,"محمد ",null," محمد "]
[718," ",1000713010932900,null,null,"ذكر","2007-11-16","تلمسان","خارجي","ج م أ03",null,null,null,"أولى","جدع مشترك آداب  ",3,null,"E1",null,"حي أولاد بن دامو ",null,null,null,null,null,null,{"$f":"IF($J721=\"\",\"\",MATCH($J721,OFFSET(BASE!$C$5,,,MAX(BASE!$B:$B)),0))","v":26},{"$f":"IF($AA721=\"\",\"\",60*($AA721-1)+COUNTIF($AA$9:$AA721,$AA721))","v":1528},"E1",1,"E",null,"عبد القادر ",null," عبد القادر "]
[719," ",1000513270098800,null,null,"ذكر","2005-04-29","مغنية","خارجي","ج م أ03",null,null,null,"أولى","جدع مشترك آداب  ",3,null,"E1",null," رقم 07 الحي  السكني الجديد ",null,null,null,null,null,null,{"$f":"IF($J722=\"\",\"\",MATCH($J722,OFFSET(BASE!$C$5,,,MAX(BASE!$B:$B)),0))","v":26},{"$f":"IF($AA722=\"\",\"\",60*($AA722-1)+COUNTIF($AA$9:$AA722,$AA722))","v":1529},"E1",1,"E",null,"فتحي ",null," فتحي "]
[720," ",1100413270632100,null,null,"أنثى","2004-08-16","مغنية","خارجي","ج م أ03",null,null,null,"أولى","جدع مشترك آداب  ",3,null,"E2",null,"رقم 67 طريق تلمسان - مغنية - ",null,null,null,null,null,null,{"$f":"IF($J723=\"\",\"\",MATCH($J723,OFFSET(BASE!$C$5,,,MAX(BASE!$B:$B)),0))","v":26},{"$f":"IF($AA723=\"\",\"\",60*($AA723-1)+COUNTIF($AA$9:$AA723,$AA723))","v":1530},"E2",2,"E",null,"عبد الرزاق ",null," عبد الرزاق "]
[721," ",1100513270276300,null,null,"أنثى","2005-09-18","مغنية","خارجي","ج م أ03",null,null,null,"أولى","جدع مشترك آداب  ",3,null,"E2",null,"حي الشهداء - مغنية - ",null,null,null,null,null,null,{"$f":"IF($J724=\"\",\"\",MATCH($J724,OFFSET(BASE!$C$5,,,MAX(BASE!$B:$B)),0))","v":26},{"$f":"IF($AA724=\"\",\"\",60*($AA724-1)+COUNTIF($AA$9:$AA724,$AA724))","v":1531},"E2",2,"E",null,"عبد السعيد ",null," عبد السعيد "]
[722," ",1100513270308500,null,null,"أنثى","2005-10-19","مغنية","خارجي","ج م أ03",null,null,null,"أولى","جدع مشترك آداب  ",3,null,"E2",null,"رقم 11 حي الشهداء - مغنية -  ",null,null,null,null,null,null,{"$f":"IF($J725=\"\",\"\",MATCH($J725,OFFSET(BASE!$C$5,,,MAX(BASE!$B:$B)),0))","v":26},{"$f":"IF($AA725=\"\",\"\",60*($AA725-1)+COUNTIF($AA$9:$AA725,$AA725))","v":1532},"E2",2,"E",null,"عمر ",null," عمر "]
[723," ",1000613270242500,null,null,"ذكر","2006-08-23","مغنية","خارجي","ج م أ03",null,null,null,"أولى","جدع مشترك آداب  ",3,null,"E1",null,"الشارع 14 رقم13حي المقراني -مغنية- ",null,null,null,null,null,null,{"$f":"IF($J726=\"\",\"\",MATCH($J726,OFFSET(BASE!$C$5,,,MAX(BASE!$B:$B)),0))","v":26},{"$f":"IF($AA726=\"\",\"\",60*($AA726-1)+COUNTIF($AA$9:$AA726,$AA726))","v":1533},"E1",1,"E",null,"عبد الفتاح ",null," عبد الفتاح "]
[724," ",null,null,null,null,null,null,null,null,null,null,null,null,null,null,null,null,null,null,null,null,null,null,null,null,{"$f":"IF($J727=\"\",\"\",MATCH($J727,OFFSET(BASE!$C$5,,,MAX(BASE!$B:$B)),0))","v":""},{"$f":"IF($AA727=\"\",\"\",60*($AA727-1)+COUNTIF($AA$9:$AA727,$AA727))","v":""},null,1,"E"]
[725," ",null,null,null,null,null,null,null,null,null,null,null,null,null,null,null,null,null,null,null,null,null,null,null,null,{"$f":"IF($J728=\"\",\"\",MATCH($J728,OFFSET(BASE!$C$5,,,MAX(BASE!$B:$B)),0))","v":""},{"$f":"IF($AA728=\"\",\"\",60*($AA728-1)+COUNTIF($AA$9:$AA728,$AA728))","v":""},null,1,"E"]
[726," ",null,null,null,null,null,null,null,null,null,null,null,null,null,null,null,null,null,null,null,null,null,null,null,null,{"$f":"IF($J729=\"\",\"\",MATCH($J729,OFFSET(BASE!$C$5,,,MAX(BASE!$B:$B)),0))","v":""},{"$f":"IF($AA729=\"\",\"\",60*($AA729-1)+COUNTIF($AA$9:$AA729,$AA729))","v":""},null,1,"E"]
[727," ",null,null,null,null,null,null,null,null,null,null,null,null,null,null,null,null,null,null,null,null,null,null,null,null,{"$f":"IF($J730=\"\",\"\",MATCH($J730,OFFSET(BASE!$C$5,,,MAX(BASE!$B:$B)),0))","v":""},{"$f":"IF($AA730=\"\",\"\",60*($AA730-1)+COUNTIF($AA$9:$AA730,$AA730))","v":""},null,1,"E"]
[728," ",null,null,null,null,null,null,null,null,null,null,null,null,null,null,null,null,null,null,null,null,null,null,null,null,{"$f":"IF($J731=\"\",\"\",MATCH($J731,OFFSET(BASE!$C$5,,,MAX(BASE!$B:$B)),0))","v":""},{"$f":"IF($AA731=\"\",\"\",60*($AA731-1)+COUNTIF($AA$9:$AA731,$AA731))","v":""},null,1,"E"]
[729," ",null,null,null,null,null,null,null,null,null,null,null,null,null,null,null,null,null,null,null,null,null,null,null,null,{"$f":"IF($J732=\"\",\"\",MATCH($J732,OFFSET(BASE!$C$5,,,MAX(BASE!$B:$B)),0))","v":""},{"$f":"IF($AA732=\"\",\"\",60*($AA732-1)+COUNTIF($AA$9:$AA732,$AA732))","v":""},null,1,"E"]
[730," ",null,null,null,null,null,null,null,null,null,null,null,null,null,null,null,null,null,null,null,null,null,null,null,null,{"$f":"IF($J733=\"\",\"\",MATCH($J733,OFFSET(BASE!$C$5,,,MAX(BASE!$B:$B)),0))","v":""},{"$f":"IF($AA733=\"\",\"\",60*($AA733-1)+COUNTIF($AA$9:$AA733,$AA733))","v":""},null,1,"E"]
[731," ",null,null,null,null,null,null,null,null,null,null,null,null,null,null,null,null,null,null,null,null,null,null,null,null,{"$f":"IF($J734=\"\",\"\",MATCH($J734,OFFSET(BASE!$C$5,,,MAX(BASE!$B:$B)),0))","v":""},{"$f":"IF($AA734=\"\",\"\",60*($AA734-1)+COUNTIF($AA$9:$AA734,$AA734))","v":""},null,1,"E"]
[732," ",null,null,null,null,null,null,null,null,null,null,null,null,null,null,null,null,null,null,null,null,null,null,null,null,{"$f":"IF($J735=\"\",\"\",MATCH($J735,OFFSET(BASE!$C$5,,,MAX(BASE!$B:$B)),0))","v":""},{"$f":"IF($AA735=\"\",\"\",60*($AA735-1)+COUNTIF($AA$9:$AA735,$AA735))","v":""},null,1,"E"]
[733," ",null,null,null,null,null,null,null,null,null,null,null,null,null,null,null,null,null,null,null,null,null,null,null,null,{"$f":"IF($J736=\"\",\"\",MATCH($J736,OFFSET(BASE!$C$5,,,MAX(BASE!$B:$B)),0))","v":""},{"$f":"IF($AA736=\"\",\"\",60*($AA736-1)+COUNTIF($AA$9:$AA736,$AA736))","v":""},null,1,"E"]
[734," ",null,null,null,null,null,null,null,null,null,null,null,null,null,null,null,null,null,null,null,null,null,null,null,null,{"$f":"IF($J737=\"\",\"\",MATCH($J737,OFFSET(BASE!$C$5,,,MAX(BASE!$B:$B)),0))","v":""},{"$f":"IF($AA737=\"\",\"\",60*($AA737-1)+COUNTIF($AA$9:$AA737,$AA737))","v":""},null,1,"E"]
[735," ",null,null,null,null,null,null,null,null,null,null,null,null,null,null,null,null,null,null,null,null,null,null,null,null,{"$f":"IF($J738=\"\",\"\",MATCH($J738,OFFSET(BASE!$C$5,,,MAX(BASE!$B:$B)),0))","v":""},{"$f":"IF($AA738=\"\",\"\",60*($AA738-1)+COUNTIF($AA$9:$AA738,$AA738))","v":""},null,1,"E"]
[736," ",null,null,null,null,null,null,null,null,null,null,null,null,null,null,null,null,null,null,null,null,null,null,null,null,{"$f":"IF($J739=\"\",\"\",MATCH($J739,OFFSET(BASE!$C$5,,,MAX(BASE!$B:$B)),0))","v":""},{"$f":"IF($AA739=\"\",\"\",60*($AA739-1)+COUNTIF($AA$9:$AA739,$AA739))","v":""},null,1,"E"]
[737," ",null,null,null,null,null,null,null,null,null,null,null,null,null,null,null,null,null,null,null,null,null,null,null,null,{"$f":"IF($J740=\"\",\"\",MATCH($J740,OFFSET(BASE!$C$5,,,MAX(BASE!$B:$B)),0))","v":""},{"$f":"IF($AA740=\"\",\"\",60*($AA740-1)+COUNTIF($AA$9:$AA740,$AA740))","v":""},null,1,"E"]
[738," ",null,null,null,null,null,null,null,null,null,null,null,null,null,null,null,null,null,null,null,null,null,null,null,null,{"$f":"IF($J741=\"\",\"\",MATCH($J741,OFFSET(BASE!$C$5,,,MAX(BASE!$B:$B)),0))","v":""},{"$f":"IF($AA741=\"\",\"\",60*($AA741-1)+COUNTIF($AA$9:$AA741,$AA741))","v":""},null,1,"E"]
[739," ",null,null,null,null,null,null,null,null,null,null,null,null,null,null,null,null,null,null,null,null,null,null,null,null,{"$f":"IF($J742=\"\",\"\",MATCH($J742,OFFSET(BASE!$C$5,,,MAX(BASE!$B:$B)),0))","v":""},{"$f":"IF($AA742=\"\",\"\",60*($AA742-1)+COUNTIF($AA$9:$AA742,$AA742))","v":""},null,1,"E"]
[740," ",null,null,null,null,null,null,null,null,null,null,null,null,null,null,null,null,null,null,null,null,null,null,null,null,{"$f":"IF($J743=\"\",\"\",MATCH($J743,OFFSET(BASE!$C$5,,,MAX(BASE!$B:$B)),0))","v":""},{"$f":"IF($AA743=\"\",\"\",60*($AA743-1)+COUNTIF($AA$9:$AA743,$AA743))","v":""},null,1,"E"]
[741," ",null,null,null,null,null,null,null,null,null,null,null,null,null,null,null,null,null,null,null,null,null,null,null,null,{"$f":"IF($J744=\"\",\"\",MATCH($J744,OFFSET(BASE!$C$5,,,MAX(BASE!$B:$B)),0))","v":""},{"$f":"IF($AA744=\"\",\"\",60*($AA744-1)+COUNTIF($AA$9:$AA744,$AA744))","v":""},null,1,"E"]
[742," ",null,null,null,null,null,null,null,null,null,null,null,null,null,null,null,null,null,null,null,null,null,null,null,null,{"$f":"IF($J745=\"\",\"\",MATCH($J745,OFFSET(BASE!$C$5,,,MAX(BASE!$B:$B)),0))","v":""},{"$f":"IF($AA745=\"\",\"\",60*($AA745-1)+COUNTIF($AA$9:$AA745,$AA745))","v":""},null,1,"E"]
[743,null,null,null,null,null,null,null,null,null,null,null,null,null,null,null,null,null,null,null,null,null,null,null,null,null,{"$f":"IF($J746=\"\",\"\",MATCH($J746,OFFSET(BASE!$C$5,,,MAX(BASE!$B:$B)),0))","v":""},{"$f":"IF($AA746=\"\",\"\",60*($AA746-1)+COUNTIF($AA$9:$AA746,$AA746))","v":""},null,1,"E"]
[744,null,null,null,null,null,null,null,null,null,null,null,null,null,null,null,null,null,null,null,null,null,null,null,null,null,{"$f":"IF($J747=\"\",\"\",MATCH($J747,OFFSET(BASE!$C$5,,,MAX(BASE!$B:$B)),0))","v":""},{"$f":"IF($AA747=\"\",\"\",60*($AA747-1)+COUNTIF($AA$9:$AA747,$AA747))","v":""},null,1,"E"]
[745,null,null,null,null,null,null,null,null,null,null,null,null,null,null,null,null,null,null,null,null,null,null,null,null,null,{"$f":"IF($J748=\"\",\"\",MATCH($J748,OFFSET(BASE!$C$5,,,MAX(BASE!$B:$B)),0))","v":""},{"$f":"IF($AA748=\"\",\"\",60*($AA748-1)+COUNTIF($AA$9:$AA748,$AA748))","v":""},null,1,"E"]
[746,null,null,null,null,null,null,null,null,null,null,null,null,null,null,null,null,null,null,null,null,null,null,null,null,null,{"$f":"IF($J749=\"\",\"\",MATCH($J749,OFFSET(BASE!$C$5,,,MAX(BASE!$B:$B)),0))","v":""},{"$f":"IF($AA749=\"\",\"\",60*($AA749-1)+COUNTIF($AA$9:$AA749,$AA749))","v":""},null,1,"E"]
[747,null,null,null,null,null,null,null,null,null,null,null,null,null,null,null,null,null,null,null,null,null,null,null,null,null,{"$f":"IF($J750=\"\",\"\",MATCH($J750,OFFSET(BASE!$C$5,,,MAX(BASE!$B:$B)),0))","v":""},{"$f":"IF($AA750=\"\",\"\",60*($AA750-1)+COUNTIF($AA$9:$AA750,$AA750))","v":""},null,1,"E"]
[748,null,null,null,null,null,null,null,null,null,null,null,null,null,null,null,null,null,null,null,null,null,null,null,null,null,{"$f":"IF($J751=\"\",\"\",MATCH($J751,OFFSET(BASE!$C$5,,,MAX(BASE!$B:$B)),0))","v":""},{"$f":"IF($AA751=\"\",\"\",60*($AA751-1)+COUNTIF($AA$9:$AA751,$AA751))","v":""},null,1,"E"]
[749,null,null,null,null,null,null,null,null,null,null,null,null,null,null,null,null,null,null,null,null,null,null,null,null,null,{"$f":"IF($J752=\"\",\"\",MATCH($J752,OFFSET(BASE!$C$5,,,MAX(BASE!$B:$B)),0))","v":""},{"$f":"IF($AA752=\"\",\"\",60*($AA752-1)+COUNTIF($AA$9:$AA752,$AA752))","v":""},null,1,"E"]
[750,null,null,null,null,null,null,null,null,null,null,null,null,null,null,null,null,null,null,null,null,null,null,null,null,null,{"$f":"IF($J753=\"\",\"\",MATCH($J753,OFFSET(BASE!$C$5,,,MAX(BASE!$B:$B)),0))","v":""},{"$f":"IF($AA753=\"\",\"\",60*($AA753-1)+COUNTIF($AA$9:$AA753,$AA753))","v":""},null,1,"E"]
[751,null,null,null,null,null,null,null,null,null,null,null,null,null,null,null,null,null,null,null,null,null,null,null,null,null,{"$f":"IF($J754=\"\",\"\",MATCH($J754,OFFSET(BASE!$C$5,,,MAX(BASE!$B:$B)),0))","v":""},{"$f":"IF($AA754=\"\",\"\",60*($AA754-1)+COUNTIF($AA$9:$AA754,$AA754))","v":""},null,1,"E"]
[752,null,null,null,null,null,null,null,null,null,null,null,null,null,null,null,null,null,null,null,null,null,null,null,null,null,{"$f":"IF($J755=\"\",\"\",MATCH($J755,OFFSET(BASE!$C$5,,,MAX(BASE!$B:$B)),0))","v":""},{"$f":"IF($AA755=\"\",\"\",60*($AA755-1)+COUNTIF($AA$9:$AA755,$AA755))","v":""},null,1,"E"]
[753,null,null,null,null,null,null,null,null,null,null,null,null,null,null,null,null,null,null,null,null,null,null,null,null,null,{"$f":"IF($J756=\"\",\"\",MATCH($J756,OFFSET(BASE!$C$5,,,MAX(BASE!$B:$B)),0))","v":""},{"$f":"IF($AA756=\"\",\"\",60*($AA756-1)+COUNTIF($AA$9:$AA756,$AA756))","v":""},null,1,"E"]
[754,null,null,null,null,null,null,null,null,null,null,null,null,null,null,null,null,null,null,null,null,null,null,null,null,null,{"$f":"IF($J757=\"\",\"\",MATCH($J757,OFFSET(BASE!$C$5,,,MAX(BASE!$B:$B)),0))","v":""},{"$f":"IF($AA757=\"\",\"\",60*($AA757-1)+COUNTIF($AA$9:$AA757,$AA757))","v":""},null,1,"E"]
[755,null,null,null,null,null,null,null,null,null,null,null,null,null,null,null,null,null,null,null,null,null,null,null,null,null,{"$f":"IF($J758=\"\",\"\",MATCH($J758,OFFSET(BASE!$C$5,,,MAX(BASE!$B:$B)),0))","v":""},{"$f":"IF($AA758=\"\",\"\",60*($AA758-1)+COUNTIF($AA$9:$AA758,$AA758))","v":""},null,1,"E"]
[756,null,null,null,null,null,null,null,null,null,null,null,null,null,null,null,null,null,null,null,null,null,null,null,null,null,{"$f":"IF($J759=\"\",\"\",MATCH($J759,OFFSET(BASE!$C$5,,,MAX(BASE!$B:$B)),0))","v":""},{"$f":"IF($AA759=\"\",\"\",60*($AA759-1)+COUNTIF($AA$9:$AA759,$AA759))","v":""},null,1,"E"]
[757,null,null,null,null,null,null,null,null,null,null,null,null,null,null,null,null,null,null,null,null,null,null,null,null,null,{"$f":"IF($J760=\"\",\"\",MATCH($J760,OFFSET(BASE!$C$5,,,MAX(BASE!$B:$B)),0))","v":""},{"$f":"IF($AA760=\"\",\"\",60*($AA760-1)+COUNTIF($AA$9:$AA760,$AA760))","v":""},null,1,"E"]
[758,null,null,null,null,null,null,null,null,null,null,null,null,null,null,null,null,null,null,null,null,null,null,null,null,null,{"$f":"IF($J761=\"\",\"\",MATCH($J761,OFFSET(BASE!$C$5,,,MAX(BASE!$B:$B)),0))","v":""},{"$f":"IF($AA761=\"\",\"\",60*($AA761-1)+COUNTIF($AA$9:$AA761,$AA761))","v":""},null,1,"E"]
[759,null,null,null,null,null,null,null,null,null,null,null,null,null,null,null,null,null,null,null,null,null,null,null,null,null,{"$f":"IF($J762=\"\",\"\",MATCH($J762,OFFSET(BASE!$C$5,,,MAX(BASE!$B:$B)),0))","v":""},{"$f":"IF($AA762=\"\",\"\",60*($AA762-1)+COUNTIF($AA$9:$AA762,$AA762))","v":""},null,1,"E"]
[760,null,null,null,null,null,null,null,null,null,null,null,null,null,null,null,null,null,null,null,null,null,null,null,null,null,{"$f":"IF($J763=\"\",\"\",MATCH($J763,OFFSET(BASE!$C$5,,,MAX(BASE!$B:$B)),0))","v":""},{"$f":"IF($AA763=\"\",\"\",60*($AA763-1)+COUNTIF($AA$9:$AA763,$AA763))","v":""},null,1,"E"]
[761,null,null,null,null,null,null,null,null,null,null,null,null,null,null,null,null,null,null,null,null,null,null,null,null,null,{"$f":"IF($J764=\"\",\"\",MATCH($J764,OFFSET(BASE!$C$5,,,MAX(BASE!$B:$B)),0))","v":""},{"$f":"IF($AA764=\"\",\"\",60*($AA764-1)+COUNTIF($AA$9:$AA764,$AA764))","v":""},null,1,"E"]
[762,null,null,null,null,null,null,null,null,null,null,null,null,null,null,null,null,null,null,null,null,null,null,null,null,null,{"$f":"IF($J765=\"\",\"\",MATCH($J765,OFFSET(BASE!$C$5,,,MAX(BASE!$B:$B)),0))","v":""},{"$f":"IF($AA765=\"\",\"\",60*($AA765-1)+COUNTIF($AA$9:$AA765,$AA765))","v":""},null,1,"E"]
[763,null,null,null,null,null,null,null,null,null,null,null,null,null,null,null,null,null,null,null,null,null,null,null,null,null,{"$f":"IF($J766=\"\",\"\",MATCH($J766,OFFSET(BASE!$C$5,,,MAX(BASE!$B:$B)),0))","v":""},{"$f":"IF($AA766=\"\",\"\",60*($AA766-1)+COUNTIF($AA$9:$AA766,$AA766))","v":""},null,1,"E"]
[764,null,null,null,null,null,null,null,null,null,null,null,null,null,null,null,null,null,null,null,null,null,null,null,null,null,{"$f":"IF($J767=\"\",\"\",MATCH($J767,OFFSET(BASE!$C$5,,,MAX(BASE!$B:$B)),0))","v":""},{"$f":"IF($AA767=\"\",\"\",60*($AA767-1)+COUNTIF($AA$9:$AA767,$AA767))","v":""},null,1,"E"]
[765,null,null,null,null,null,null,null,null,null,null,null,null,null,null,null,null,null,null,null,null,null,null,null,null,null,{"$f":"IF($J768=\"\",\"\",MATCH($J768,OFFSET(BASE!$C$5,,,MAX(BASE!$B:$B)),0))","v":""},{"$f":"IF($AA768=\"\",\"\",60*($AA768-1)+COUNTIF($AA$9:$AA768,$AA768))","v":""},null,1,"E"]
[766,null,null,null,null,null,null,null,null,null,null,null,null,null,null,null,null,null,null,null,null,null,null,null,null,null,{"$f":"IF($J769=\"\",\"\",MATCH($J769,OFFSET(BASE!$C$5,,,MAX(BASE!$B:$B)),0))","v":""},{"$f":"IF($AA769=\"\",\"\",60*($AA769-1)+COUNTIF($AA$9:$AA769,$AA769))","v":""},null,1,"E"]
[767,null,null,null,null,null,null,null,null,null,null,null,null,null,null,null,null,null,null,null,null,null,null,null,null,null,{"$f":"IF($J770=\"\",\"\",MATCH($J770,OFFSET(BASE!$C$5,,,MAX(BASE!$B:$B)),0))","v":""},{"$f":"IF($AA770=\"\",\"\",60*($AA770-1)+COUNTIF($AA$9:$AA770,$AA770))","v":""},null,1,"E"]
[768,null,null,null,null,null,null,null,null,null,null,null,null,null,null,null,null,null,null,null,null,null,null,null,null,null,{"$f":"IF($J771=\"\",\"\",MATCH($J771,OFFSET(BASE!$C$5,,,MAX(BASE!$B:$B)),0))","v":""},{"$f":"IF($AA771=\"\",\"\",60*($AA771-1)+COUNTIF($AA$9:$AA771,$AA771))","v":""},null,1,"E"]
[769,null,null,null,null,null,null,null,null,null,null,null,null,null,null,null,null,null,null,null,null,null,null,null,null,null,{"$f":"IF($J772=\"\",\"\",MATCH($J772,OFFSET(BASE!$C$5,,,MAX(BASE!$B:$B)),0))","v":""},{"$f":"IF($AA772=\"\",\"\",60*($AA772-1)+COUNTIF($AA$9:$AA772,$AA772))","v":""},null,1,"E"]
[770,null,null,null,null,null,null,null,null,null,null,null,null,null,null,null,null,null,null,null,null,null,null,null,null,null,{"$f":"IF($J773=\"\",\"\",MATCH($J773,OFFSET(BASE!$C$5,,,MAX(BASE!$B:$B)),0))","v":""},{"$f":"IF($AA773=\"\",\"\",60*($AA773-1)+COUNTIF($AA$9:$AA773,$AA773))","v":""},null,1,"E"]
[771,null,null,null,null,null,null,null,null,null,null,null,null,null,null,null,null,null,null,null,null,null,null,null,null,null,{"$f":"IF($J774=\"\",\"\",MATCH($J774,OFFSET(BASE!$C$5,,,MAX(BASE!$B:$B)),0))","v":""},{"$f":"IF($AA774=\"\",\"\",60*($AA774-1)+COUNTIF($AA$9:$AA774,$AA774))","v":""},null,1,"E"]
[772,null,null,null,null,null,null,null,null,null,null,null,null,null,null,null,null,null,null,null,null,null,null,null,null,null,{"$f":"IF($J775=\"\",\"\",MATCH($J775,OFFSET(BASE!$C$5,,,MAX(BASE!$B:$B)),0))","v":""},{"$f":"IF($AA775=\"\",\"\",60*($AA775-1)+COUNTIF($AA$9:$AA775,$AA775))","v":""},null,1,"E"]
[773,null,null,null,null,null,null,null,null,null,null,null,null,null,null,null,null,null,null,null,null,null,null,null,null,null,{"$f":"IF($J776=\"\",\"\",MATCH($J776,OFFSET(BASE!$C$5,,,MAX(BASE!$B:$B)),0))","v":""},{"$f":"IF($AA776=\"\",\"\",60*($AA776-1)+COUNTIF($AA$9:$AA776,$AA776))","v":""},null,1,"E"]
[774,null,null,null,null,null,null,null,null,null,null,null,null,null,null,null,null,null,null,null,null,null,null,null,null,null,{"$f":"IF($J777=\"\",\"\",MATCH($J777,OFFSET(BASE!$C$5,,,MAX(BASE!$B:$B)),0))","v":""},{"$f":"IF($AA777=\"\",\"\",60*($AA777-1)+COUNTIF($AA$9:$AA777,$AA777))","v":""},null,1,"E"]
[775,null,null,null,null,null,null,null,null,null,null,null,null,null,null,null,null,null,null,null,null,null,null,null,null,null,{"$f":"IF($J778=\"\",\"\",MATCH($J778,OFFSET(BASE!$C$5,,,MAX(BASE!$B:$B)),0))","v":""},{"$f":"IF($AA778=\"\",\"\",60*($AA778-1)+COUNTIF($AA$9:$AA778,$AA778))","v":""},null,{"$f":"IF(F778=\"أنثى\",2,1)","v":1},{"$f":"IF(I778=\"نصف داخلي\",\"D\",\"E\")","v":"E"}]
[776,null,null,null,null,null,null,null,null,null,null,null,null,null,null,null,null,null,null,null,null,null,null,null,null,null,{"$f":"IF($J779=\"\",\"\",MATCH($J779,OFFSET(BASE!$C$5,,,MAX(BASE!$B:$B)),0))","v":""},{"$f":"IF($AA779=\"\",\"\",60*($AA779-1)+COUNTIF($AA$9:$AA779,$AA779))","v":""},null,1,"E"]
[777,null,null,null,null,null,null,null,null,null,null,null,null,null,null,null,null,null,null,null,null,null,null,null,null,null,{"$f":"IF($J780=\"\",\"\",MATCH($J780,OFFSET(BASE!$C$5,,,MAX(BASE!$B:$B)),0))","v":""},{"$f":"IF($AA780=\"\",\"\",60*($AA780-1)+COUNTIF($AA$9:$AA780,$AA780))","v":""},null,1,"E"]
[778,null,null,null,null,null,null,null,null,null,null,null,null,null,null,null,null,null,null,null,null,null,null,null,null,null,{"$f":"IF($J781=\"\",\"\",MATCH($J781,OFFSET(BASE!$C$5,,,MAX(BASE!$B:$B)),0))","v":""},{"$f":"IF($AA781=\"\",\"\",60*($AA781-1)+COUNTIF($AA$9:$AA781,$AA781))","v":""},null,1,"E"]
[779,null,null,null,null,null,null,null,null,null,null,null,null,null,null,null,null,null,null,null,null,null,null,null,null,null,{"$f":"IF($J782=\"\",\"\",MATCH($J782,OFFSET(BASE!$C$5,,,MAX(BASE!$B:$B)),0))","v":""},{"$f":"IF($AA782=\"\",\"\",60*($AA782-1)+COUNTIF($AA$9:$AA782,$AA782))","v":""},null,1,"E"]
[780,null,null,null,null,null,null,null,null,null,null,null,null,null,null,null,null,null,null,null,null,null,null,null,null,null,{"$f":"IF($J783=\"\",\"\",MATCH($J783,OFFSET(BASE!$C$5,,,MAX(BASE!$B:$B)),0))","v":""},{"$f":"IF($AA783=\"\",\"\",60*($AA783-1)+COUNTIF($AA$9:$AA783,$AA783))","v":""},null,1,"E"]
[781,null,null,null,null,null,null,null,null,null,null,null,null,null,null,null,null,null,null,null,null,null,null,null,null,null,{"$f":"IF($J784=\"\",\"\",MATCH($J784,OFFSET(BASE!$C$5,,,MAX(BASE!$B:$B)),0))","v":""},{"$f":"IF($AA784=\"\",\"\",60*($AA784-1)+COUNTIF($AA$9:$AA784,$AA784))","v":""},null,1,"E"]
[782,null,null,null,null,null,null,null,null,null,null,null,null,null,null,null,null,null,null,null,null,null,null,null,null,null,{"$f":"IF($J785=\"\",\"\",MATCH($J785,OFFSET(BASE!$C$5,,,MAX(BASE!$B:$B)),0))","v":""},{"$f":"IF($AA785=\"\",\"\",60*($AA785-1)+COUNTIF($AA$9:$AA785,$AA785))","v":""},null,1,"E"]
[783,null,null,null,null,null,null,null,null,null,null,null,null,null,null,null,null,null,null,null,null,null,null,null,null,null,{"$f":"IF($J786=\"\",\"\",MATCH($J786,OFFSET(BASE!$C$5,,,MAX(BASE!$B:$B)),0))","v":""},{"$f":"IF($AA786=\"\",\"\",60*($AA786-1)+COUNTIF($AA$9:$AA786,$AA786))","v":""},null,1,"E"]
[784,null,null,null,null,null,null,null,null,null,null,null,null,null,null,null,null,null,null,null,null,null,null,null,null,null,{"$f":"IF($J787=\"\",\"\",MATCH($J787,OFFSET(BASE!$C$5,,,MAX(BASE!$B:$B)),0))","v":""},{"$f":"IF($AA787=\"\",\"\",60*($AA787-1)+COUNTIF($AA$9:$AA787,$AA787))","v":""},null,1,"E"]
[785,null,null,null,null,null,null,null,null,null,null,null,null,null,null,null,null,null,null,null,null,null,null,null,null,null,{"$f":"IF($J788=\"\",\"\",MATCH($J788,OFFSET(BASE!$C$5,,,MAX(BASE!$B:$B)),0))","v":""},{"$f":"IF($AA788=\"\",\"\",60*($AA788-1)+COUNTIF($AA$9:$AA788,$AA788))","v":""},null,1,"E"]
[786,null,null,null,null,null,null,null,null,null,null,null,null,null,null,null,null,null,null,null,null,null,null,null,null,null,{"$f":"IF($J789=\"\",\"\",MATCH($J789,OFFSET(BASE!$C$5,,,MAX(BASE!$B:$B)),0))","v":""},{"$f":"IF($AA789=\"\",\"\",60*($AA789-1)+COUNTIF($AA$9:$AA789,$AA789))","v":""},null,1,"E"]
[787,null,null,null,null,null,null,null,null,null,null,null,null,null,null,null,null,null,null,null,null,null,null,null,null,null,{"$f":"IF($J790=\"\",\"\",MATCH($J790,OFFSET(BASE!$C$5,,,MAX(BASE!$B:$B)),0))","v":""},{"$f":"IF($AA790=\"\",\"\",60*($AA790-1)+COUNTIF($AA$9:$AA790,$AA790))","v":""},null,1,"E"]
[788,null,null,null,null,null,null,null,null,null,null,null,null,null,null,null,null,null,null,null,null,null,null,null,null,null,{"$f":"IF($J791=\"\",\"\",MATCH($J791,OFFSET(BASE!$C$5,,,MAX(BASE!$B:$B)),0))","v":""},{"$f":"IF($AA791=\"\",\"\",60*($AA791-1)+COUNTIF($AA$9:$AA791,$AA791))","v":""},null,1,"E"]
[789,null,null,null,null,null,null,null,null,null,null,null,null,null,null,null,null,null,null,null,null,null,null,null,null,null,{"$f":"IF($J792=\"\",\"\",MATCH($J792,OFFSET(BASE!$C$5,,,MAX(BASE!$B:$B)),0))","v":""},{"$f":"IF($AA792=\"\",\"\",60*($AA792-1)+COUNTIF($AA$9:$AA792,$AA792))","v":""},null,1,"E"]
[790,null,null,null,null,null,null,null,null,null,null,null,null,null,null,null,null,null,null,null,null,null,null,null,null,null,{"$f":"IF($J793=\"\",\"\",MATCH($J793,OFFSET(BASE!$C$5,,,MAX(BASE!$B:$B)),0))","v":""},{"$f":"IF($AA793=\"\",\"\",60*($AA793-1)+COUNTIF($AA$9:$AA793,$AA793))","v":""},null,1,"E"]
[791,null,null,null,null,null,null,null,null,null,null,null,null,null,null,null,null,null,null,null,null,null,null,null,null,null,{"$f":"IF($J794=\"\",\"\",MATCH($J794,OFFSET(BASE!$C$5,,,MAX(BASE!$B:$B)),0))","v":""},{"$f":"IF($AA794=\"\",\"\",60*($AA794-1)+COUNTIF($AA$9:$AA794,$AA794))","v":""},null,1,"E"]
[792,null,null,null,null,null,null,null,null,null,null,null,null,null,null,null,null,null,null,null,null,null,null,null,null,null,{"$f":"IF($J795=\"\",\"\",MATCH($J795,OFFSET(BASE!$C$5,,,MAX(BASE!$B:$B)),0))","v":""},{"$f":"IF($AA795=\"\",\"\",60*($AA795-1)+COUNTIF($AA$9:$AA795,$AA795))","v":""},null,1,"E"]
[793,null,null,null,null,null,null,null,null,null,null,null,null,null,null,null,null,null,null,null,null,null,null,null,null,null,{"$f":"IF($J796=\"\",\"\",MATCH($J796,OFFSET(BASE!$C$5,,,MAX(BASE!$B:$B)),0))","v":""},{"$f":"IF($AA796=\"\",\"\",60*($AA796-1)+COUNTIF($AA$9:$AA796,$AA796))","v":""},null,1,"E"]
[794,null,null,null,null,null,null,null,null,null,null,null,null,null,null,null,null,null,null,null,null,null,null,null,null,null,{"$f":"IF($J797=\"\",\"\",MATCH($J797,OFFSET(BASE!$C$5,,,MAX(BASE!$B:$B)),0))","v":""},{"$f":"IF($AA797=\"\",\"\",60*($AA797-1)+COUNTIF($AA$9:$AA797,$AA797))","v":""},null,1,"E"]
[795,null,null,null,null,null,null,null,null,null,null,null,null,null,null,null,null,null,null,null,null,null,null,null,null,null,{"$f":"IF($J798=\"\",\"\",MATCH($J798,OFFSET(BASE!$C$5,,,MAX(BASE!$B:$B)),0))","v":""},{"$f":"IF($AA798=\"\",\"\",60*($AA798-1)+COUNTIF($AA$9:$AA798,$AA798))","v":""},null,1,"E"]
[796,null,null,null,null,null,null,null,null,null,null,null,null,null,null,null,null,null,null,null,null,null,null,null,null,null,{"$f":"IF($J799=\"\",\"\",MATCH($J799,OFFSET(BASE!$C$5,,,MAX(BASE!$B:$B)),0))","v":""},{"$f":"IF($AA799=\"\",\"\",60*($AA799-1)+COUNTIF($AA$9:$AA799,$AA799))","v":""},null,1,"E"]
[797,null,null,null,null,null,null,null,null,null,null,null,null,null,null,null,null,null,null,null,null,null,null,null,null,null,{"$f":"IF($J800=\"\",\"\",MATCH($J800,OFFSET(BASE!$C$5,,,MAX(BASE!$B:$B)),0))","v":""},{"$f":"IF($AA800=\"\",\"\",60*($AA800-1)+COUNTIF($AA$9:$AA800,$AA800))","v":""},null,1,"E"]
[798,null,null,null,null,null,null,null,null,null,null,null,null,null,null,null,null,null,null,null,null,null,null,null,null,null,{"$f":"IF($J801=\"\",\"\",MATCH($J801,OFFSET(BASE!$C$5,,,MAX(BASE!$B:$B)),0))","v":""},{"$f":"IF($AA801=\"\",\"\",60*($AA801-1)+COUNTIF($AA$9:$AA801,$AA801))","v":""},null,1,"E"]
[799,null,null,null,null,null,null,null,null,null,null,null,null,null,null,null,null,null,null,null,null,null,null,null,null,null,{"$f":"IF($J802=\"\",\"\",MATCH($J802,OFFSET(BASE!$C$5,,,MAX(BASE!$B:$B)),0))","v":""},{"$f":"IF($AA802=\"\",\"\",60*($AA802-1)+COUNTIF($AA$9:$AA802,$AA802))","v":""},null,1,"E"]
[800,null,null,null,null,null,null,null,null,null,null,null,null,null,null,null,null,null,null,null,null,null,null,null,null,null,{"$f":"IF($J803=\"\",\"\",MATCH($J803,OFFSET(BASE!$C$5,,,MAX(BASE!$B:$B)),0))","v":""},{"$f":"IF($AA803=\"\",\"\",60*($AA803-1)+COUNTIF($AA$9:$AA803,$AA803))","v":""},null,1,"E"]
[801,null,null,null,null,null,null,null,null,null,null,null,null,null,null,null,null,null,null,null,null,null,null,null,null,null,{"$f":"IF($J804=\"\",\"\",MATCH($J804,OFFSET(BASE!$C$5,,,MAX(BASE!$B:$B)),0))","v":""},{"$f":"IF($AA804=\"\",\"\",60*($AA804-1)+COUNTIF($AA$9:$AA804,$AA804))","v":""},null,1,"E"]
[802,null,null,null,null,null,null,null,null,null,null,null,null,null,null,null,null,null,null,null,null,null,null,null,null,null,{"$f":"IF($J805=\"\",\"\",MATCH($J805,OFFSET(BASE!$C$5,,,MAX(BASE!$B:$B)),0))","v":""},{"$f":"IF($AA805=\"\",\"\",60*($AA805-1)+COUNTIF($AA$9:$AA805,$AA805))","v":""},null,1,"E"]
[803,null,null,null,null,null,null,null,null,null,null,null,null,null,null,null,null,null,null,null,null,null,null,null,null,null,{"$f":"IF($J806=\"\",\"\",MATCH($J806,OFFSET(BASE!$C$5,,,MAX(BASE!$B:$B)),0))","v":""},{"$f":"IF($AA806=\"\",\"\",60*($AA806-1)+COUNTIF($AA$9:$AA806,$AA806))","v":""},null,1,"E"]
[804,null,null,null,null,null,null,null,null,null,null,null,null,null,null,null,null,null,null,null,null,null,null,null,null,null,{"$f":"IF($J807=\"\",\"\",MATCH($J807,OFFSET(BASE!$C$5,,,MAX(BASE!$B:$B)),0))","v":""},{"$f":"IF($AA807=\"\",\"\",60*($AA807-1)+COUNTIF($AA$9:$AA807,$AA807))","v":""},null,1,"E"]
[805,null,null,null,null,null,null,null,null,null,null,null,null,null,null,null,null,null,null,null,null,null,null,null,null,null,{"$f":"IF($J808=\"\",\"\",MATCH($J808,OFFSET(BASE!$C$5,,,MAX(BASE!$B:$B)),0))","v":""},{"$f":"IF($AA808=\"\",\"\",60*($AA808-1)+COUNTIF($AA$9:$AA808,$AA808))","v":""},null,1,"E"]
[806,null,null,null,null,null,null,null,null,null,null,null,null,null,null,null,null,null,null,null,null,null,null,null,null,null,{"$f":"IF($J809=\"\",\"\",MATCH($J809,OFFSET(BASE!$C$5,,,MAX(BASE!$B:$B)),0))","v":""},{"$f":"IF($AA809=\"\",\"\",60*($AA809-1)+COUNTIF($AA$9:$AA809,$AA809))","v":""},null,1,"E"]
[807,null,null,null,null,null,null,null,null,null,null,null,null,null,null,null,null,null,null,null,null,null,null,null,null,null,{"$f":"IF($J810=\"\",\"\",MATCH($J810,OFFSET(BASE!$C$5,,,MAX(BASE!$B:$B)),0))","v":""},{"$f":"IF($AA810=\"\",\"\",60*($AA810-1)+COUNTIF($AA$9:$AA810,$AA810))","v":""},null,1,"E"]
[808,null,null,null,null,null,null,null,null,null,null,null,null,null,null,null,null,null,null,null,null,null,null,null,null,null,{"$f":"IF($J811=\"\",\"\",MATCH($J811,OFFSET(BASE!$C$5,,,MAX(BASE!$B:$B)),0))","v":""},{"$f":"IF($AA811=\"\",\"\",60*($AA811-1)+COUNTIF($AA$9:$AA811,$AA811))","v":""},null,1,"E"]
[809,null,null,null,null,null,null,null,null,null,null,null,null,null,null,null,null,null,null,null,null,null,null,null,null,null,{"$f":"IF($J812=\"\",\"\",MATCH($J812,OFFSET(BASE!$C$5,,,MAX(BASE!$B:$B)),0))","v":""},{"$f":"IF($AA812=\"\",\"\",60*($AA812-1)+COUNTIF($AA$9:$AA812,$AA812))","v":""},null,null,"E"]
[810,null,null,null,null,null,null,null,null,null,null,null,null,null,null,null,null,null,null,null,null,null,null,null,null,null,{"$f":"IF($J813=\"\",\"\",MATCH($J813,OFFSET(BASE!$C$5,,,MAX(BASE!$B:$B)),0))","v":""},{"$f":"IF($AA813=\"\",\"\",60*($AA813-1)+COUNTIF($AA$9:$AA813,$AA813))","v":""},null,null,"E"]
[811,null,null,null,null,null,null,null,null,null,null,null,null,null,null,null,null,null,null,null,null,null,null,null,null,null,{"$f":"IF($J814=\"\",\"\",MATCH($J814,OFFSET(BASE!$C$5,,,MAX(BASE!$B:$B)),0))","v":""},{"$f":"IF($AA814=\"\",\"\",60*($AA814-1)+COUNTIF($AA$9:$AA814,$AA814))","v":""},null,null,"E"]
[812,null,null,null,null,null,null,null,null,null,null,null,null,null,null,null,null,null,null,null,null,null,null,null,null,null,{"$f":"IF($J815=\"\",\"\",MATCH($J815,OFFSET(BASE!$C$5,,,MAX(BASE!$B:$B)),0))","v":""},{"$f":"IF($AA815=\"\",\"\",60*($AA815-1)+COUNTIF($AA$9:$AA815,$AA815))","v":""},null,null,"E"]
[813,null,null,null,null,null,null,null,null,null,null,null,null,null,null,null,null,null,null,null,null,null,null,null,null,null,{"$f":"IF($J816=\"\",\"\",MATCH($J816,OFFSET(BASE!$C$5,,,MAX(BASE!$B:$B)),0))","v":""},{"$f":"IF($AA816=\"\",\"\",60*($AA816-1)+COUNTIF($AA$9:$AA816,$AA816))","v":""},null,null,"E"]
[814,null,null,null,null,null,null,null,null,null,null,null,null,null,null,null,null,null,null,null,null,null,null,null,null,null,{"$f":"IF($J817=\"\",\"\",MATCH($J817,OFFSET(BASE!$C$5,,,MAX(BASE!$B:$B)),0))","v":""},{"$f":"IF($AA817=\"\",\"\",60*($AA817-1)+COUNTIF($AA$9:$AA817,$AA817))","v":""},null,null,"E"]
[815,null,null,null,null,null,null,null,null,null,null,null,null,null,null,null,null,null,null,null,null,null,null,null,null,null,{"$f":"IF($J818=\"\",\"\",MATCH($J818,OFFSET(BASE!$C$5,,,MAX(BASE!$B:$B)),0))","v":""},{"$f":"IF($AA818=\"\",\"\",60*($AA818-1)+COUNTIF($AA$9:$AA818,$AA818))","v":""}]
[816,null,null,null,null,null,null,null,null,null,null,null,null,null,null,null,null,null,null,null,null,null,null,null,null,null,{"$f":"IF($J819=\"\",\"\",MATCH($J819,OFFSET(BASE!$C$5,,,MAX(BASE!$B:$B)),0))","v":""},{"$f":"IF($AA819=\"\",\"\",60*($AA819-1)+COUNTIF($AA$9:$AA819,$AA819))","v":""}]
[817,null,null,null,null,null,null,null,null,null,null,null,null,null,null,null,null,null,null,null,null,null,null,null,null,null,{"$f":"IF($J820=\"\",\"\",MATCH($J820,OFFSET(BASE!$C$5,,,MAX(BASE!$B:$B)),0))","v":""},{"$f":"IF($AA820=\"\",\"\",60*($AA820-1)+COUNTIF($AA$9:$AA820,$AA820))","v":""}]
[818,null,null,null,null,null,null,null,null,null,null,null,null,null,null,null,null,null,null,null,null,null,null,null,null,null,{"$f":"IF($J821=\"\",\"\",MATCH($J821,OFFSET(BASE!$C$5,,,MAX(BASE!$B:$B)),0))","v":""},{"$f":"IF($AA821=\"\",\"\",60*($AA821-1)+COUNTIF($AA$9:$AA821,$AA821))","v":""}]
[819,null,null,null,null,null,null,null,null,null,null,null,null,null,null,null,null,null,null,null,null,null,null,null,null,null,{"$f":"IF($J822=\"\",\"\",MATCH($J822,OFFSET(BASE!$C$5,,,MAX(BASE!$B:$B)),0))","v":""},{"$f":"IF($AA822=\"\",\"\",60*($AA822-1)+COUNTIF($AA$9:$AA822,$AA822))","v":""}]
[820,null,null,null,null,null,null,null,null,null,null,null,null,null,null,null,null,null,null,null,null,null,null,null,null,null,{"$f":"IF($J823=\"\",\"\",MATCH($J823,OFFSET(BASE!$C$5,,,MAX(BASE!$B:$B)),0))","v":""},{"$f":"IF($AA823=\"\",\"\",60*($AA823-1)+COUNTIF($AA$9:$AA823,$AA823))","v":""}]
[821,null,null,null,null,null,null,null,null,null,null,null,null,null,null,null,null,null,null,null,null,null,null,null,null,null,{"$f":"IF($J824=\"\",\"\",MATCH($J824,OFFSET(BASE!$C$5,,,MAX(BASE!$B:$B)),0))","v":""},{"$f":"IF($AA824=\"\",\"\",60*($AA824-1)+COUNTIF($AA$9:$AA824,$AA824))","v":""}]
[822,null,null,null,null,null,null,null,null,null,null,null,null,null,null,null,null,null,null,null,null,null,null,null,null,null,{"$f":"IF($J825=\"\",\"\",MATCH($J825,OFFSET(BASE!$C$5,,,MAX(BASE!$B:$B)),0))","v":""},{"$f":"IF($AA825=\"\",\"\",60*($AA825-1)+COUNTIF($AA$9:$AA825,$AA825))","v":""}]
[823,null,null,null,null,null,null,null,null,null,null,null,null,null,null,null,null,null,null,null,null,null,null,null,null,null,{"$f":"IF($J826=\"\",\"\",MATCH($J826,OFFSET(BASE!$C$5,,,MAX(BASE!$B:$B)),0))","v":""},{"$f":"IF($AA826=\"\",\"\",60*($AA826-1)+COUNTIF($AA$9:$AA826,$AA826))","v":""}]
[824,null,null,null,null,null,null,null,null,null,null,null,null,null,null,null,null,null,null,null,null,null,null,null,null,null,{"$f":"IF($J827=\"\",\"\",MATCH($J827,OFFSET(BASE!$C$5,,,MAX(BASE!$B:$B)),0))","v":""},{"$f":"IF($AA827=\"\",\"\",60*($AA827-1)+COUNTIF($AA$9:$AA827,$AA827))","v":""}]
[825,null,null,null,null,null,null,null,null,null,null,null,null,null,null,null,null,null,null,null,null,null,null,null,null,null,{"$f":"IF($J828=\"\",\"\",MATCH($J828,OFFSET(BASE!$C$5,,,MAX(BASE!$B:$B)),0))","v":""},{"$f":"IF($AA828=\"\",\"\",60*($AA828-1)+COUNTIF($AA$9:$AA828,$AA828))","v":""}]
[826,null,null,null,null,null,null,null,null,null,null,null,null,null,null,null,null,null,null,null,null,null,null,null,null,null,{"$f":"IF($J829=\"\",\"\",MATCH($J829,OFFSET(BASE!$C$5,,,MAX(BASE!$B:$B)),0))","v":""},{"$f":"IF($AA829=\"\",\"\",60*($AA829-1)+COUNTIF($AA$9:$AA829,$AA829))","v":""}]
[827,null,null,null,null,null,null,null,null,null,null,null,null,null,null,null,null,null,null,null,null,null,null,null,null,null,{"$f":"IF($J830=\"\",\"\",MATCH($J830,OFFSET(BASE!$C$5,,,MAX(BASE!$B:$B)),0))","v":""},{"$f":"IF($AA830=\"\",\"\",60*($AA830-1)+COUNTIF($AA$9:$AA830,$AA830))","v":""}]
[828,null,null,null,null,null,null,null,null,null,null,null,null,null,null,null,null,null,null,null,null,null,null,null,null,null,{"$f":"IF($J831=\"\",\"\",MATCH($J831,OFFSET(BASE!$C$5,,,MAX(BASE!$B:$B)),0))","v":""},{"$f":"IF($AA831=\"\",\"\",60*($AA831-1)+COUNTIF($AA$9:$AA831,$AA831))","v":""}]
[829,null,null,null,null,null,null,null,null,null,null,null,null,null,null,null,null,null,null,null,null,null,null,null,null,null,{"$f":"IF($J832=\"\",\"\",MATCH($J832,OFFSET(BASE!$C$5,,,MAX(BASE!$B:$B)),0))","v":""},{"$f":"IF($AA832=\"\",\"\",60*($AA832-1)+COUNTIF($AA$9:$AA832,$AA832))","v":""}]
[830,null,null,null,null,null,null,null,null,null,null,null,null,null,null,null,null,null,null,null,null,null,null,null,null,null,{"$f":"IF($J833=\"\",\"\",MATCH($J833,OFFSET(BASE!$C$5,,,MAX(BASE!$B:$B)),0))","v":""},{"$f":"IF($AA833=\"\",\"\",60*($AA833-1)+COUNTIF($AA$9:$AA833,$AA833))","v":""}]
[831,null,null,null,null,null,null,null,null,null,null,null,null,null,null,null,null,null,null,null,null,null,null,null,null,null,{"$f":"IF($J834=\"\",\"\",MATCH($J834,OFFSET(BASE!$C$5,,,MAX(BASE!$B:$B)),0))","v":""},{"$f":"IF($AA834=\"\",\"\",60*($AA834-1)+COUNTIF($AA$9:$AA834,$AA834))","v":""}]
[832,null,null,null,null,null,null,null,null,null,null,null,null,null,null,null,null,null,null,null,null,null,null,null,null,null,{"$f":"IF($J835=\"\",\"\",MATCH($J835,OFFSET(BASE!$C$5,,,MAX(BASE!$B:$B)),0))","v":""},{"$f":"IF($AA835=\"\",\"\",60*($AA835-1)+COUNTIF($AA$9:$AA835,$AA835))","v":""}]
[833,null,null,null,null,null,null,null,null,null,null,null,null,null,null,null,null,null,null,null,null,null,null,null,null,null,{"$f":"IF($J836=\"\",\"\",MATCH($J836,OFFSET(BASE!$C$5,,,MAX(BASE!$B:$B)),0))","v":""},{"$f":"IF($AA836=\"\",\"\",60*($AA836-1)+COUNTIF($AA$9:$AA836,$AA836))","v":""}]
[834,null,null,null,null,null,null,null,null,null,null,null,null,null,null,null,null,null,null,null,null,null,null,null,null,null,{"$f":"IF($J837=\"\",\"\",MATCH($J837,OFFSET(BASE!$C$5,,,MAX(BASE!$B:$B)),0))","v":""},{"$f":"IF($AA837=\"\",\"\",60*($AA837-1)+COUNTIF($AA$9:$AA837,$AA837))","v":""}]
[835,null,null,null,null,null,null,null,null,null,null,null,null,null,null,null,null,null,null,null,null,null,null,null,null,null,{"$f":"IF($J838=\"\",\"\",MATCH($J838,OFFSET(BASE!$C$5,,,MAX(BASE!$B:$B)),0))","v":""},{"$f":"IF($AA838=\"\",\"\",60*($AA838-1)+COUNTIF($AA$9:$AA838,$AA838))","v":""}]
[836,null,null,null,null,null,null,null,null,null,null,null,null,null,null,null,null,null,null,null,null,null,null,null,null,null,{"$f":"IF($J839=\"\",\"\",MATCH($J839,OFFSET(BASE!$C$5,,,MAX(BASE!$B:$B)),0))","v":""},{"$f":"IF($AA839=\"\",\"\",60*($AA839-1)+COUNTIF($AA$9:$AA839,$AA839))","v":""}]
[837,null,null,null,null,null,null,null,null,null,null,null,null,null,null,null,null,null,null,null,null,null,null,null,null,null,{"$f":"IF($J840=\"\",\"\",MATCH($J840,OFFSET(BASE!$C$5,,,MAX(BASE!$B:$B)),0))","v":""},{"$f":"IF($AA840=\"\",\"\",60*($AA840-1)+COUNTIF($AA$9:$AA840,$AA840))","v":""}]
[838,null,null,null,null,null,null,null,null,null,null,null,null,null,null,null,null,null,null,null,null,null,null,null,null,null,{"$f":"IF($J841=\"\",\"\",MATCH($J841,OFFSET(BASE!$C$5,,,MAX(BASE!$B:$B)),0))","v":""},{"$f":"IF($AA841=\"\",\"\",60*($AA841-1)+COUNTIF($AA$9:$AA841,$AA841))","v":""}]
[839,null,null,null,null,null,null,null,null,null,null,null,null,null,null,null,null,null,null,null,null,null,null,null,null,null,{"$f":"IF($J842=\"\",\"\",MATCH($J842,OFFSET(BASE!$C$5,,,MAX(BASE!$B:$B)),0))","v":""},{"$f":"IF($AA842=\"\",\"\",60*($AA842-1)+COUNTIF($AA$9:$AA842,$AA842))","v":""}]
[840,null,null,null,null,null,null,null,null,null,null,null,null,null,null,null,null,null,null,null,null,null,null,null,null,null,{"$f":"IF($J843=\"\",\"\",MATCH($J843,OFFSET(BASE!$C$5,,,MAX(BASE!$B:$B)),0))","v":""},{"$f":"IF($AA843=\"\",\"\",60*($AA843-1)+COUNTIF($AA$9:$AA843,$AA843))","v":""}]
[841,null,null,null,null,null,null,null,null,null,null,null,null,null,null,null,null,null,null,null,null,null,null,null,null,null,{"$f":"IF($J844=\"\",\"\",MATCH($J844,OFFSET(BASE!$C$5,,,MAX(BASE!$B:$B)),0))","v":""},{"$f":"IF($AA844=\"\",\"\",60*($AA844-1)+COUNTIF($AA$9:$AA844,$AA844))","v":""}]
[842,null,null,null,null,null,null,null,null,null,null,null,null,null,null,null,null,null,null,null,null,null,null,null,null,null,{"$f":"IF($J845=\"\",\"\",MATCH($J845,OFFSET(BASE!$C$5,,,MAX(BASE!$B:$B)),0))","v":""},{"$f":"IF($AA845=\"\",\"\",60*($AA845-1)+COUNTIF($AA$9:$AA845,$AA845))","v":""}]
[843,null,null,null,null,null,null,null,null,null,null,null,null,null,null,null,null,null,null,null,null,null,null,null,null,null,null,{"$f":"IF($AA846=\"\",\"\",60*($AA846-1)+COUNTIF($AA$9:$AA846,$AA846))","v":""}]
[844,null,null,null,null,null,null,null,null,null,null,null,null,null,null,null,null,null,null,null,null,null,null,null,null,null,null,{"$f":"IF($AA847=\"\",\"\",60*($AA847-1)+COUNTIF($AA$9:$AA847,$AA847))","v":""}]
[845,null,null,null,null,null,null,null,null,null,null,null,null,null,null,null,null,null,null,null,null,null,null,null,null,null,null,{"$f":"IF($AA848=\"\",\"\",60*($AA848-1)+COUNTIF($AA$9:$AA848,$AA848))","v":""}]
[846,null,null,null,null,null,null,null,null,null,null,null,null,null,null,null,null,null,null,null,null,null,null,null,null,null,null,{"$f":"IF($AA849=\"\",\"\",60*($AA849-1)+COUNTIF($AA$9:$AA849,$AA849))","v":""}]
[847,null,null,null,null,null,null,null,null,null,null,null,null,null,null,null,null,null,null,null,null,null,null,null,null,null,null,{"$f":"IF($AA850=\"\",\"\",60*($AA850-1)+COUNTIF($AA$9:$AA850,$AA850))","v":""}]
[848,null,null,null,null,null,null,null,null,null,null,null,null,null,null,null,null,null,null,null,null,null,null,null,null,null,null,{"$f":"IF($AA851=\"\",\"\",60*($AA851-1)+COUNTIF($AA$9:$AA851,$AA851))","v":""}]
[849,null,null,null,null,null,null,null,null,null,null,null,null,null,null,null,null,null,null,null,null,null,null,null,null,null,null,{"$f":"IF($AA852=\"\",\"\",60*($AA852-1)+COUNTIF($AA$9:$AA852,$AA852))","v":""}]
[850,null,null,null,null,null,null,null,null,null,null,null,null,null,null,null,null,null,null,null,null,null,null,null,null,null,null,{"$f":"IF($AA853=\"\",\"\",60*($AA853-1)+COUNTIF($AA$9:$AA853,$AA853))","v":""}]
[851,null,null,null,null,null,null,null,null,null,null,null,null,null,null,null,null,null,null,null,null,null,null,null,null,null,null,{"$f":"IF($AA854=\"\",\"\",60*($AA854-1)+COUNTIF($AA$9:$AA854,$AA854))","v":""}]
[852,null,null,null,null,null,null,null,null,null,null,null,null,null,null,null,null,null,null,null,null,null,null,null,null,null,null,{"$f":"IF($AA855=\"\",\"\",60*($AA855-1)+COUNTIF($AA$9:$AA855,$AA855))","v":""}]
[853,null,null,null,null,null,null,null,null,null,null,null,null,null,null,null,null,null,null,null,null,null,null,null,null,null,null,{"$f":"IF($AA856=\"\",\"\",60*($AA856-1)+COUNTIF($AA$9:$AA856,$AA856))","v":""}]
[854,null,null,null,null,null,null,null,null,null,null,null,null,null,null,null,null,null,null,null,null,null,null,null,null,null,null,{"$f":"IF($AA857=\"\",\"\",60*($AA857-1)+COUNTIF($AA$9:$AA857,$AA857))","v":""}]
[855,null,null,null,null,null,null,null,null,null,null,null,null,null,null,null,null,null,null,null,null,null,null,null,null,null,null,{"$f":"IF($AA858=\"\",\"\",60*($AA858-1)+COUNTIF($AA$9:$AA858,$AA858))","v":""}]
[856,null,null,null,null,null,null,null,null,null,null,null,null,null,null,null,null,null,null,null,null,null,null,null,null,null,null,{"$f":"IF($AA859=\"\",\"\",60*($AA859-1)+COUNTIF($AA$9:$AA859,$AA859))","v":""}]
[857,null,null,null,null,null,null,null,null,null,null,null,null,null,null,null,null,null,null,null,null,null,null,null,null,null,null,{"$f":"IF($AA860=\"\",\"\",60*($AA860-1)+COUNTIF($AA$9:$AA860,$AA860))","v":""}]
[858,null,null,null,null,null,null,null,null,null,null,null,null,null,null,null,null,null,null,null,null,null,null,null,null,null,null,{"$f":"IF($AA861=\"\",\"\",60*($AA861-1)+COUNTIF($AA$9:$AA861,$AA861))","v":""}]
[859,null,null,null,null,null,null,null,null,null,null,null,null,null,null,null,null,null,null,null,null,null,null,null,null,null,null,{"$f":"IF($AA862=\"\",\"\",60*($AA862-1)+COUNTIF($AA$9:$AA862,$AA862))","v":""}]
[860,null,null,null,null,null,null,null,null,null,null,null,null,null,null,null,null,null,null,null,null,null,null,null,null,null,null,{"$f":"IF($AA863=\"\",\"\",60*($AA863-1)+COUNTIF($AA$9:$AA863,$AA863))","v":""}]
[861,null,null,null,null,null,null,null,null,null,null,null,null,null,null,null,null,null,null,null,null,null,null,null,null,null,null,{"$f":"IF($AA864=\"\",\"\",60*($AA864-1)+COUNTIF($AA$9:$AA864,$AA864))","v":""}]
[862,null,null,null,null,null,null,null,null,null,null,null,null,null,null,null,null,null,null,null,null,null,null,null,null,null,null,{"$f":"IF($AA865=\"\",\"\",60*($AA865-1)+COUNTIF($AA$9:$AA865,$AA865))","v":""}]
[863,null,null,null,null,null,null,null,null,null,null,null,null,null,null,null,null,null,null,null,null,null,null,null,null,null,null,{"$f":"IF($AA866=\"\",\"\",60*($AA866-1)+COUNTIF($AA$9:$AA866,$AA866))","v":""}]
[864,null,null,null,null,null,null,null,null,null,null,null,null,null,null,null,null,null,null,null,null,null,null,null,null,null,null,{"$f":"IF($AA867=\"\",\"\",60*($AA867-1)+COUNTIF($AA$9:$AA867,$AA867))","v":""}]
[865,null,null,null,null,null,null,null,null,null,null,null,null,null,null,null,null,null,null,null,null,null,null,null,null,null,null,{"$f":"IF($AA868=\"\",\"\",60*($AA868-1)+COUNTIF($AA$9:$AA868,$AA868))","v":""}]
[866,null,null,null,null,null,null,null,null,null,null,null,null,null,null,null,null,null,null,null,null,null,null,null,null,null,null,{"$f":"IF($AA869=\"\",\"\",60*($AA869-1)+COUNTIF($AA$9:$AA869,$AA869))","v":""}]
[867,null,null,null,null,null,null,null,null,null,null,null,null,null,null,null,null,null,null,null,null,null,null,null,null,null,null,{"$f":"IF($AA870=\"\",\"\",60*($AA870-1)+COUNTIF($AA$9:$AA870,$AA870))","v":""}]
[868,null,null,null,null,null,null,null,null,null,null,null,null,null,null,null,null,null,null,null,null,null,null,null,null,null,null,{"$f":"IF($AA871=\"\",\"\",60*($AA871-1)+COUNTIF($AA$9:$AA871,$AA871))","v":""}]
[869,null,null,null,null,null,null,null,null,null,null,null,null,null,null,null,null,null,null,null,null,null,null,null,null,null,null,{"$f":"IF($AA872=\"\",\"\",60*($AA872-1)+COUNTIF($AA$9:$AA872,$AA872))","v":""}]
[870,null,null,null,null,null,null,null,null,null,null,null,null,null,null,null,null,null,null,null,null,null,null,null,null,null,null,{"$f":"IF($AA873=\"\",\"\",60*($AA873-1)+COUNTIF($AA$9:$AA873,$AA873))","v":""}]
[871,null,null,null,null,null,null,null,null,null,null,null,null,null,null,null,null,null,null,null,null,null,null,null,null,null,null,{"$f":"IF($AA874=\"\",\"\",60*($AA874-1)+COUNTIF($AA$9:$AA874,$AA874))","v":""}]
[872,null,null,null,null,null,null,null,null,null,null,null,null,null,null,null,null,null,null,null,null,null,null,null,null,null,null,{"$f":"IF($AA875=\"\",\"\",60*($AA875-1)+COUNTIF($AA$9:$AA875,$AA875))","v":""}]
[873,null,null,null,null,null,null,null,null,null,null,null,null,null,null,null,null,null,null,null,null,null,null,null,null,null,null,{"$f":"IF($AA876=\"\",\"\",60*($AA876-1)+COUNTIF($AA$9:$AA876,$AA876))","v":""}]
[874,null,null,null,null,null,null,null,null,null,null,null,null,null,null,null,null,null,null,null,null,null,null,null,null,null,null,{"$f":"IF($AA877=\"\",\"\",60*($AA877-1)+COUNTIF($AA$9:$AA877,$AA877))","v":""}]
[875,null,null,null,null,null,null,null,null,null,null,null,null,null,null,null,null,null,null,null,null,null,null,null,null,null,null,{"$f":"IF($AA878=\"\",\"\",60*($AA878-1)+COUNTIF($AA$9:$AA878,$AA878))","v":""}]
[876,null,null,null,null,null,null,null,null,null,null,null,null,null,null,null,null,null,null,null,null,null,null,null,null,null,null,{"$f":"IF($AA879=\"\",\"\",60*($AA879-1)+COUNTIF($AA$9:$AA879,$AA879))","v":""}]
[877,null,null,null,null,null,null,null,null,null,null,null,null,null,null,null,null,null,null,null,null,null,null,null,null,null,null,{"$f":"IF($AA880=\"\",\"\",60*($AA880-1)+COUNTIF($AA$9:$AA880,$AA880))","v":""}]
[878,null,null,null,null,null,null,null,null,null,null,null,null,null,null,null,null,null,null,null,null,null,null,null,null,null,null,{"$f":"IF($AA881=\"\",\"\",60*($AA881-1)+COUNTIF($AA$9:$AA881,$AA881))","v":""}]
[879,null,null,null,null,null,null,null,null,null,null,null,null,null,null,null,null,null,null,null,null,null,null,null,null,null,null,{"$f":"IF($AA882=\"\",\"\",60*($AA882-1)+COUNTIF($AA$9:$AA882,$AA882))","v":""}]
[880,null,null,null,null,null,null,null,null,null,null,null,null,null,null,null,null,null,null,null,null,null,null,null,null,null,null,{"$f":"IF($AA883=\"\",\"\",60*($AA883-1)+COUNTIF($AA$9:$AA883,$AA883))","v":""}]
[881,null,null,null,null,null,null,null,null,null,null,null,null,null,null,null,null,null,null,null,null,null,null,null,null,null,null,{"$f":"IF($AA884=\"\",\"\",60*($AA884-1)+COUNTIF($AA$9:$AA884,$AA884))","v":""}]
[882,null,null,null,null,null,null,null,null,null,null,null,null,null,null,null,null,null,null,null,null,null,null,null,null,null,null,{"$f":"IF($AA885=\"\",\"\",60*($AA885-1)+COUNTIF($AA$9:$AA885,$AA885))","v":""}]
[883,null,null,null,null,null,null,null,null,null,null,null,null,null,null,null,null,null,null,null,null,null,null,null,null,null,null,{"$f":"IF($AA886=\"\",\"\",60*($AA886-1)+COUNTIF($AA$9:$AA886,$AA886))","v":""}]
[884,null,null,null,null,null,null,null,null,null,null,null,null,null,null,null,null,null,null,null,null,null,null,null,null,null,null,{"$f":"IF($AA887=\"\",\"\",60*($AA887-1)+COUNTIF($AA$9:$AA887,$AA887))","v":""}]
[885,null,null,null,null,null,null,null,null,null,null,null,null,null,null,null,null,null,null,null,null,null,null,null,null,null,null,{"$f":"IF($AA888=\"\",\"\",60*($AA888-1)+COUNTIF($AA$9:$AA888,$AA888))","v":""}]
[886,null,null,null,null,null,null,null,null,null,null,null,null,null,null,null,null,null,null,null,null,null,null,null,null,null,null,{"$f":"IF($AA889=\"\",\"\",60*($AA889-1)+COUNTIF($AA$9:$AA889,$AA889))","v":""}]
[887,null,null,null,null,null,null,null,null,null,null,null,null,null,null,null,null,null,null,null,null,null,null,null,null,null,null,{"$f":"IF($AA890=\"\",\"\",60*($AA890-1)+COUNTIF($AA$9:$AA890,$AA890))","v":""}]
[888,null,null,null,null,null,null,null,null,null,null,null,null,null,null,null,null,null,null,null,null,null,null,null,null,null,null,{"$f":"IF($AA891=\"\",\"\",60*($AA891-1)+COUNTIF($AA$9:$AA891,$AA891))","v":""}]
[889,null,null,null,null,null,null,null,null,null,null,null,null,null,null,null,null,null,null,null,null,null,null,null,null,null,null,{"$f":"IF($AA892=\"\",\"\",60*($AA892-1)+COUNTIF($AA$9:$AA892,$AA892))","v":""}]
[890,null,null,null,null,null,null,null,null,null,null,null,null,null,null,null,null,null,null,null,null,null,null,null,null,null,null,{"$f":"IF($AA893=\"\",\"\",60*($AA893-1)+COUNTIF($AA$9:$AA893,$AA893))","v":""}]
[891,null,null,null,null,null,null,null,null,null,null,null,null,null,null,null,null,null,null,null,null,null,null,null,null,null,null,{"$f":"IF($AA894=\"\",\"\",60*($AA894-1)+COUNTIF($AA$9:$AA894,$AA894))","v":""}]
[892,null,null,null,null,null,null,null,null,null,null,null,null,null,null,null,null,null,null,null,null,null,null,null,null,null,null,{"$f":"IF($AA895=\"\",\"\",60*($AA895-1)+COUNTIF($AA$9:$AA895,$AA895))","v":""}]
[893,null,null,null,null,null,null,null,null,null,null,null,null,null,null,null,null,null,null,null,null,null,null,null,null,null,null,{"$f":"IF($AA896=\"\",\"\",60*($AA896-1)+COUNTIF($AA$9:$AA896,$AA896))","v":""}]
[894,null,null,null,null,null,null,null,null,null,null,null,null,null,null,null,null,null,null,null,null,null,null,null,null,null,null,{"$f":"IF($AA897=\"\",\"\",60*($AA897-1)+COUNTIF($AA$9:$AA897,$AA897))","v":""}]
[895,null,null,null,null,null,null,null,null,null,null,null,null,null,null,null,null,null,null,null,null,null,null,null,null,null,null,{"$f":"IF($AA898=\"\",\"\",60*($AA898-1)+COUNTIF($AA$9:$AA898,$AA898))","v":""}]
[896,null,null,null,null,null,null,null,null,null,null,null,null,null,null,null,null,null,null,null,null,null,null,null,null,null,null,{"$f":"IF($AA899=\"\",\"\",60*($AA899-1)+COUNTIF($AA$9:$AA899,$AA899))","v":""}]
[897,null,null,null,null,null,null,null,null,null,null,null,null,null,null,null,null,null,null,null,null,null,null,null,null,null,null,{"$f":"IF($AA900=\"\",\"\",60*($AA900-1)+COUNTIF($AA$9:$AA900,$AA900))","v":""}]
[898,null,null,null,null,null,null,null,null,null,null,null,null,null,null,null,null,null,null,null,null,null,null,null,null,null,null,{"$f":"IF($AA901=\"\",\"\",60*($AA901-1)+COUNTIF($AA$9:$AA901,$AA901))","v":""}]
[899,null,null,null,null,null,null,null,null,null,null,null,null,null,null,null,null,null,null,null,null,null,null,null,null,null,null,{"$f":"IF($AA902=\"\",\"\",60*($AA902-1)+COUNTIF($AA$9:$AA902,$AA902))","v":""}]
[900,null,null,null,null,null,null,null,null,null,null,null,null,null,null,null,null,null,null,null,null,null,null,null,null,null,null,{"$f":"IF($AA903=\"\",\"\",60*($AA903-1)+COUNTIF($AA$9:$AA903,$AA903))","v":""}]
[901,null,null,null,null,null,null,null,null,null,null,null,null,null,null,null,null,null,null,null,null,null,null,null,null,null,null,{"$f":"IF($AA904=\"\",\"\",60*($AA904-1)+COUNTIF($AA$9:$AA904,$AA904))","v":""}]
[902,null,null,null,null,null,null,null,null,null,null,null,null,null,null,null,null,null,null,null,null,null,null,null,null,null,null,{"$f":"IF($AA905=\"\",\"\",60*($AA905-1)+COUNTIF($AA$9:$AA905,$AA905))","v":""}]
[903,null,null,null,null,null,null,null,null,null,null,null,null,null,null,null,null,null,null,null,null,null,null,null,null,null,null,{"$f":"IF($AA906=\"\",\"\",60*($AA906-1)+COUNTIF($AA$9:$AA906,$AA906))","v":""}]
[904,null,null,null,null,null,null,null,null,null,null,null,null,null,null,null,null,null,null,null,null,null,null,null,null,null,null,{"$f":"IF($AA907=\"\",\"\",60*($AA907-1)+COUNTIF($AA$9:$AA907,$AA907))","v":""}]
[905,null,null,null,null,null,null,null,null,null,null,null,null,null,null,null,null,null,null,null,null,null,null,null,null,null,null,{"$f":"IF($AA908=\"\",\"\",60*($AA908-1)+COUNTIF($AA$9:$AA908,$AA908))","v":""}]
[906,null,null,null,null,null,null,null,null,null,null,null,null,null,null,null,null,null,null,null,null,null,null,null,null,null,null,{"$f":"IF($AA909=\"\",\"\",60*($AA909-1)+COUNTIF($AA$9:$AA909,$AA909))","v":""}]
[907,null,null,null,null,null,null,null,null,null,null,null,null,null,null,null,null,null,null,null,null,null,null,null,null,null,null,{"$f":"IF($AA910=\"\",\"\",60*($AA910-1)+COUNTIF($AA$9:$AA910,$AA910))","v":""}]
[908,null,null,null,null,null,null,null,null,null,null,null,null,null,null,null,null,null,null,null,null,null,null,null,null,null,null,{"$f":"IF($AA911=\"\",\"\",60*($AA911-1)+COUNTIF($AA$9:$AA911,$AA911))","v":""}]
[909,null,null,null,null,null,null,null,null,null,null,null,null,null,null,null,null,null,null,null,null,null,null,null,null,null,null,{"$f":"IF($AA912=\"\",\"\",60*($AA912-1)+COUNTIF($AA$9:$AA912,$AA912))","v":""}]
[910,null,null,null,null,null,null,null,null,null,null,null,null,null,null,null,null,null,null,null,null,null,null,null,null,null,null,{"$f":"IF($AA913=\"\",\"\",60*($AA913-1)+COUNTIF($AA$9:$AA913,$AA913))","v":""}]
[911,null,null,null,null,null,null,null,null,null,null,null,null,null,null,null,null,null,null,null,null,null,null,null,null,null,null,{"$f":"IF($AA914=\"\",\"\",60*($AA914-1)+COUNTIF($AA$9:$AA914,$AA914))","v":""}]
[912,null,null,null,null,null,null,null,null,null,null,null,null,null,null,null,null,null,null,null,null,null,null,null,null,null,null,{"$f":"IF($AA915=\"\",\"\",60*($AA915-1)+COUNTIF($AA$9:$AA915,$AA915))","v":""}]
[913,null,null,null,null,null,null,null,null,null,null,null,null,null,null,null,null,null,null,null,null,null,null,null,null,null,null,{"$f":"IF($AA916=\"\",\"\",60*($AA916-1)+COUNTIF($AA$9:$AA916,$AA916))","v":""}]
[914,null,null,null,null,null,null,null,null,null,null,null,null,null,null,null,null,null,null,null,null,null,null,null,null,null,null,{"$f":"IF($AA917=\"\",\"\",60*($AA917-1)+COUNTIF($AA$9:$AA917,$AA917))","v":""}]
[915,null,null,null,null,null,null,null,null,null,null,null,null,null,null,null,null,null,null,null,null,null,null,null,null,null,null,{"$f":"IF($AA918=\"\",\"\",60*($AA918-1)+COUNTIF($AA$9:$AA918,$AA918))","v":""}]
[916,null,null,null,null,null,null,null,null,null,null,null,null,null,null,null,null,null,null,null,null,null,null,null,null,null,null,{"$f":"IF($AA919=\"\",\"\",60*($AA919-1)+COUNTIF($AA$9:$AA919,$AA919))","v":""}]
[917,null,null,null,null,null,null,null,null,null,null,null,null,null,null,null,null,null,null,null,null,null,null,null,null,null,null,{"$f":"IF($AA920=\"\",\"\",60*($AA920-1)+COUNTIF($AA$9:$AA920,$AA920))","v":""}]
[918,null,null,null,null,null,null,null,null,null,null,null,null,null,null,null,null,null,null,null,null,null,null,null,null,null,null,{"$f":"IF($AA921=\"\",\"\",60*($AA921-1)+COUNTIF($AA$9:$AA921,$AA921))","v":""}]
[919,null,null,null,null,null,null,null,null,null,null,null,null,null,null,null,null,null,null,null,null,null,null,null,null,null,null,{"$f":"IF($AA922=\"\",\"\",60*($AA922-1)+COUNTIF($AA$9:$AA922,$AA922))","v":""}]
[920,null,null,null,null,null,null,null,null,null,null,null,null,null,null,null,null,null,null,null,null,null,null,null,null,null,null,{"$f":"IF($AA923=\"\",\"\",60*($AA923-1)+COUNTIF($AA$9:$AA923,$AA923))","v":""}]
[921,null,null,null,null,null,null,null,null,null,null,null,null,null,null,null,null,null,null,null,null,null,null,null,null,null,null,{"$f":"IF($AA924=\"\",\"\",60*($AA924-1)+COUNTIF($AA$9:$AA924,$AA924))","v":""}]
[922,null,null,null,null,null,null,null,null,null,null,null,null,null,null,null,null,null,null,null,null,null,null,null,null,null,null,{"$f":"IF($AA925=\"\",\"\",60*($AA925-1)+COUNTIF($AA$9:$AA925,$AA925))","v":""}]
[923,null,null,null,null,null,null,null,null,null,null,null,null,null,null,null,null,null,null,null,null,null,null,null,null,null,null,{"$f":"IF($AA926=\"\",\"\",60*($AA926-1)+COUNTIF($AA$9:$AA926,$AA926))","v":""}]
[924,null,null,null,null,null,null,null,null,null,null,null,null,null,null,null,null,null,null,null,null,null,null,null,null,null,null,{"$f":"IF($AA927=\"\",\"\",60*($AA927-1)+COUNTIF($AA$9:$AA927,$AA927))","v":""}]
[925,null,null,null,null,null,null,null,null,null,null,null,null,null,null,null,null,null,null,null,null,null,null,null,null,null,null,{"$f":"IF($AA928=\"\",\"\",60*($AA928-1)+COUNTIF($AA$9:$AA928,$AA928))","v":""}]
[926,null,null,null,null,null,null,null,null,null,null,null,null,null,null,null,null,null,null,null,null,null,null,null,null,null,null,{"$f":"IF($AA929=\"\",\"\",60*($AA929-1)+COUNTIF($AA$9:$AA929,$AA929))","v":""}]
[927,null,null,null,null,null,null,null,null,null,null,null,null,null,null,null,null,null,null,null,null,null,null,null,null,null,null,{"$f":"IF($AA930=\"\",\"\",60*($AA930-1)+COUNTIF($AA$9:$AA930,$AA930))","v":""}]
[928,null,null,null,null,null,null,null,null,null,null,null,null,null,null,null,null,null,null,null,null,null,null,null,null,null,null,{"$f":"IF($AA931=\"\",\"\",60*($AA931-1)+COUNTIF($AA$9:$AA931,$AA931))","v":""}]
[929,null,null,null,null,null,null,null,null,null,null,null,null,null,null,null,null,null,null,null,null,null,null,null,null,null,null,{"$f":"IF($AA932=\"\",\"\",60*($AA932-1)+COUNTIF($AA$9:$AA932,$AA932))","v":""}]
[930,null,null,null,null,null,null,null,null,null,null,null,null,null,null,null,null,null,null,null,null,null,null,null,null,null,null,{"$f":"IF($AA933=\"\",\"\",60*($AA933-1)+COUNTIF($AA$9:$AA933,$AA933))","v":""}]
[931,null,null,null,null,null,null,null,null,null,null,null,null,null,null,null,null,null,null,null,null,null,null,null,null,null,null,{"$f":"IF($AA934=\"\",\"\",60*($AA934-1)+COUNTIF($AA$9:$AA934,$AA934))","v":""}]
[932,null,null,null,null,null,null,null,null,null,null,null,null,null,null,null,null,null,null,null,null,null,null,null,null,null,null,{"$f":"IF($AA935=\"\",\"\",60*($AA935-1)+COUNTIF($AA$9:$AA935,$AA935))","v":""}]
[933,null,null,null,null,null,null,null,null,null,null,null,null,null,null,null,null,null,null,null,null,null,null,null,null,null,null,{"$f":"IF($AA936=\"\",\"\",60*($AA936-1)+COUNTIF($AA$9:$AA936,$AA936))","v":""}]
[934,null,null,null,null,null,null,null,null,null,null,null,null,null,null,null,null,null,null,null,null,null,null,null,null,null,null,{"$f":"IF($AA937=\"\",\"\",60*($AA937-1)+COUNTIF($AA$9:$AA937,$AA937))","v":""}]
[935,null,null,null,null,null,null,null,null,null,null,null,null,null,null,null,null,null,null,null,null,null,null,null,null,null,null,{"$f":"IF($AA938=\"\",\"\",60*($AA938-1)+COUNTIF($AA$9:$AA938,$AA938))","v":""}]
[936,null,null,null,null,null,null,null,null,null,null,null,null,null,null,null,null,null,null,null,null,null,null,null,null,null,null,{"$f":"IF($AA939=\"\",\"\",60*($AA939-1)+COUNTIF($AA$9:$AA939,$AA939))","v":""}]
[937,null,null,null,null,null,null,null,null,null,null,null,null,null,null,null,null,null,null,null,null,null,null,null,null,null,null,{"$f":"IF($AA940=\"\",\"\",60*($AA940-1)+COUNTIF($AA$9:$AA940,$AA940))","v":""}]
[938,null,null,null,null,null,null,null,null,null,null,null,null,null,null,null,null,null,null,null,null,null,null,null,null,null,null,{"$f":"IF($AA941=\"\",\"\",60*($AA941-1)+COUNTIF($AA$9:$AA941,$AA941))","v":""}]
[939,null,null,null,null,null,null,null,null,null,null,null,null,null,null,null,null,null,null,null,null,null,null,null,null,null,null,{"$f":"IF($AA942=\"\",\"\",60*($AA942-1)+COUNTIF($AA$9:$AA942,$AA942))","v":""}]
[940,null,null,null,null,null,null,null,null,null,null,null,null,null,null,null,null,null,null,null,null,null,null,null,null,null,null,{"$f":"IF($AA943=\"\",\"\",60*($AA943-1)+COUNTIF($AA$9:$AA943,$AA943))","v":""}]
[941,null,null,null,null,null,null,null,null,null,null,null,null,null,null,null,null,null,null,null,null,null,null,null,null,null,null,{"$f":"IF($AA944=\"\",\"\",60*($AA944-1)+COUNTIF($AA$9:$AA944,$AA944))","v":""}]
[942,null,null,null,null,null,null,null,null,null,null,null,null,null,null,null,null,null,null,null,null,null,null,null,null,null,null,{"$f":"IF($AA945=\"\",\"\",60*($AA945-1)+COUNTIF($AA$9:$AA945,$AA945))","v":""}]
[943,null,null,null,null,null,null,null,null,null,null,null,null,null,null,null,null,null,null,null,null,null,null,null,null,null,null,{"$f":"IF($AA946=\"\",\"\",60*($AA946-1)+COUNTIF($AA$9:$AA946,$AA946))","v":""}]
[944,null,null,null,null,null,null,null,null,null,null,null,null,null,null,null,null,null,null,null,null,null,null,null,null,null,null,{"$f":"IF($AA947=\"\",\"\",60*($AA947-1)+COUNTIF($AA$9:$AA947,$AA947))","v":""}]
[945,null,null,null,null,null,null,null,null,null,null,null,null,null,null,null,null,null,null,null,null,null,null,null,null,null,null,{"$f":"IF($AA948=\"\",\"\",60*($AA948-1)+COUNTIF($AA$9:$AA948,$AA948))","v":""}]
[946,null,null,null,null,null,null,null,null,null,null,null,null,null,null,null,null,null,null,null,null,null,null,null,null,null,null,{"$f":"IF($AA949=\"\",\"\",60*($AA949-1)+COUNTIF($AA$9:$AA949,$AA949))","v":""}]
[947,null,null,null,null,null,null,null,null,null,null,null,null,null,null,null,null,null,null,null,null,null,null,null,null,null,null,{"$f":"IF($AA950=\"\",\"\",60*($AA950-1)+COUNTIF($AA$9:$AA950,$AA950))","v":""}]
[948,null,null,null,null,null,null,null,null,null,null,null,null,null,null,null,null,null,null,null,null,null,null,null,null,null,null,{"$f":"IF($AA951=\"\",\"\",60*($AA951-1)+COUNTIF($AA$9:$AA951,$AA951))","v":""}]
[949,null,null,null,null,null,null,null,null,null,null,null,null,null,null,null,null,null,null,null,null,null,null,null,null,null,null,{"$f":"IF($AA952=\"\",\"\",60*($AA952-1)+COUNTIF($AA$9:$AA952,$AA952))","v":""}]
[950,null,null,null,null,null,null,null,null,null,null,null,null,null,null,null,null,null,null,null,null,null,null,null,null,null,null,{"$f":"IF($AA953=\"\",\"\",60*($AA953-1)+COUNTIF($AA$9:$AA953,$AA953))","v":""}]
[951,null,null,null,null,null,null,null,null,null,null,null,null,null,null,null,null,null,null,null,null,null,null,null,null,null,null,{"$f":"IF($AA954=\"\",\"\",60*($AA954-1)+COUNTIF($AA$9:$AA954,$AA954))","v":""}]
[952,null,null,null,null,null,null,null,null,null,null,null,null,null,null,null,null,null,null,null,null,null,null,null,null,null,null,{"$f":"IF($AA955=\"\",\"\",60*($AA955-1)+COUNTIF($AA$9:$AA955,$AA955))","v":""}]
[953,null,null,null,null,null,null,null,null,null,null,null,null,null,null,null,null,null,null,null,null,null,null,null,null,null,null,{"$f":"IF($AA956=\"\",\"\",60*($AA956-1)+COUNTIF($AA$9:$AA956,$AA956))","v":""}]
[954,null,null,null,null,null,null,null,null,null,null,null,null,null,null,null,null,null,null,null,null,null,null,null,null,null,null,{"$f":"IF($AA957=\"\",\"\",60*($AA957-1)+COUNTIF($AA$9:$AA957,$AA957))","v":""}]
[955,null,null,null,null,null,null,null,null,null,null,null,null,null,null,null,null,null,null,null,null,null,null,null,null,null,null,{"$f":"IF($AA958=\"\",\"\",60*($AA958-1)+COUNTIF($AA$9:$AA958,$AA958))","v":""}]
[956,null,null,null,null,null,null,null,null,null,null,null,null,null,null,null,null,null,null,null,null,null,null,null,null,null,null,{"$f":"IF($AA959=\"\",\"\",60*($AA959-1)+COUNTIF($AA$9:$AA959,$AA959))","v":""}]
[957,null,null,null,null,null,null,null,null,null,null,null,null,null,null,null,null,null,null,null,null,null,null,null,null,null,null,{"$f":"IF($AA960=\"\",\"\",60*($AA960-1)+COUNTIF($AA$9:$AA960,$AA960))","v":""}]
[958,null,null,null,null,null,null,null,null,null,null,null,null,null,null,null,null,null,null,null,null,null,null,null,null,null,null,{"$f":"IF($AA961=\"\",\"\",60*($AA961-1)+COUNTIF($AA$9:$AA961,$AA961))","v":""}]
[959,null,null,null,null,null,null,null,null,null,null,null,null,null,null,null,null,null,null,null,null,null,null,null,null,null,null,{"$f":"IF($AA962=\"\",\"\",60*($AA962-1)+COUNTIF($AA$9:$AA962,$AA962))","v":""}]
[960,null,null,null,null,null,null,null,null,null,null,null,null,null,null,null,null,null,null,null,null,null,null,null,null,null,null,{"$f":"IF($AA963=\"\",\"\",60*($AA963-1)+COUNTIF($AA$9:$AA963,$AA963))","v":""}]
[961,null,null,null,null,null,null,null,null,null,null,null,null,null,null,null,null,null,null,null,null,null,null,null,null,null,null,{"$f":"IF($AA964=\"\",\"\",60*($AA964-1)+COUNTIF($AA$9:$AA964,$AA964))","v":""}]
[962,null,null,null,null,null,null,null,null,null,null,null,null,null,null,null,null,null,null,null,null,null,null,null,null,null,null,{"$f":"IF($AA965=\"\",\"\",60*($AA965-1)+COUNTIF($AA$9:$AA965,$AA965))","v":""}]
[963,null,null,null,null,null,null,null,null,null,null,null,null,null,null,null,null,null,null,null,null,null,null,null,null,null,null,{"$f":"IF($AA966=\"\",\"\",60*($AA966-1)+COUNTIF($AA$9:$AA966,$AA966))","v":""}]
[964,null,null,null,null,null,null,null,null,null,null,null,null,null,null,null,null,null,null,null,null,null,null,null,null,null,null,{"$f":"IF($AA967=\"\",\"\",60*($AA967-1)+COUNTIF($AA$9:$AA967,$AA967))","v":""}]
[965,null,null,null,null,null,null,null,null,null,null,null,null,null,null,null,null,null,null,null,null,null,null,null,null,null,null,{"$f":"IF($AA968=\"\",\"\",60*($AA968-1)+COUNTIF($AA$9:$AA968,$AA968))","v":""}]
[966,null,null,null,null,null,null,null,null,null,null,null,null,null,null,null,null,null,null,null,null,null,null,null,null,null,null,{"$f":"IF($AA969=\"\",\"\",60*($AA969-1)+COUNTIF($AA$9:$AA969,$AA969))","v":""}]
[967,null,null,null,null,null,null,null,null,null,null,null,null,null,null,null,null,null,null,null,null,null,null,null,null,null,null,{"$f":"IF($AA970=\"\",\"\",60*($AA970-1)+COUNTIF($AA$9:$AA970,$AA970))","v":""}]
[968,null,null,null,null,null,null,null,null,null,null,null,null,null,null,null,null,null,null,null,null,null,null,null,null,null,null,{"$f":"IF($AA971=\"\",\"\",60*($AA971-1)+COUNTIF($AA$9:$AA971,$AA971))","v":""}]
[969,null,null,null,null,null,null,null,null,null,null,null,null,null,null,null,null,null,null,null,null,null,null,null,null,null,null,{"$f":"IF($AA972=\"\",\"\",60*($AA972-1)+COUNTIF($AA$9:$AA972,$AA972))","v":""}]
[970,null,null,null,null,null,null,null,null,null,null,null,null,null,null,null,null,null,null,null,null,null,null,null,null,null,null,{"$f":"IF($AA973=\"\",\"\",60*($AA973-1)+COUNTIF($AA$9:$AA973,$AA973))","v":""}]
[971,null,null,null,null,null,null,null,null,null,null,null,null,null,null,null,null,null,null,null,null,null,null,null,null,null,null,{"$f":"IF($AA974=\"\",\"\",60*($AA974-1)+COUNTIF($AA$9:$AA974,$AA974))","v":""}]
[972,null,null,null,null,null,null,null,null,null,null,null,null,null,null,null,null,null,null,null,null,null,null,null,null,null,null,{"$f":"IF($AA975=\"\",\"\",60*($AA975-1)+COUNTIF($AA$9:$AA975,$AA975))","v":""}]
[973,null,null,null,null,null,null,null,null,null,null,null,null,null,null,null,null,null,null,null,null,null,null,null,null,null,null,{"$f":"IF($AA976=\"\",\"\",60*($AA976-1)+COUNTIF($AA$9:$AA976,$AA976))","v":""}]
[974,null,null,null,null,null,null,null,null,null,null,null,null,null,null,null,null,null,null,null,null,null,null,null,null,null,null,{"$f":"IF($AA977=\"\",\"\",60*($AA977-1)+COUNTIF($AA$9:$AA977,$AA977))","v":""}]
[975,null,null,null,null,null,null,null,null,null,null,null,null,null,null,null,null,null,null,null,null,null,null,null,null,null,null,{"$f":"IF($AA978=\"\",\"\",60*($AA978-1)+COUNTIF($AA$9:$AA978,$AA978))","v":""}]
[976,null,null,null,null,null,null,null,null,null,null,null,null,null,null,null,null,null,null,null,null,null,null,null,null,null,null,{"$f":"IF($AA979=\"\",\"\",60*($AA979-1)+COUNTIF($AA$9:$AA979,$AA979))","v":""}]
[977,null,null,null,null,null,null,null,null,null,null,null,null,null,null,null,null,null,null,null,null,null,null,null,null,null,null,{"$f":"IF($AA980=\"\",\"\",60*($AA980-1)+COUNTIF($AA$9:$AA980,$AA980))","v":""}]
[978,null,null,null,null,null,null,null,null,null,null,null,null,null,null,null,null,null,null,null,null,null,null,null,null,null,null,{"$f":"IF($AA981=\"\",\"\",60*($AA981-1)+COUNTIF($AA$9:$AA981,$AA981))","v":""}]
[979,null,null,null,null,null,null,null,null,null,null,null,null,null,null,null,null,null,null,null,null,null,null,null,null,null,null,{"$f":"IF($AA982=\"\",\"\",60*($AA982-1)+COUNTIF($AA$9:$AA982,$AA982))","v":""}]
[980,null,null,null,null,null,null,null,null,null,null,null,null,null,null,null,null,null,null,null,null,null,null,null,null,null,null,{"$f":"IF($AA983=\"\",\"\",60*($AA983-1)+COUNTIF($AA$9:$AA983,$AA983))","v":""}]
[981,null,null,null,null,null,null,null,null,null,null,null,null,null,null,null,null,null,null,null,null,null,null,null,null,null,null,{"$f":"IF($AA984=\"\",\"\",60*($AA984-1)+COUNTIF($AA$9:$AA984,$AA984))","v":""}]
[982,null,null,null,null,null,null,null,null,null,null,null,null,null,null,null,null,null,null,null,null,null,null,null,null,null,null,{"$f":"IF($AA985=\"\",\"\",60*($AA985-1)+COUNTIF($AA$9:$AA985,$AA985))","v":""}]
[983,null,null,null,null,null,null,null,null,null,null,null,null,null,null,null,null,null,null,null,null,null,null,null,null,null,null,{"$f":"IF($AA986=\"\",\"\",60*($AA986-1)+COUNTIF($AA$9:$AA986,$AA986))","v":""}]
[984,null,null,null,null,null,null,null,null,null,null,null,null,null,null,null,null,null,null,null,null,null,null,null,null,null,null,{"$f":"IF($AA987=\"\",\"\",60*($AA987-1)+COUNTIF($AA$9:$AA987,$AA987))","v":""}]
[985,null,null,null,null,null,null,null,null,null,null,null,null,null,null,null,null,null,null,null,null,null,null,null,null,null,null,{"$f":"IF($AA988=\"\",\"\",60*($AA988-1)+COUNTIF($AA$9:$AA988,$AA988))","v":""}]
[986,null,null,null,null,null,null,null,null,null,null,null,null,null,null,null,null,null,null,null,null,null,null,null,null,null,null,{"$f":"IF($AA989=\"\",\"\",60*($AA989-1)+COUNTIF($AA$9:$AA989,$AA989))","v":""}]
[987,null,null,null,null,null,null,null,null,null,null,null,null,null,null,null,null,null,null,null,null,null,null,null,null,null,null,{"$f":"IF($AA990=\"\",\"\",60*($AA990-1)+COUNTIF($AA$9:$AA990,$AA990))","v":""}]
[988,null,null,null,null,null,null,null,null,null,null,null,null,null,null,null,null,null,null,null,null,null,null,null,null,null,null,{"$f":"IF($AA991=\"\",\"\",60*($AA991-1)+COUNTIF($AA$9:$AA991,$AA991))","v":""}]
[989,null,null,null,null,null,null,null,null,null,null,null,null,null,null,null,null,null,null,null,null,null,null,null,null,null,null,{"$f":"IF($AA992=\"\",\"\",60*($AA992-1)+COUNTIF($AA$9:$AA992,$AA992))","v":""}]
[990,null,null,null,null,null,null,null,null,null,null,null,null,null,null,null,null,null,null,null,null,null,null,null,null,null,null,{"$f":"IF($AA993=\"\",\"\",60*($AA993-1)+COUNTIF($AA$9:$AA993,$AA993))","v":""}]
[991,null,null,null,null,null,null,null,null,null,null,null,null,null,null,null,null,null,null,null,null,null,null,null,null,null,null,{"$f":"IF($AA994=\"\",\"\",60*($AA994-1)+COUNTIF($AA$9:$AA994,$AA994))","v":""}]
[992,null,null,null,null,null,null,null,null,null,null,null,null,null,null,null,null,null,null,null,null,null,null,null,null,null,null,{"$f":"IF($AA995=\"\",\"\",60*($AA995-1)+COUNTIF($AA$9:$AA995,$AA995))","v":""}]
[993,null,null,null,null,null,null,null,null,null,null,null,null,null,null,null,null,null,null,null,null,null,null,null,null,null,null,{"$f":"IF($AA996=\"\",\"\",60*($AA996-1)+COUNTIF($AA$9:$AA996,$AA996))","v":""}]
[994,null,null,null,null,null,null,null,null,null,null,null,null,null,null,null,null,null,null,null,null,null,null,null,null,null,null,{"$f":"IF($AA997=\"\",\"\",60*($AA997-1)+COUNTIF($AA$9:$AA997,$AA997))","v":""}]
[995,null,null,null,null,null,null,null,null,null,null,null,null,null,null,null,null,null,null,null,null,null,null,null,null,null,null,{"$f":"IF($AA998=\"\",\"\",60*($AA998-1)+COUNTIF($AA$9:$AA998,$AA998))","v":""}]
[996,null,null,null,null,null,null,null,null,null,null,null,null,null,null,null,null,null,null,null,null,null,null,null,null,null,null,{"$f":"IF($AA999=\"\",\"\",60*($AA999-1)+COUNTIF($AA$9:$AA999,$AA999))","v":""}]
[997,null,null,null,null,null,null,null,null,null,null,null,null,null,null,null,null,null,null,null,null,null,null,null,null,null,null,{"$f":"IF($AA1000=\"\",\"\",60*($AA1000-1)+COUNTIF($AA$9:$AA1000,$AA1000))","v":""}]
[998,null,null,null,null,null,null,null,null,null,null,null,null,null,null,null,null,null,null,null,null,null,null,null,null,null,null,{"$f":"IF($AA1001=\"\",\"\",60*($AA1001-1)+COUNTIF($AA$9:$AA1001,$AA1001))","v":""}]
[999,null,null,null,null,null,null,null,null,null,null,null,null,null,null,null,null,null,null,null,null,null,null,null,null,null,null,{"$f":"IF($AA1002=\"\",\"\",60*($AA1002-1)+COUNTIF($AA$9:$AA1002,$AA1002))","v":""}]
[1000,null,null,null,null,null,null,null,null,null,null,null,null,null,null,null,null,null,null,null,null,null,null,null,null,null,null,{"$f":"IF($AA1003=\"\",\"\",60*($AA1003-1)+COUNTIF($AA$9:$AA1003,$AA1003))","v":""}]
[1001,null,null,null,null,null,null,null,null,null,null,null,null,null,null,null,null,null,null,null,null,null,null,null,null,null,null,{"$f":"IF($AA1004=\"\",\"\",60*($AA1004-1)+COUNTIF($AA$9:$AA1004,$AA1004))","v":""}]
[1002,null,null,null,null,null,null,null,null,null,null,null,null,null,null,null,null,null,null,null,null,null,null,null,null,null,null,{"$f":"IF($AA1005=\"\",\"\",60*($AA1005-1)+COUNTIF($AA$9:$AA1005,$AA1005))","v":""}]
[1003,null,null,null,null,null,null,null,null,null,null,null,null,null,null,null,null,null,null,null,null,null,null,null,null,null,null,{"$f":"IF($AA1006=\"\",\"\",60*($AA1006-1)+COUNTIF($AA$9:$AA1006,$AA1006))","v":""}]
[1004,null,null,null,null,null,null,null,null,null,null,null,null,null,null,null,null,null,null,null,null,null,null,null,null,null,null,{"$f":"IF($AA1007=\"\",\"\",60*($AA1007-1)+COUNTIF($AA$9:$AA1007,$AA1007))","v":""}]
[1005,null,null,null,null,null,null,null,null,null,null,null,null,null,null,null,null,null,null,null,null,null,null,null,null,null,null,{"$f":"IF($AA1008=\"\",\"\",60*($AA1008-1)+COUNTIF($AA$9:$AA1008,$AA1008))","v":""}]
[1006,null,null,null,null,null,null,null,null,null,null,null,null,null,null,null,null,null,null,null,null,null,null,null,null,null,null,{"$f":"IF($AA1009=\"\",\"\",60*($AA1009-1)+COUNTIF($AA$9:$AA1009,$AA1009))","v":""}]
[1007,null,null,null,null,null,null,null,null,null,null,null,null,null,null,null,null,null,null,null,null,null,null,null,null,null,null,{"$f":"IF($AA1010=\"\",\"\",60*($AA1010-1)+COUNTIF($AA$9:$AA1010,$AA1010))","v":""}]
[1008,null,null,null,null,null,null,null,null,null,null,null,null,null,null,null,null,null,null,null,null,null,null,null,null,null,null,{"$f":"IF($AA1011=\"\",\"\",60*($AA1011-1)+COUNTIF($AA$9:$AA1011,$AA1011))","v":""}]
[1009,null,null,null,null,null,null,null,null,null,null,null,null,null,null,null,null,null,null,null,null,null,null,null,null,null,null,{"$f":"IF($AA1012=\"\",\"\",60*($AA1012-1)+COUNTIF($AA$9:$AA1012,$AA1012))","v":""}]
[1010,null,null,null,null,null,null,null,null,null,null,null,null,null,null,null,null,null,null,null,null,null,null,null,null,null,null,{"$f":"IF($AA1013=\"\",\"\",60*($AA1013-1)+COUNTIF($AA$9:$AA1013,$AA1013))","v":""}]
[1011,null,null,null,null,null,null,null,null,null,null,null,null,null,null,null,null,null,null,null,null,null,null,null,null,null,null,{"$f":"IF($AA1014=\"\",\"\",60*($AA1014-1)+COUNTIF($AA$9:$AA1014,$AA1014))","v":""}]
[1012,null,null,null,null,null,null,null,null,null,null,null,null,null,null,null,null,null,null,null,null,null,null,null,null,null,null,{"$f":"IF($AA1015=\"\",\"\",60*($AA1015-1)+COUNTIF($AA$9:$AA1015,$AA1015))","v":""}]
[1013,null,null,null,null,null,null,null,null,null,null,null,null,null,null,null,null,null,null,null,null,null,null,null,null,null,null,{"$f":"IF($AA1016=\"\",\"\",60*($AA1016-1)+COUNTIF($AA$9:$AA1016,$AA1016))","v":""}]
[1014,null,null,null,null,null,null,null,null,null,null,null,null,null,null,null,null,null,null,null,null,null,null,null,null,null,null,{"$f":"IF($AA1017=\"\",\"\",60*($AA1017-1)+COUNTIF($AA$9:$AA1017,$AA1017))","v":""}]
[1015,null,null,null,null,null,null,null,null,null,null,null,null,null,null,null,null,null,null,null,null,null,null,null,null,null,null,{"$f":"IF($AA1018=\"\",\"\",60*($AA1018-1)+COUNTIF($AA$9:$AA1018,$AA1018))","v":""}]
[1016,null,null,null,null,null,null,null,null,null,null,null,null,null,null,null,null,null,null,null,null,null,null,null,null,null,null,{"$f":"IF($AA1019=\"\",\"\",60*($AA1019-1)+COUNTIF($AA$9:$AA1019,$AA1019))","v":""}]
[1017,null,null,null,null,null,null,null,null,null,null,null,null,null,null,null,null,null,null,null,null,null,null,null,null,null,null,{"$f":"IF($AA1020=\"\",\"\",60*($AA1020-1)+COUNTIF($AA$9:$AA1020,$AA1020))","v":""}]
[1018,null,null,null,null,null,null,null,null,null,null,null,null,null,null,null,null,null,null,null,null,null,null,null,null,null,null,{"$f":"IF($AA1021=\"\",\"\",60*($AA1021-1)+COUNTIF($AA$9:$AA1021,$AA1021))","v":""}]
[1019,null,null,null,null,null,null,null,null,null,null,null,null,null,null,null,null,null,null,null,null,null,null,null,null,null,null,{"$f":"IF($AA1022=\"\",\"\",60*($AA1022-1)+COUNTIF($AA$9:$AA1022,$AA1022))","v":""}]
[1020,null,null,null,null,null,null,null,null,null,null,null,null,null,null,null,null,null,null,null,null,null,null,null,null,null,null,{"$f":"IF($AA1023=\"\",\"\",60*($AA1023-1)+COUNTIF($AA$9:$AA1023,$AA1023))","v":""}]
[1021,null,null,null,null,null,null,null,null,null,null,null,null,null,null,null,null,null,null,null,null,null,null,null,null,null,null,{"$f":"IF($AA1024=\"\",\"\",60*($AA1024-1)+COUNTIF($AA$9:$AA1024,$AA1024))","v":""}]
[1022,null,null,null,null,null,null,null,null,null,null,null,null,null,null,null,null,null,null,null,null,null,null,null,null,null,null,{"$f":"IF($AA1025=\"\",\"\",60*($AA1025-1)+COUNTIF($AA$9:$AA1025,$AA1025))","v":""}]
[1023,null,null,null,null,null,null,null,null,null,null,null,null,null,null,null,null,null,null,null,null,null,null,null,null,null,null,{"$f":"IF($AA1026=\"\",\"\",60*($AA1026-1)+COUNTIF($AA$9:$AA1026,$AA1026))","v":""}]
[1024,null,null,null,null,null,null,null,null,null,null,null,null,null,null,null,null,null,null,null,null,null,null,null,null,null,null,{"$f":"IF($AA1027=\"\",\"\",60*($AA1027-1)+COUNTIF($AA$9:$AA1027,$AA1027))","v":""}]
[1025,null,null,null,null,null,null,null,null,null,null,null,null,null,null,null,null,null,null,null,null,null,null,null,null,null,null,{"$f":"IF($AA1028=\"\",\"\",60*($AA1028-1)+COUNTIF($AA$9:$AA1028,$AA1028))","v":""}]
[1026,null,null,null,null,null,null,null,null,null,null,null,null,null,null,null,null,null,null,null,null,null,null,null,null,null,null,{"$f":"IF($AA1029=\"\",\"\",60*($AA1029-1)+COUNTIF($AA$9:$AA1029,$AA1029))","v":""}]
[1027,null,null,null,null,null,null,null,null,null,null,null,null,null,null,null,null,null,null,null,null,null,null,null,null,null,null,{"$f":"IF($AA1030=\"\",\"\",60*($AA1030-1)+COUNTIF($AA$9:$AA1030,$AA1030))","v":""}]
[1028,null,null,null,null,null,null,null,null,null,null,null,null,null,null,null,null,null,null,null,null,null,null,null,null,null,null,{"$f":"IF($AA1031=\"\",\"\",60*($AA1031-1)+COUNTIF($AA$9:$AA1031,$AA1031))","v":""}]
[1029,null,null,null,null,null,null,null,null,null,null,null,null,null,null,null,null,null,null,null,null,null,null,null,null,null,null,{"$f":"IF($AA1032=\"\",\"\",60*($AA1032-1)+COUNTIF($AA$9:$AA1032,$AA1032))","v":""}]
[1030,null,null,null,null,null,null,null,null,null,null,null,null,null,null,null,null,null,null,null,null,null,null,null,null,null,null,{"$f":"IF($AA1033=\"\",\"\",60*($AA1033-1)+COUNTIF($AA$9:$AA1033,$AA1033))","v":""}]
[1031,null,null,null,null,null,null,null,null,null,null,null,null,null,null,null,null,null,null,null,null,null,null,null,null,null,null,{"$f":"IF($AA1034=\"\",\"\",60*($AA1034-1)+COUNTIF($AA$9:$AA1034,$AA1034))","v":""}]
[1032,null,null,null,null,null,null,null,null,null,null,null,null,null,null,null,null,null,null,null,null,null,null,null,null,null,null,{"$f":"IF($AA1035=\"\",\"\",60*($AA1035-1)+COUNTIF($AA$9:$AA1035,$AA1035))","v":""}]
[1033,null,null,null,null,null,null,null,null,null,null,null,null,null,null,null,null,null,null,null,null,null,null,null,null,null,null,{"$f":"IF($AA1036=\"\",\"\",60*($AA1036-1)+COUNTIF($AA$9:$AA1036,$AA1036))","v":""}]
[1034,null,null,null,null,null,null,null,null,null,null,null,null,null,null,null,null,null,null,null,null,null,null,null,null,null,null,{"$f":"IF($AA1037=\"\",\"\",60*($AA1037-1)+COUNTIF($AA$9:$AA1037,$AA1037))","v":""}]
[1035,null,null,null,null,null,null,null,null,null,null,null,null,null,null,null,null,null,null,null,null,null,null,null,null,null,null,{"$f":"IF($AA1038=\"\",\"\",60*($AA1038-1)+COUNTIF($AA$9:$AA1038,$AA1038))","v":""}]
[1036,null,null,null,null,null,null,null,null,null,null,null,null,null,null,null,null,null,null,null,null,null,null,null,null,null,null,{"$f":"IF($AA1039=\"\",\"\",60*($AA1039-1)+COUNTIF($AA$9:$AA1039,$AA1039))","v":""}]
[1037,null,null,null,null,null,null,null,null,null,null,null,null,null,null,null,null,null,null,null,null,null,null,null,null,null,null,{"$f":"IF($AA1040=\"\",\"\",60*($AA1040-1)+COUNTIF($AA$9:$AA1040,$AA1040))","v":""}]
[1038,null,null,null,null,null,null,null,null,null,null,null,null,null,null,null,null,null,null,null,null,null,null,null,null,null,null,{"$f":"IF($AA1041=\"\",\"\",60*($AA1041-1)+COUNTIF($AA$9:$AA1041,$AA1041))","v":""}]
[1039,null,null,null,null,null,null,null,null,null,null,null,null,null,null,null,null,null,null,null,null,null,null,null,null,null,null,{"$f":"IF($AA1042=\"\",\"\",60*($AA1042-1)+COUNTIF($AA$9:$AA1042,$AA1042))","v":""}]
[1040,null,null,null,null,null,null,null,null,null,null,null,null,null,null,null,null,null,null,null,null,null,null,null,null,null,null,{"$f":"IF($AA1043=\"\",\"\",60*($AA1043-1)+COUNTIF($AA$9:$AA1043,$AA1043))","v":""}]
[1041,null,null,null,null,null,null,null,null,null,null,null,null,null,null,null,null,null,null,null,null,null,null,null,null,null,null,{"$f":"IF($AA1044=\"\",\"\",60*($AA1044-1)+COUNTIF($AA$9:$AA1044,$AA1044))","v":""}]
[1042,null,null,null,null,null,null,null,null,null,null,null,null,null,null,null,null,null,null,null,null,null,null,null,null,null,null,{"$f":"IF($AA1045=\"\",\"\",60*($AA1045-1)+COUNTIF($AA$9:$AA1045,$AA1045))","v":""}]
[1043,null,null,null,null,null,null,null,null,null,null,null,null,null,null,null,null,null,null,null,null,null,null,null,null,null,null,{"$f":"IF($AA1046=\"\",\"\",60*($AA1046-1)+COUNTIF($AA$9:$AA1046,$AA1046))","v":""}]
[1044,null,null,null,null,null,null,null,null,null,null,null,null,null,null,null,null,null,null,null,null,null,null,null,null,null,null,{"$f":"IF($AA1047=\"\",\"\",60*($AA1047-1)+COUNTIF($AA$9:$AA1047,$AA1047))","v":""}]
[1045,null,null,null,null,null,null,null,null,null,null,null,null,null,null,null,null,null,null,null,null,null,null,null,null,null,null,{"$f":"IF($AA1048=\"\",\"\",60*($AA1048-1)+COUNTIF($AA$9:$AA1048,$AA1048))","v":""}]
[1046,null,null,null,null,null,null,null,null,null,null,null,null,null,null,null,null,null,null,null,null,null,null,null,null,null,null,{"$f":"IF($AA1049=\"\",\"\",60*($AA1049-1)+COUNTIF($AA$9:$AA1049,$AA1049))","v":""}]
[1047,null,null,null,null,null,null,null,null,null,null,null,null,null,null,null,null,null,null,null,null,null,null,null,null,null,null,{"$f":"IF($AA1050=\"\",\"\",60*($AA1050-1)+COUNTIF($AA$9:$AA1050,$AA1050))","v":""}]
[1048,null,null,null,null,null,null,null,null,null,null,null,null,null,null,null,null,null,null,null,null,null,null,null,null,null,null,{"$f":"IF($AA1051=\"\",\"\",60*($AA1051-1)+COUNTIF($AA$9:$AA1051,$AA1051))","v":""}]
[1049,null,null,null,null,null,null,null,null,null,null,null,null,null,null,null,null,null,null,null,null,null,null,null,null,null,null,{"$f":"IF($AA1052=\"\",\"\",60*($AA1052-1)+COUNTIF($AA$9:$AA1052,$AA1052))","v":""}]
[1050,null,null,null,null,null,null,null,null,null,null,null,null,null,null,null,null,null,null,null,null,null,null,null,null,null,null,{"$f":"IF($AA1053=\"\",\"\",60*($AA1053-1)+COUNTIF($AA$9:$AA1053,$AA1053))","v":""}]
[1051,null,null,null,null,null,null,null,null,null,null,null,null,null,null,null,null,null,null,null,null,null,null,null,null,null,null,{"$f":"IF($AA1054=\"\",\"\",60*($AA1054-1)+COUNTIF($AA$9:$AA1054,$AA1054))","v":""}]
[1052,null,null,null,null,null,null,null,null,null,null,null,null,null,null,null,null,null,null,null,null,null,null,null,null,null,null,{"$f":"IF($AA1055=\"\",\"\",60*($AA1055-1)+COUNTIF($AA$9:$AA1055,$AA1055))","v":""}]
[1053,null,null,null,null,null,null,null,null,null,null,null,null,null,null,null,null,null,null,null,null,null,null,null,null,null,null,{"$f":"IF($AA1056=\"\",\"\",60*($AA1056-1)+COUNTIF($AA$9:$AA1056,$AA1056))","v":""}]
[1054,null,null,null,null,null,null,null,null,null,null,null,null,null,null,null,null,null,null,null,null,null,null,null,null,null,null,{"$f":"IF($AA1057=\"\",\"\",60*($AA1057-1)+COUNTIF($AA$9:$AA1057,$AA1057))","v":""}]
[1055,null,null,null,null,null,null,null,null,null,null,null,null,null,null,null,null,null,null,null,null,null,null,null,null,null,null,{"$f":"IF($AA1058=\"\",\"\",60*($AA1058-1)+COUNTIF($AA$9:$AA1058,$AA1058))","v":""}]
[1056,null,null,null,null,null,null,null,null,null,null,null,null,null,null,null,null,null,null,null,null,null,null,null,null,null,null,{"$f":"IF($AA1059=\"\",\"\",60*($AA1059-1)+COUNTIF($AA$9:$AA1059,$AA1059))","v":""}]
[1057,null,null,null,null,null,null,null,null,null,null,null,null,null,null,null,null,null,null,null,null,null,null,null,null,null,null,{"$f":"IF($AA1060=\"\",\"\",60*($AA1060-1)+COUNTIF($AA$9:$AA1060,$AA1060))","v":""}]
[1058,null,null,null,null,null,null,null,null,null,null,null,null,null,null,null,null,null,null,null,null,null,null,null,null,null,null,{"$f":"IF($AA1061=\"\",\"\",60*($AA1061-1)+COUNTIF($AA$9:$AA1061,$AA1061))","v":""}]
[1059,null,null,null,null,null,null,null,null,null,null,null,null,null,null,null,null,null,null,null,null,null,null,null,null,null,null,{"$f":"IF($AA1062=\"\",\"\",60*($AA1062-1)+COUNTIF($AA$9:$AA1062,$AA1062))","v":""}]
[1060,null,null,null,null,null,null,null,null,null,null,null,null,null,null,null,null,null,null,null,null,null,null,null,null,null,null,{"$f":"IF($AA1063=\"\",\"\",60*($AA1063-1)+COUNTIF($AA$9:$AA1063,$AA1063))","v":""}]
[1061,null,null,null,null,null,null,null,null,null,null,null,null,null,null,null,null,null,null,null,null,null,null,null,null,null,null,{"$f":"IF($AA1064=\"\",\"\",60*($AA1064-1)+COUNTIF($AA$9:$AA1064,$AA1064))","v":""}]
[1062,null,null,null,null,null,null,null,null,null,null,null,null,null,null,null,null,null,null,null,null,null,null,null,null,null,null,{"$f":"IF($AA1065=\"\",\"\",60*($AA1065-1)+COUNTIF($AA$9:$AA1065,$AA1065))","v":""}]
[1063,null,null,null,null,null,null,null,null,null,null,null,null,null,null,null,null,null,null,null,null,null,null,null,null,null,null,{"$f":"IF($AA1066=\"\",\"\",60*($AA1066-1)+COUNTIF($AA$9:$AA1066,$AA1066))","v":""}]
[1064,null,null,null,null,null,null,null,null,null,null,null,null,null,null,null,null,null,null,null,null,null,null,null,null,null,null,{"$f":"IF($AA1067=\"\",\"\",60*($AA1067-1)+COUNTIF($AA$9:$AA1067,$AA1067))","v":""}]
[1065,null,null,null,null,null,null,null,null,null,null,null,null,null,null,null,null,null,null,null,null,null,null,null,null,null,null,{"$f":"IF($AA1068=\"\",\"\",60*($AA1068-1)+COUNTIF($AA$9:$AA1068,$AA1068))","v":""}]
[1066,null,null,null,null,null,null,null,null,null,null,null,null,null,null,null,null,null,null,null,null,null,null,null,null,null,null,{"$f":"IF($AA1069=\"\",\"\",60*($AA1069-1)+COUNTIF($AA$9:$AA1069,$AA1069))","v":""}]
[1067,null,null,null,null,null,null,null,null,null,null,null,null,null,null,null,null,null,null,null,null,null,null,null,null,null,null,{"$f":"IF($AA1070=\"\",\"\",60*($AA1070-1)+COUNTIF($AA$9:$AA1070,$AA1070))","v":""}]
[1068,null,null,null,null,null,null,null,null,null,null,null,null,null,null,null,null,null,null,null,null,null,null,null,null,null,null,{"$f":"IF($AA1071=\"\",\"\",60*($AA1071-1)+COUNTIF($AA$9:$AA1071,$AA1071))","v":""}]
[1069,null,null,null,null,null,null,null,null,null,null,null,null,null,null,null,null,null,null,null,null,null,null,null,null,null,null,{"$f":"IF($AA1072=\"\",\"\",60*($AA1072-1)+COUNTIF($AA$9:$AA1072,$AA1072))","v":""}]
[1070,null,null,null,null,null,null,null,null,null,null,null,null,null,null,null,null,null,null,null,null,null,null,null,null,null,null,{"$f":"IF($AA1073=\"\",\"\",60*($AA1073-1)+COUNTIF($AA$9:$AA1073,$AA1073))","v":""}]
[1071,null,null,null,null,null,null,null,null,null,null,null,null,null,null,null,null,null,null,null,null,null,null,null,null,null,null,{"$f":"IF($AA1074=\"\",\"\",60*($AA1074-1)+COUNTIF($AA$9:$AA1074,$AA1074))","v":""}]
[1072,null,null,null,null,null,null,null,null,null,null,null,null,null,null,null,null,null,null,null,null,null,null,null,null,null,null,{"$f":"IF($AA1075=\"\",\"\",60*($AA1075-1)+COUNTIF($AA$9:$AA1075,$AA1075))","v":""}]
[1073,null,null,null,null,null,null,null,null,null,null,null,null,null,null,null,null,null,null,null,null,null,null,null,null,null,null,{"$f":"IF($AA1076=\"\",\"\",60*($AA1076-1)+COUNTIF($AA$9:$AA1076,$AA1076))","v":""}]
[1074,null,null,null,null,null,null,null,null,null,null,null,null,null,null,null,null,null,null,null,null,null,null,null,null,null,null,{"$f":"IF($AA1077=\"\",\"\",60*($AA1077-1)+COUNTIF($AA$9:$AA1077,$AA1077))","v":""}]
[1075,null,null,null,null,null,null,null,null,null,null,null,null,null,null,null,null,null,null,null,null,null,null,null,null,null,null,{"$f":"IF($AA1078=\"\",\"\",60*($AA1078-1)+COUNTIF($AA$9:$AA1078,$AA1078))","v":""}]
[1076,null,null,null,null,null,null,null,null,null,null,null,null,null,null,null,null,null,null,null,null,null,null,null,null,null,null,{"$f":"IF($AA1079=\"\",\"\",60*($AA1079-1)+COUNTIF($AA$9:$AA1079,$AA1079))","v":""}]
[1077,null,null,null,null,null,null,null,null,null,null,null,null,null,null,null,null,null,null,null,null,null,null,null,null,null,null,{"$f":"IF($AA1080=\"\",\"\",60*($AA1080-1)+COUNTIF($AA$9:$AA1080,$AA1080))","v":""}]
[1078,null,null,null,null,null,null,null,null,null,null,null,null,null,null,null,null,null,null,null,null,null,null,null,null,null,null,{"$f":"IF($AA1081=\"\",\"\",60*($AA1081-1)+COUNTIF($AA$9:$AA1081,$AA1081))","v":""}]
[1079,null,null,null,null,null,null,null,null,null,null,null,null,null,null,null,null,null,null,null,null,null,null,null,null,null,null,{"$f":"IF($AA1082=\"\",\"\",60*($AA1082-1)+COUNTIF($AA$9:$AA1082,$AA1082))","v":""}]
[1080,null,null,null,null,null,null,null,null,null,null,null,null,null,null,null,null,null,null,null,null,null,null,null,null,null,null,{"$f":"IF($AA1083=\"\",\"\",60*($AA1083-1)+COUNTIF($AA$9:$AA1083,$AA1083))","v":""}]
[1081,null,null,null,null,null,null,null,null,null,null,null,null,null,null,null,null,null,null,null,null,null,null,null,null,null,null,{"$f":"IF($AA1084=\"\",\"\",60*($AA1084-1)+COUNTIF($AA$9:$AA1084,$AA1084))","v":""}]
[1082,null,null,null,null,null,null,null,null,null,null,null,null,null,null,null,null,null,null,null,null,null,null,null,null,null,null,{"$f":"IF($AA1085=\"\",\"\",60*($AA1085-1)+COUNTIF($AA$9:$AA1085,$AA1085))","v":""}]
[1083,null,null,null,null,null,null,null,null,null,null,null,null,null,null,null,null,null,null,null,null,null,null,null,null,null,null,{"$f":"IF($AA1086=\"\",\"\",60*($AA1086-1)+COUNTIF($AA$9:$AA1086,$AA1086))","v":""}]
[1084,null,null,null,null,null,null,null,null,null,null,null,null,null,null,null,null,null,null,null,null,null,null,null,null,null,null,{"$f":"IF($AA1087=\"\",\"\",60*($AA1087-1)+COUNTIF($AA$9:$AA1087,$AA1087))","v":""}]
[1085,null,null,null,null,null,null,null,null,null,null,null,null,null,null,null,null,null,null,null,null,null,null,null,null,null,null,{"$f":"IF($AA1088=\"\",\"\",60*($AA1088-1)+COUNTIF($AA$9:$AA1088,$AA1088))","v":""}]
[1086,null,null,null,null,null,null,null,null,null,null,null,null,null,null,null,null,null,null,null,null,null,null,null,null,null,null,{"$f":"IF($AA1089=\"\",\"\",60*($AA1089-1)+COUNTIF($AA$9:$AA1089,$AA1089))","v":""}]
[1087,null,null,null,null,null,null,null,null,null,null,null,null,null,null,null,null,null,null,null,null,null,null,null,null,null,null,{"$f":"IF($AA1090=\"\",\"\",60*($AA1090-1)+COUNTIF($AA$9:$AA1090,$AA1090))","v":""}]
[1088,null,null,null,null,null,null,null,null,null,null,null,null,null,null,null,null,null,null,null,null,null,null,null,null,null,null,{"$f":"IF($AA1091=\"\",\"\",60*($AA1091-1)+COUNTIF($AA$9:$AA1091,$AA1091))","v":""}]
[1089,null,null,null,null,null,null,null,null,null,null,null,null,null,null,null,null,null,null,null,null,null,null,null,null,null,null,{"$f":"IF($AA1092=\"\",\"\",60*($AA1092-1)+COUNTIF($AA$9:$AA1092,$AA1092))","v":""}]
[1090,null,null,null,null,null,null,null,null,null,null,null,null,null,null,null,null,null,null,null,null,null,null,null,null,null,null,{"$f":"IF($AA1093=\"\",\"\",60*($AA1093-1)+COUNTIF($AA$9:$AA1093,$AA1093))","v":""}]
[1091,null,null,null,null,null,null,null,null,null,null,null,null,null,null,null,null,null,null,null,null,null,null,null,null,null,null,{"$f":"IF($AA1094=\"\",\"\",60*($AA1094-1)+COUNTIF($AA$9:$AA1094,$AA1094))","v":""}]
[1092,null,null,null,null,null,null,null,null,null,null,null,null,null,null,null,null,null,null,null,null,null,null,null,null,null,null,{"$f":"IF($AA1095=\"\",\"\",60*($AA1095-1)+COUNTIF($AA$9:$AA1095,$AA1095))","v":""}]
[1093,null,null,null,null,null,null,null,null,null,null,null,null,null,null,null,null,null,null,null,null,null,null,null,null,null,null,{"$f":"IF($AA1096=\"\",\"\",60*($AA1096-1)+COUNTIF($AA$9:$AA1096,$AA1096))","v":""}]
[1094,null,null,null,null,null,null,null,null,null,null,null,null,null,null,null,null,null,null,null,null,null,null,null,null,null,null,{"$f":"IF($AA1097=\"\",\"\",60*($AA1097-1)+COUNTIF($AA$9:$AA1097,$AA1097))","v":""}]
[1095,null,null,null,null,null,null,null,null,null,null,null,null,null,null,null,null,null,null,null,null,null,null,null,null,null,null,{"$f":"IF($AA1098=\"\",\"\",60*($AA1098-1)+COUNTIF($AA$9:$AA1098,$AA1098))","v":""}]
[1096,null,null,null,null,null,null,null,null,null,null,null,null,null,null,null,null,null,null,null,null,null,null,null,null,null,null,{"$f":"IF($AA1099=\"\",\"\",60*($AA1099-1)+COUNTIF($AA$9:$AA1099,$AA1099))","v":""}]
[1097,null,null,null,null,null,null,null,null,null,null,null,null,null,null,null,null,null,null,null,null,null,null,null,null,null,null,{"$f":"IF($AA1100=\"\",\"\",60*($AA1100-1)+COUNTIF($AA$9:$AA1100,$AA1100))","v":""}]
[1098,null,null,null,null,null,null,null,null,null,null,null,null,null,null,null,null,null,null,null,null,null,null,null,null,null,null,{"$f":"IF($AA1101=\"\",\"\",60*($AA1101-1)+COUNTIF($AA$9:$AA1101,$AA1101))","v":""}]
[1099,null,null,null,null,null,null,null,null,null,null,null,null,null,null,null,null,null,null,null,null,null,null,null,null,null,null,{"$f":"IF($AA1102=\"\",\"\",60*($AA1102-1)+COUNTIF($AA$9:$AA1102,$AA1102))","v":""}]
[1100,null,null,null,null,null,null,null,null,null,null,null,null,null,null,null,null,null,null,null,null,null,null,null,null,null,null,{"$f":"IF($AA1103=\"\",\"\",60*($AA1103-1)+COUNTIF($AA$9:$AA1103,$AA1103))","v":""}]
[1101,null,null,null,null,null,null,null,null,null,null,null,null,null,null,null,null,null,null,null,null,null,null,null,null,null,null,{"$f":"IF($AA1104=\"\",\"\",60*($AA1104-1)+COUNTIF($AA$9:$AA1104,$AA1104))","v":""}]
[1102,null,null,null,null,null,null,null,null,null,null,null,null,null,null,null,null,null,null,null,null,null,null,null,null,null,null,{"$f":"IF($AA1105=\"\",\"\",60*($AA1105-1)+COUNTIF($AA$9:$AA1105,$AA1105))","v":""}]
[1103,null,null,null,null,null,null,null,null,null,null,null,null,null,null,null,null,null,null,null,null,null,null,null,null,null,null,{"$f":"IF($AA1106=\"\",\"\",60*($AA1106-1)+COUNTIF($AA$9:$AA1106,$AA1106))","v":""}]
[1104,null,null,null,null,null,null,null,null,null,null,null,null,null,null,null,null,null,null,null,null,null,null,null,null,null,null,{"$f":"IF($AA1107=\"\",\"\",60*($AA1107-1)+COUNTIF($AA$9:$AA1107,$AA1107))","v":""}]
[1105,null,null,null,null,null,null,null,null,null,null,null,null,null,null,null,null,null,null,null,null,null,null,null,null,null,null,{"$f":"IF($AA1108=\"\",\"\",60*($AA1108-1)+COUNTIF($AA$9:$AA1108,$AA1108))","v":""}]
[1106,null,null,null,null,null,null,null,null,null,null,null,null,null,null,null,null,null,null,null,null,null,null,null,null,null,null,{"$f":"IF($AA1109=\"\",\"\",60*($AA1109-1)+COUNTIF($AA$9:$AA1109,$AA1109))","v":""}]
[1107,null,null,null,null,null,null,null,null,null,null,null,null,null,null,null,null,null,null,null,null,null,null,null,null,null,null,{"$f":"IF($AA1110=\"\",\"\",60*($AA1110-1)+COUNTIF($AA$9:$AA1110,$AA1110))","v":""}]
[1108,null,null,null,null,null,null,null,null,null,null,null,null,null,null,null,null,null,null,null,null,null,null,null,null,null,null,{"$f":"IF($AA1111=\"\",\"\",60*($AA1111-1)+COUNTIF($AA$9:$AA1111,$AA1111))","v":""}]
[1109,null,null,null,null,null,null,null,null,null,null,null,null,null,null,null,null,null,null,null,null,null,null,null,null,null,null,{"$f":"IF($AA1112=\"\",\"\",60*($AA1112-1)+COUNTIF($AA$9:$AA1112,$AA1112))","v":""}]
[1110,null,null,null,null,null,null,null,null,null,null,null,null,null,null,null,null,null,null,null,null,null,null,null,null,null,null,{"$f":"IF($AA1113=\"\",\"\",60*($AA1113-1)+COUNTIF($AA$9:$AA1113,$AA1113))","v":""}]
[1111,null,null,null,null,null,null,null,null,null,null,null,null,null,null,null,null,null,null,null,null,null,null,null,null,null,null,{"$f":"IF($AA1114=\"\",\"\",60*($AA1114-1)+COUNTIF($AA$9:$AA1114,$AA1114))","v":""}]
[1112,null,null,null,null,null,null,null,null,null,null,null,null,null,null,null,null,null,null,null,null,null,null,null,null,null,null,{"$f":"IF($AA1115=\"\",\"\",60*($AA1115-1)+COUNTIF($AA$9:$AA1115,$AA1115))","v":""}]
[1113,null,null,null,null,null,null,null,null,null,null,null,null,null,null,null,null,null,null,null,null,null,null,null,null,null,null,{"$f":"IF($AA1116=\"\",\"\",60*($AA1116-1)+COUNTIF($AA$9:$AA1116,$AA1116))","v":""}]
[1114,null,null,null,null,null,null,null,null,null,null,null,null,null,null,null,null,null,null,null,null,null,null,null,null,null,null,{"$f":"IF($AA1117=\"\",\"\",60*($AA1117-1)+COUNTIF($AA$9:$AA1117,$AA1117))","v":""}]
[1115,null,null,null,null,null,null,null,null,null,null,null,null,null,null,null,null,null,null,null,null,null,null,null,null,null,null,{"$f":"IF($AA1118=\"\",\"\",60*($AA1118-1)+COUNTIF($AA$9:$AA1118,$AA1118))","v":""}]
[1116,null,null,null,null,null,null,null,null,null,null,null,null,null,null,null,null,null,null,null,null,null,null,null,null,null,null,{"$f":"IF($AA1119=\"\",\"\",60*($AA1119-1)+COUNTIF($AA$9:$AA1119,$AA1119))","v":""}]
[1117,null,null,null,null,null,null,null,null,null,null,null,null,null,null,null,null,null,null,null,null,null,null,null,null,null,null,{"$f":"IF($AA1120=\"\",\"\",60*($AA1120-1)+COUNTIF($AA$9:$AA1120,$AA1120))","v":""}]
[1118,null,null,null,null,null,null,null,null,null,null,null,null,null,null,null,null,null,null,null,null,null,null,null,null,null,null,{"$f":"IF($AA1121=\"\",\"\",60*($AA1121-1)+COUNTIF($AA$9:$AA1121,$AA1121))","v":""}]
[1119,null,null,null,null,null,null,null,null,null,null,null,null,null,null,null,null,null,null,null,null,null,null,null,null,null,null,{"$f":"IF($AA1122=\"\",\"\",60*($AA1122-1)+COUNTIF($AA$9:$AA1122,$AA1122))","v":""}]
[1120,null,null,null,null,null,null,null,null,null,null,null,null,null,null,null,null,null,null,null,null,null,null,null,null,null,null,{"$f":"IF($AA1123=\"\",\"\",60*($AA1123-1)+COUNTIF($AA$9:$AA1123,$AA1123))","v":""}]
[1121,null,null,null,null,null,null,null,null,null,null,null,null,null,null,null,null,null,null,null,null,null,null,null,null,null,null,{"$f":"IF($AA1124=\"\",\"\",60*($AA1124-1)+COUNTIF($AA$9:$AA1124,$AA1124))","v":""}]
[1122,null,null,null,null,null,null,null,null,null,null,null,null,null,null,null,null,null,null,null,null,null,null,null,null,null,null,{"$f":"IF($AA1125=\"\",\"\",60*($AA1125-1)+COUNTIF($AA$9:$AA1125,$AA1125))","v":""}]
[1123,null,null,null,null,null,null,null,null,null,null,null,null,null,null,null,null,null,null,null,null,null,null,null,null,null,null,{"$f":"IF($AA1126=\"\",\"\",60*($AA1126-1)+COUNTIF($AA$9:$AA1126,$AA1126))","v":""}]
[1124,null,null,null,null,null,null,null,null,null,null,null,null,null,null,null,null,null,null,null,null,null,null,null,null,null,null,{"$f":"IF($AA1127=\"\",\"\",60*($AA1127-1)+COUNTIF($AA$9:$AA1127,$AA1127))","v":""}]
[1125,null,null,null,null,null,null,null,null,null,null,null,null,null,null,null,null,null,null,null,null,null,null,null,null,null,null,{"$f":"IF($AA1128=\"\",\"\",60*($AA1128-1)+COUNTIF($AA$9:$AA1128,$AA1128))","v":""}]
[1126,null,null,null,null,null,null,null,null,null,null,null,null,null,null,null,null,null,null,null,null,null,null,null,null,null,null,{"$f":"IF($AA1129=\"\",\"\",60*($AA1129-1)+COUNTIF($AA$9:$AA1129,$AA1129))","v":""}]
[1127,null,null,null,null,null,null,null,null,null,null,null,null,null,null,null,null,null,null,null,null,null,null,null,null,null,null,{"$f":"IF($AA1130=\"\",\"\",60*($AA1130-1)+COUNTIF($AA$9:$AA1130,$AA1130))","v":""}]
[1128,null,null,null,null,null,null,null,null,null,null,null,null,null,null,null,null,null,null,null,null,null,null,null,null,null,null,{"$f":"IF($AA1131=\"\",\"\",60*($AA1131-1)+COUNTIF($AA$9:$AA1131,$AA1131))","v":""}]
[1129,null,null,null,null,null,null,null,null,null,null,null,null,null,null,null,null,null,null,null,null,null,null,null,null,null,null,{"$f":"IF($AA1132=\"\",\"\",60*($AA1132-1)+COUNTIF($AA$9:$AA1132,$AA1132))","v":""}]
[1130,null,null,null,null,null,null,null,null,null,null,null,null,null,null,null,null,null,null,null,null,null,null,null,null,null,null,{"$f":"IF($AA1133=\"\",\"\",60*($AA1133-1)+COUNTIF($AA$9:$AA1133,$AA1133))","v":""}]
[1131,null,null,null,null,null,null,null,null,null,null,null,null,null,null,null,null,null,null,null,null,null,null,null,null,null,null,{"$f":"IF($AA1134=\"\",\"\",60*($AA1134-1)+COUNTIF($AA$9:$AA1134,$AA1134))","v":""}]
[1132,null,null,null,null,null,null,null,null,null,null,null,null,null,null,null,null,null,null,null,null,null,null,null,null,null,null,{"$f":"IF($AA1135=\"\",\"\",60*($AA1135-1)+COUNTIF($AA$9:$AA1135,$AA1135))","v":""}]
[1133,null,null,null,null,null,null,null,null,null,null,null,null,null,null,null,null,null,null,null,null,null,null,null,null,null,null,{"$f":"IF($AA1136=\"\",\"\",60*($AA1136-1)+COUNTIF($AA$9:$AA1136,$AA1136))","v":""}]
[1134,null,null,null,null,null,null,null,null,null,null,null,null,null,null,null,null,null,null,null,null,null,null,null,null,null,null,{"$f":"IF($AA1137=\"\",\"\",60*($AA1137-1)+COUNTIF($AA$9:$AA1137,$AA1137))","v":""}]
[1135,null,null,null,null,null,null,null,null,null,null,null,null,null,null,null,null,null,null,null,null,null,null,null,null,null,null,{"$f":"IF($AA1138=\"\",\"\",60*($AA1138-1)+COUNTIF($AA$9:$AA1138,$AA1138))","v":""}]
[1136,null,null,null,null,null,null,null,null,null,null,null,null,null,null,null,null,null,null,null,null,null,null,null,null,null,null,{"$f":"IF($AA1139=\"\",\"\",60*($AA1139-1)+COUNTIF($AA$9:$AA1139,$AA1139))","v":""}]
[1137,null,null,null,null,null,null,null,null,null,null,null,null,null,null,null,null,null,null,null,null,null,null,null,null,null,null,{"$f":"IF($AA1140=\"\",\"\",60*($AA1140-1)+COUNTIF($AA$9:$AA1140,$AA1140))","v":""}]
[1138,null,null,null,null,null,null,null,null,null,null,null,null,null,null,null,null,null,null,null,null,null,null,null,null,null,null,{"$f":"IF($AA1141=\"\",\"\",60*($AA1141-1)+COUNTIF($AA$9:$AA1141,$AA1141))","v":""}]
[1139,null,null,null,null,null,null,null,null,null,null,null,null,null,null,null,null,null,null,null,null,null,null,null,null,null,null,{"$f":"IF($AA1142=\"\",\"\",60*($AA1142-1)+COUNTIF($AA$9:$AA1142,$AA1142))","v":""}]
[1140,null,null,null,null,null,null,null,null,null,null,null,null,null,null,null,null,null,null,null,null,null,null,null,null,null,null,{"$f":"IF($AA1143=\"\",\"\",60*($AA1143-1)+COUNTIF($AA$9:$AA1143,$AA1143))","v":""}]
[1141,null,null,null,null,null,null,null,null,null,null,null,null,null,null,null,null,null,null,null,null,null,null,null,null,null,null,{"$f":"IF($AA1144=\"\",\"\",60*($AA1144-1)+COUNTIF($AA$9:$AA1144,$AA1144))","v":""}]
[1142,null,null,null,null,null,null,null,null,null,null,null,null,null,null,null,null,null,null,null,null,null,null,null,null,null,null,{"$f":"IF($AA1145=\"\",\"\",60*($AA1145-1)+COUNTIF($AA$9:$AA1145,$AA1145))","v":""}]
[1143,null,null,null,null,null,null,null,null,null,null,null,null,null,null,null,null,null,null,null,null,null,null,null,null,null,null,{"$f":"IF($AA1146=\"\",\"\",60*($AA1146-1)+COUNTIF($AA$9:$AA1146,$AA1146))","v":""}]
[1144,null,null,null,null,null,null,null,null,null,null,null,null,null,null,null,null,null,null,null,null,null,null,null,null,null,null,{"$f":"IF($AA1147=\"\",\"\",60*($AA1147-1)+COUNTIF($AA$9:$AA1147,$AA1147))","v":""}]
[1145,null,null,null,null,null,null,null,null,null,null,null,null,null,null,null,null,null,null,null,null,null,null,null,null,null,null,{"$f":"IF($AA1148=\"\",\"\",60*($AA1148-1)+COUNTIF($AA$9:$AA1148,$AA1148))","v":""}]
[1146,null,null,null,null,null,null,null,null,null,null,null,null,null,null,null,null,null,null,null,null,null,null,null,null,null,null,{"$f":"IF($AA1149=\"\",\"\",60*($AA1149-1)+COUNTIF($AA$9:$AA1149,$AA1149))","v":""}]
[1147,null,null,null,null,null,null,null,null,null,null,null,null,null,null,null,null,null,null,null,null,null,null,null,null,null,null,{"$f":"IF($AA1150=\"\",\"\",60*($AA1150-1)+COUNTIF($AA$9:$AA1150,$AA1150))","v":""}]
[1148,null,null,null,null,null,null,null,null,null,null,null,null,null,null,null,null,null,null,null,null,null,null,null,null,null,null,{"$f":"IF($AA1151=\"\",\"\",60*($AA1151-1)+COUNTIF($AA$9:$AA1151,$AA1151))","v":""}]
[1149,null,null,null,null,null,null,null,null,null,null,null,null,null,null,null,null,null,null,null,null,null,null,null,null,null,null,{"$f":"IF($AA1152=\"\",\"\",60*($AA1152-1)+COUNTIF($AA$9:$AA1152,$AA1152))","v":""}]
[1150,null,null,null,null,null,null,null,null,null,null,null,null,null,null,null,null,null,null,null,null,null,null,null,null,null,null,{"$f":"IF($AA1153=\"\",\"\",60*($AA1153-1)+COUNTIF($AA$9:$AA1153,$AA1153))","v":""}]
[1151,null,null,null,null,null,null,null,null,null,null,null,null,null,null,null,null,null,null,null,null,null,null,null,null,null,null,{"$f":"IF($AA1154=\"\",\"\",60*($AA1154-1)+COUNTIF($AA$9:$AA1154,$AA1154))","v":""}]
[1152,null,null,null,null,null,null,null,null,null,null,null,null,null,null,null,null,null,null,null,null,null,null,null,null,null,null,{"$f":"IF($AA1155=\"\",\"\",60*($AA1155-1)+COUNTIF($AA$9:$AA1155,$AA1155))","v":""}]
[1153,null,null,null,null,null,null,null,null,null,null,null,null,null,null,null,null,null,null,null,null,null,null,null,null,null,null,{"$f":"IF($AA1156=\"\",\"\",60*($AA1156-1)+COUNTIF($AA$9:$AA1156,$AA1156))","v":""}]
[1154,null,null,null,null,null,null,null,null,null,null,null,null,null,null,null,null,null,null,null,null,null,null,null,null,null,null,{"$f":"IF($AA1157=\"\",\"\",60*($AA1157-1)+COUNTIF($AA$9:$AA1157,$AA1157))","v":""}]
[1155,null,null,null,null,null,null,null,null,null,null,null,null,null,null,null,null,null,null,null,null,null,null,null,null,null,null,{"$f":"IF($AA1158=\"\",\"\",60*($AA1158-1)+COUNTIF($AA$9:$AA1158,$AA1158))","v":""}]
[1156,null,null,null,null,null,null,null,null,null,null,null,null,null,null,null,null,null,null,null,null,null,null,null,null,null,null,{"$f":"IF($AA1159=\"\",\"\",60*($AA1159-1)+COUNTIF($AA$9:$AA1159,$AA1159))","v":""}]
[1157,null,null,null,null,null,null,null,null,null,null,null,null,null,null,null,null,null,null,null,null,null,null,null,null,null,null,{"$f":"IF($AA1160=\"\",\"\",60*($AA1160-1)+COUNTIF($AA$9:$AA1160,$AA1160))","v":""}]
[1158,null,null,null,null,null,null,null,null,null,null,null,null,null,null,null,null,null,null,null,null,null,null,null,null,null,null,{"$f":"IF($AA1161=\"\",\"\",60*($AA1161-1)+COUNTIF($AA$9:$AA1161,$AA1161))","v":""}]
[1159,null,null,null,null,null,null,null,null,null,null,null,null,null,null,null,null,null,null,null,null,null,null,null,null,null,null,{"$f":"IF($AA1162=\"\",\"\",60*($AA1162-1)+COUNTIF($AA$9:$AA1162,$AA1162))","v":""}]
[1160,null,null,null,null,null,null,null,null,null,null,null,null,null,null,null,null,null,null,null,null,null,null,null,null,null,null,{"$f":"IF($AA1163=\"\",\"\",60*($AA1163-1)+COUNTIF($AA$9:$AA1163,$AA1163))","v":""}]
[1161,null,null,null,null,null,null,null,null,null,null,null,null,null,null,null,null,null,null,null,null,null,null,null,null,null,null,{"$f":"IF($AA1164=\"\",\"\",60*($AA1164-1)+COUNTIF($AA$9:$AA1164,$AA1164))","v":""}]
[1162,null,null,null,null,null,null,null,null,null,null,null,null,null,null,null,null,null,null,null,null,null,null,null,null,null,null,{"$f":"IF($AA1165=\"\",\"\",60*($AA1165-1)+COUNTIF($AA$9:$AA1165,$AA1165))","v":""}]
[1163,null,null,null,null,null,null,null,null,null,null,null,null,null,null,null,null,null,null,null,null,null,null,null,null,null,null,{"$f":"IF($AA1166=\"\",\"\",60*($AA1166-1)+COUNTIF($AA$9:$AA1166,$AA1166))","v":""}]
[1164,null,null,null,null,null,null,null,null,null,null,null,null,null,null,null,null,null,null,null,null,null,null,null,null,null,null,{"$f":"IF($AA1167=\"\",\"\",60*($AA1167-1)+COUNTIF($AA$9:$AA1167,$AA1167))","v":""}]
[1165,null,null,null,null,null,null,null,null,null,null,null,null,null,null,null,null,null,null,null,null,null,null,null,null,null,null,{"$f":"IF($AA1168=\"\",\"\",60*($AA1168-1)+COUNTIF($AA$9:$AA1168,$AA1168))","v":""}]
[1166,null,null,null,null,null,null,null,null,null,null,null,null,null,null,null,null,null,null,null,null,null,null,null,null,null,null,{"$f":"IF($AA1169=\"\",\"\",60*($AA1169-1)+COUNTIF($AA$9:$AA1169,$AA1169))","v":""}]
[1167,null,null,null,null,null,null,null,null,null,null,null,null,null,null,null,null,null,null,null,null,null,null,null,null,null,null,{"$f":"IF($AA1170=\"\",\"\",60*($AA1170-1)+COUNTIF($AA$9:$AA1170,$AA1170))","v":""}]
[1168,null,null,null,null,null,null,null,null,null,null,null,null,null,null,null,null,null,null,null,null,null,null,null,null,null,null,{"$f":"IF($AA1171=\"\",\"\",60*($AA1171-1)+COUNTIF($AA$9:$AA1171,$AA1171))","v":""}]
[1169,null,null,null,null,null,null,null,null,null,null,null,null,null,null,null,null,null,null,null,null,null,null,null,null,null,null,{"$f":"IF($AA1172=\"\",\"\",60*($AA1172-1)+COUNTIF($AA$9:$AA1172,$AA1172))","v":""}]
[1170,null,null,null,null,null,null,null,null,null,null,null,null,null,null,null,null,null,null,null,null,null,null,null,null,null,null,{"$f":"IF($AA1173=\"\",\"\",60*($AA1173-1)+COUNTIF($AA$9:$AA1173,$AA1173))","v":""}]
[1171,null,null,null,null,null,null,null,null,null,null,null,null,null,null,null,null,null,null,null,null,null,null,null,null,null,null,{"$f":"IF($AA1174=\"\",\"\",60*($AA1174-1)+COUNTIF($AA$9:$AA1174,$AA1174))","v":""}]
[1172,null,null,null,null,null,null,null,null,null,null,null,null,null,null,null,null,null,null,null,null,null,null,null,null,null,null,{"$f":"IF($AA1175=\"\",\"\",60*($AA1175-1)+COUNTIF($AA$9:$AA1175,$AA1175))","v":""}]
[1173,null,null,null,null,null,null,null,null,null,null,null,null,null,null,null,null,null,null,null,null,null,null,null,null,null,null,{"$f":"IF($AA1176=\"\",\"\",60*($AA1176-1)+COUNTIF($AA$9:$AA1176,$AA1176))","v":""}]
[1174,null,null,null,null,null,null,null,null,null,null,null,null,null,null,null,null,null,null,null,null,null,null,null,null,null,null,{"$f":"IF($AA1177=\"\",\"\",60*($AA1177-1)+COUNTIF($AA$9:$AA1177,$AA1177))","v":""}]
[1175,null,null,null,null,null,null,null,null,null,null,null,null,null,null,null,null,null,null,null,null,null,null,null,null,null,null,{"$f":"IF($AA1178=\"\",\"\",60*($AA1178-1)+COUNTIF($AA$9:$AA1178,$AA1178))","v":""}]
[1176,null,null,null,null,null,null,null,null,null,null,null,null,null,null,null,null,null,null,null,null,null,null,null,null,null,null,{"$f":"IF($AA1179=\"\",\"\",60*($AA1179-1)+COUNTIF($AA$9:$AA1179,$AA1179))","v":""}]
[1177,null,null,null,null,null,null,null,null,null,null,null,null,null,null,null,null,null,null,null,null,null,null,null,null,null,null,{"$f":"IF($AA1180=\"\",\"\",60*($AA1180-1)+COUNTIF($AA$9:$AA1180,$AA1180))","v":""}]
[1178,null,null,null,null,null,null,null,null,null,null,null,null,null,null,null,null,null,null,null,null,null,null,null,null,null,null,{"$f":"IF($AA1181=\"\",\"\",60*($AA1181-1)+COUNTIF($AA$9:$AA1181,$AA1181))","v":""}]
[1179,null,null,null,null,null,null,null,null,null,null,null,null,null,null,null,null,null,null,null,null,null,null,null,null,null,null,{"$f":"IF($AA1182=\"\",\"\",60*($AA1182-1)+COUNTIF($AA$9:$AA1182,$AA1182))","v":""}]
[1180,null,null,null,null,null,null,null,null,null,null,null,null,null,null,null,null,null,null,null,null,null,null,null,null,null,null,{"$f":"IF($AA1183=\"\",\"\",60*($AA1183-1)+COUNTIF($AA$9:$AA1183,$AA1183))","v":""}]
[1181,null,null,null,null,null,null,null,null,null,null,null,null,null,null,null,null,null,null,null,null,null,null,null,null,null,null,{"$f":"IF($AA1184=\"\",\"\",60*($AA1184-1)+COUNTIF($AA$9:$AA1184,$AA1184))","v":""}]
[1182,null,null,null,null,null,null,null,null,null,null,null,null,null,null,null,null,null,null,null,null,null,null,null,null,null,null,{"$f":"IF($AA1185=\"\",\"\",60*($AA1185-1)+COUNTIF($AA$9:$AA1185,$AA1185))","v":""}]
[1183,null,null,null,null,null,null,null,null,null,null,null,null,null,null,null,null,null,null,null,null,null,null,null,null,null,null,{"$f":"IF($AA1186=\"\",\"\",60*($AA1186-1)+COUNTIF($AA$9:$AA1186,$AA1186))","v":""}]
[1184,null,null,null,null,null,null,null,null,null,null,null,null,null,null,null,null,null,null,null,null,null,null,null,null,null,null,{"$f":"IF($AA1187=\"\",\"\",60*($AA1187-1)+COUNTIF($AA$9:$AA1187,$AA1187))","v":""}]
[1185,null,null,null,null,null,null,null,null,null,null,null,null,null,null,null,null,null,null,null,null,null,null,null,null,null,null,{"$f":"IF($AA1188=\"\",\"\",60*($AA1188-1)+COUNTIF($AA$9:$AA1188,$AA1188))","v":""}]
[1186,null,null,null,null,null,null,null,null,null,null,null,null,null,null,null,null,null,null,null,null,null,null,null,null,null,null,{"$f":"IF($AA1189=\"\",\"\",60*($AA1189-1)+COUNTIF($AA$9:$AA1189,$AA1189))","v":""}]
[1187,null,null,null,null,null,null,null,null,null,null,null,null,null,null,null,null,null,null,null,null,null,null,null,null,null,null,{"$f":"IF($AA1190=\"\",\"\",60*($AA1190-1)+COUNTIF($AA$9:$AA1190,$AA1190))","v":""}]
[1188,null,null,null,null,null,null,null,null,null,null,null,null,null,null,null,null,null,null,null,null,null,null,null,null,null,null,{"$f":"IF($AA1191=\"\",\"\",60*($AA1191-1)+COUNTIF($AA$9:$AA1191,$AA1191))","v":""}]
[1189,null,null,null,null,null,null,null,null,null,null,null,null,null,null,null,null,null,null,null,null,null,null,null,null,null,null,{"$f":"IF($AA1192=\"\",\"\",60*($AA1192-1)+COUNTIF($AA$9:$AA1192,$AA1192))","v":""}]
[1190,null,null,null,null,null,null,null,null,null,null,null,null,null,null,null,null,null,null,null,null,null,null,null,null,null,null,{"$f":"IF($AA1193=\"\",\"\",60*($AA1193-1)+COUNTIF($AA$9:$AA1193,$AA1193))","v":""}]
[1191,null,null,null,null,null,null,null,null,null,null,null,null,null,null,null,null,null,null,null,null,null,null,null,null,null,null,{"$f":"IF($AA1194=\"\",\"\",60*($AA1194-1)+COUNTIF($AA$9:$AA1194,$AA1194))","v":""}]
[1192,null,null,null,null,null,null,null,null,null,null,null,null,null,null,null,null,null,null,null,null,null,null,null,null,null,null,{"$f":"IF($AA1195=\"\",\"\",60*($AA1195-1)+COUNTIF($AA$9:$AA1195,$AA1195))","v":""}]
[1193,null,null,null,null,null,null,null,null,null,null,null,null,null,null,null,null,null,null,null,null,null,null,null,null,null,null,{"$f":"IF($AA1196=\"\",\"\",60*($AA1196-1)+COUNTIF($AA$9:$AA1196,$AA1196))","v":""}]
[1194,null,null,null,null,null,null,null,null,null,null,null,null,null,null,null,null,null,null,null,null,null,null,null,null,null,null,{"$f":"IF($AA1197=\"\",\"\",60*($AA1197-1)+COUNTIF($AA$9:$AA1197,$AA1197))","v":""}]
[1195,null,null,null,null,null,null,null,null,null,null,null,null,null,null,null,null,null,null,null,null,null,null,null,null,null,null,{"$f":"IF($AA1198=\"\",\"\",60*($AA1198-1)+COUNTIF($AA$9:$AA1198,$AA1198))","v":""}]
[1196,null,null,null,null,null,null,null,null,null,null,null,null,null,null,null,null,null,null,null,null,null,null,null,null,null,null,{"$f":"IF($AA1199=\"\",\"\",60*($AA1199-1)+COUNTIF($AA$9:$AA1199,$AA1199))","v":""}]
[1197,null,null,null,null,null,null,null,null,null,null,null,null,null,null,null,null,null,null,null,null,null,null,null,null,null,null,{"$f":"IF($AA1200=\"\",\"\",60*($AA1200-1)+COUNTIF($AA$9:$AA1200,$AA1200))","v":""}]
[1198,null,null,null,null,null,null,null,null,null,null,null,null,null,null,null,null,null,null,null,null,null,null,null,null,null,null,{"$f":"IF($AA1201=\"\",\"\",60*($AA1201-1)+COUNTIF($AA$9:$AA1201,$AA1201))","v":""}]
[1199,null,null,null,null,null,null,null,null,null,null,null,null,null,null,null,null,null,null,null,null,null,null,null,null,null,null,{"$f":"IF($AA1202=\"\",\"\",60*($AA1202-1)+COUNTIF($AA$9:$AA1202,$AA1202))","v":""}]
[1200,null,null,null,null,null,null,null,null,null,null,null,null,null,null,null,null,null,null,null,null,null,null,null,null,null,null,{"$f":"IF($AA1203=\"\",\"\",60*($AA1203-1)+COUNTIF($AA$9:$AA1203,$AA1203))","v":""}]
[1201,null,null,null,null,null,null,null,null,null,null,null,null,null,null,null,null,null,null,null,null,null,null,null,null,null,null,{"$f":"IF($AA1204=\"\",\"\",60*($AA1204-1)+COUNTIF($AA$9:$AA1204,$AA1204))","v":""}]
[1202,null,null,null,null,null,null,null,null,null,null,null,null,null,null,null,null,null,null,null,null,null,null,null,null,null,null,{"$f":"IF($AA1205=\"\",\"\",60*($AA1205-1)+COUNTIF($AA$9:$AA1205,$AA1205))","v":""}]
[1203,null,null,null,null,null,null,null,null,null,null,null,null,null,null,null,null,null,null,null,null,null,null,null,null,null,null,{"$f":"IF($AA1206=\"\",\"\",60*($AA1206-1)+COUNTIF($AA$9:$AA1206,$AA1206))","v":""}]
[1204,null,null,null,null,null,null,null,null,null,null,null,null,null,null,null,null,null,null,null,null,null,null,null,null,null,null,{"$f":"IF($AA1207=\"\",\"\",60*($AA1207-1)+COUNTIF($AA$9:$AA1207,$AA1207))","v":""}]
[1205,null,null,null,null,null,null,null,null,null,null,null,null,null,null,null,null,null,null,null,null,null,null,null,null,null,null,{"$f":"IF($AA1208=\"\",\"\",60*($AA1208-1)+COUNTIF($AA$9:$AA1208,$AA1208))","v":""}]
[1206,null,null,null,null,null,null,null,null,null,null,null,null,null,null,null,null,null,null,null,null,null,null,null,null,null,null,{"$f":"IF($AA1209=\"\",\"\",60*($AA1209-1)+COUNTIF($AA$9:$AA1209,$AA1209))","v":""}]
[1207,null,null,null,null,null,null,null,null,null,null,null,null,null,null,null,null,null,null,null,null,null,null,null,null,null,null,{"$f":"IF($AA1210=\"\",\"\",60*($AA1210-1)+COUNTIF($AA$9:$AA1210,$AA1210))","v":""}]
[1208,null,null,null,null,null,null,null,null,null,null,null,null,null,null,null,null,null,null,null,null,null,null,null,null,null,null,{"$f":"IF($AA1211=\"\",\"\",60*($AA1211-1)+COUNTIF($AA$9:$AA1211,$AA1211))","v":""}]
[1209,null,null,null,null,null,null,null,null,null,null,null,null,null,null,null,null,null,null,null,null,null,null,null,null,null,null,{"$f":"IF($AA1212=\"\",\"\",60*($AA1212-1)+COUNTIF($AA$9:$AA1212,$AA1212))","v":""}]
[1210,null,null,null,null,null,null,null,null,null,null,null,null,null,null,null,null,null,null,null,null,null,null,null,null,null,null,{"$f":"IF($AA1213=\"\",\"\",60*($AA1213-1)+COUNTIF($AA$9:$AA1213,$AA1213))","v":""}]
[1211,null,null,null,null,null,null,null,null,null,null,null,null,null,null,null,null,null,null,null,null,null,null,null,null,null,null,{"$f":"IF($AA1214=\"\",\"\",60*($AA1214-1)+COUNTIF($AA$9:$AA1214,$AA1214))","v":""}]
[1212,null,null,null,null,null,null,null,null,null,null,null,null,null,null,null,null,null,null,null,null,null,null,null,null,null,null,{"$f":"IF($AA1215=\"\",\"\",60*($AA1215-1)+COUNTIF($AA$9:$AA1215,$AA1215))","v":""}]
[1213,null,null,null,null,null,null,null,null,null,null,null,null,null,null,null,null,null,null,null,null,null,null,null,null,null,null,{"$f":"IF($AA1216=\"\",\"\",60*($AA1216-1)+COUNTIF($AA$9:$AA1216,$AA1216))","v":""}]
[1214,null,null,null,null,null,null,null,null,null,null,null,null,null,null,null,null,null,null,null,null,null,null,null,null,null,null,{"$f":"IF($AA1217=\"\",\"\",60*($AA1217-1)+COUNTIF($AA$9:$AA1217,$AA1217))","v":""}]
[1215,null,null,null,null,null,null,null,null,null,null,null,null,null,null,null,null,null,null,null,null,null,null,null,null,null,null,{"$f":"IF($AA1218=\"\",\"\",60*($AA1218-1)+COUNTIF($AA$9:$AA1218,$AA1218))","v":""}]
[1216,null,null,null,null,null,null,null,null,null,null,null,null,null,null,null,null,null,null,null,null,null,null,null,null,null,null,{"$f":"IF($AA1219=\"\",\"\",60*($AA1219-1)+COUNTIF($AA$9:$AA1219,$AA1219))","v":""}]
[1217,null,null,null,null,null,null,null,null,null,null,null,null,null,null,null,null,null,null,null,null,null,null,null,null,null,null,{"$f":"IF($AA1220=\"\",\"\",60*($AA1220-1)+COUNTIF($AA$9:$AA1220,$AA1220))","v":""}]
[1218,null,null,null,null,null,null,null,null,null,null,null,null,null,null,null,null,null,null,null,null,null,null,null,null,null,null,{"$f":"IF($AA1221=\"\",\"\",60*($AA1221-1)+COUNTIF($AA$9:$AA1221,$AA1221))","v":""}]
[1219,null,null,null,null,null,null,null,null,null,null,null,null,null,null,null,null,null,null,null,null,null,null,null,null,null,null,{"$f":"IF($AA1222=\"\",\"\",60*($AA1222-1)+COUNTIF($AA$9:$AA1222,$AA1222))","v":""}]
[1220,null,null,null,null,null,null,null,null,null,null,null,null,null,null,null,null,null,null,null,null,null,null,null,null,null,null,{"$f":"IF($AA1223=\"\",\"\",60*($AA1223-1)+COUNTIF($AA$9:$AA1223,$AA1223))","v":""}]
[1221,null,null,null,null,null,null,null,null,null,null,null,null,null,null,null,null,null,null,null,null,null,null,null,null,null,null,{"$f":"IF($AA1224=\"\",\"\",60*($AA1224-1)+COUNTIF($AA$9:$AA1224,$AA1224))","v":""}]
[1222,null,null,null,null,null,null,null,null,null,null,null,null,null,null,null,null,null,null,null,null,null,null,null,null,null,null,{"$f":"IF($AA1225=\"\",\"\",60*($AA1225-1)+COUNTIF($AA$9:$AA1225,$AA1225))","v":""}]
[1223,null,null,null,null,null,null,null,null,null,null,null,null,null,null,null,null,null,null,null,null,null,null,null,null,null,null,{"$f":"IF($AA1226=\"\",\"\",60*($AA1226-1)+COUNTIF($AA$9:$AA1226,$AA1226))","v":""}]
[1224,null,null,null,null,null,null,null,null,null,null,null,null,null,null,null,null,null,null,null,null,null,null,null,null,null,null,{"$f":"IF($AA1227=\"\",\"\",60*($AA1227-1)+COUNTIF($AA$9:$AA1227,$AA1227))","v":""}]
[1225,null,null,null,null,null,null,null,null,null,null,null,null,null,null,null,null,null,null,null,null,null,null,null,null,null,null,{"$f":"IF($AA1228=\"\",\"\",60*($AA1228-1)+COUNTIF($AA$9:$AA1228,$AA1228))","v":""}]
[1226,null,null,null,null,null,null,null,null,null,null,null,null,null,null,null,null,null,null,null,null,null,null,null,null,null,null,{"$f":"IF($AA1229=\"\",\"\",60*($AA1229-1)+COUNTIF($AA$9:$AA1229,$AA1229))","v":""}]
[1227,null,null,null,null,null,null,null,null,null,null,null,null,null,null,null,null,null,null,null,null,null,null,null,null,null,null,{"$f":"IF($AA1230=\"\",\"\",60*($AA1230-1)+COUNTIF($AA$9:$AA1230,$AA1230))","v":""}]
[1228,null,null,null,null,null,null,null,null,null,null,null,null,null,null,null,null,null,null,null,null,null,null,null,null,null,null,{"$f":"IF($AA1231=\"\",\"\",60*($AA1231-1)+COUNTIF($AA$9:$AA1231,$AA1231))","v":""}]
[1229,null,null,null,null,null,null,null,null,null,null,null,null,null,null,null,null,null,null,null,null,null,null,null,null,null,null,{"$f":"IF($AA1232=\"\",\"\",60*($AA1232-1)+COUNTIF($AA$9:$AA1232,$AA1232))","v":""}]
[1230,null,null,null,null,null,null,null,null,null,null,null,null,null,null,null,null,null,null,null,null,null,null,null,null,null,null,{"$f":"IF($AA1233=\"\",\"\",60*($AA1233-1)+COUNTIF($AA$9:$AA1233,$AA1233))","v":""}]
[1231,null,null,null,null,null,null,null,null,null,null,null,null,null,null,null,null,null,null,null,null,null,null,null,null,null,null,{"$f":"IF($AA1234=\"\",\"\",60*($AA1234-1)+COUNTIF($AA$9:$AA1234,$AA1234))","v":""}]
[1232,null,null,null,null,null,null,null,null,null,null,null,null,null,null,null,null,null,null,null,null,null,null,null,null,null,null,{"$f":"IF($AA1235=\"\",\"\",60*($AA1235-1)+COUNTIF($AA$9:$AA1235,$AA1235))","v":""}]
[1233,null,null,null,null,null,null,null,null,null,null,null,null,null,null,null,null,null,null,null,null,null,null,null,null,null,null,{"$f":"IF($AA1236=\"\",\"\",60*($AA1236-1)+COUNTIF($AA$9:$AA1236,$AA1236))","v":""}]
[1234,null,null,null,null,null,null,null,null,null,null,null,null,null,null,null,null,null,null,null,null,null,null,null,null,null,null,{"$f":"IF($AA1237=\"\",\"\",60*($AA1237-1)+COUNTIF($AA$9:$AA1237,$AA1237))","v":""}]
[1235,null,null,null,null,null,null,null,null,null,null,null,null,null,null,null,null,null,null,null,null,null,null,null,null,null,null,{"$f":"IF($AA1238=\"\",\"\",60*($AA1238-1)+COUNTIF($AA$9:$AA1238,$AA1238))","v":""}]
[1236,null,null,null,null,null,null,null,null,null,null,null,null,null,null,null,null,null,null,null,null,null,null,null,null,null,null,{"$f":"IF($AA1239=\"\",\"\",60*($AA1239-1)+COUNTIF($AA$9:$AA1239,$AA1239))","v":""}]
[1237,null,null,null,null,null,null,null,null,null,null,null,null,null,null,null,null,null,null,null,null,null,null,null,null,null,null,{"$f":"IF($AA1240=\"\",\"\",60*($AA1240-1)+COUNTIF($AA$9:$AA1240,$AA1240))","v":""}]
[1238,null,null,null,null,null,null,null,null,null,null,null,null,null,null,null,null,null,null,null,null,null,null,null,null,null,null,{"$f":"IF($AA1241=\"\",\"\",60*($AA1241-1)+COUNTIF($AA$9:$AA1241,$AA1241))","v":""}]
[1239,null,null,null,null,null,null,null,null,null,null,null,null,null,null,null,null,null,null,null,null,null,null,null,null,null,null,{"$f":"IF($AA1242=\"\",\"\",60*($AA1242-1)+COUNTIF($AA$9:$AA1242,$AA1242))","v":""}]
[1240,null,null,null,null,null,null,null,null,null,null,null,null,null,null,null,null,null,null,null,null,null,null,null,null,null,null,{"$f":"IF($AA1243=\"\",\"\",60*($AA1243-1)+COUNTIF($AA$9:$AA1243,$AA1243))","v":""}]
[1241,null,null,null,null,null,null,null,null,null,null,null,null,null,null,null,null,null,null,null,null,null,null,null,null,null,null,{"$f":"IF($AA1244=\"\",\"\",60*($AA1244-1)+COUNTIF($AA$9:$AA1244,$AA1244))","v":""}]
[1242,null,null,null,null,null,null,null,null,null,null,null,null,null,null,null,null,null,null,null,null,null,null,null,null,null,null,{"$f":"IF($AA1245=\"\",\"\",60*($AA1245-1)+COUNTIF($AA$9:$AA1245,$AA1245))","v":""}]
[1243,null,null,null,null,null,null,null,null,null,null,null,null,null,null,null,null,null,null,null,null,null,null,null,null,null,null,{"$f":"IF($AA1246=\"\",\"\",60*($AA1246-1)+COUNTIF($AA$9:$AA1246,$AA1246))","v":""}]
[1244,null,null,null,null,null,null,null,null,null,null,null,null,null,null,null,null,null,null,null,null,null,null,null,null,null,null,{"$f":"IF($AA1247=\"\",\"\",60*($AA1247-1)+COUNTIF($AA$9:$AA1247,$AA1247))","v":""}]
[1245,null,null,null,null,null,null,null,null,null,null,null,null,null,null,null,null,null,null,null,null,null,null,null,null,null,null,{"$f":"IF($AA1248=\"\",\"\",60*($AA1248-1)+COUNTIF($AA$9:$AA1248,$AA1248))","v":""}]
[1246,null,null,null,null,null,null,null,null,null,null,null,null,null,null,null,null,null,null,null,null,null,null,null,null,null,null,{"$f":"IF($AA1249=\"\",\"\",60*($AA1249-1)+COUNTIF($AA$9:$AA1249,$AA1249))","v":""}]
[1247,null,null,null,null,null,null,null,null,null,null,null,null,null,null,null,null,null,null,null,null,null,null,null,null,null,null,{"$f":"IF($AA1250=\"\",\"\",60*($AA1250-1)+COUNTIF($AA$9:$AA1250,$AA1250))","v":""}]
[1248,null,null,null,null,null,null,null,null,null,null,null,null,null,null,null,null,null,null,null,null,null,null,null,null,null,null,{"$f":"IF($AA1251=\"\",\"\",60*($AA1251-1)+COUNTIF($AA$9:$AA1251,$AA1251))","v":""}]
[1249,null,null,null,null,null,null,null,null,null,null,null,null,null,null,null,null,null,null,null,null,null,null,null,null,null,null,{"$f":"IF($AA1252=\"\",\"\",60*($AA1252-1)+COUNTIF($AA$9:$AA1252,$AA1252))","v":""}]
[1250,null,null,null,null,null,null,null,null,null,null,null,null,null,null,null,null,null,null,null,null,null,null,null,null,null,null,{"$f":"IF($AA1253=\"\",\"\",60*($AA1253-1)+COUNTIF($AA$9:$AA1253,$AA1253))","v":""}]
[1251,null,null,null,null,null,null,null,null,null,null,null,null,null,null,null,null,null,null,null,null,null,null,null,null,null,null,{"$f":"IF($AA1254=\"\",\"\",60*($AA1254-1)+COUNTIF($AA$9:$AA1254,$AA1254))","v":""}]
[1252,null,null,null,null,null,null,null,null,null,null,null,null,null,null,null,null,null,null,null,null,null,null,null,null,null,null,{"$f":"IF($AA1255=\"\",\"\",60*($AA1255-1)+COUNTIF($AA$9:$AA1255,$AA1255))","v":""}]
[1253,null,null,null,null,null,null,null,null,null,null,null,null,null,null,null,null,null,null,null,null,null,null,null,null,null,null,{"$f":"IF($AA1256=\"\",\"\",60*($AA1256-1)+COUNTIF($AA$9:$AA1256,$AA1256))","v":""}]
[1254,null,null,null,null,null,null,null,null,null,null,null,null,null,null,null,null,null,null,null,null,null,null,null,null,null,null,{"$f":"IF($AA1257=\"\",\"\",60*($AA1257-1)+COUNTIF($AA$9:$AA1257,$AA1257))","v":""}]
[1255,null,null,null,null,null,null,null,null,null,null,null,null,null,null,null,null,null,null,null,null,null,null,null,null,null,null,{"$f":"IF($AA1258=\"\",\"\",60*($AA1258-1)+COUNTIF($AA$9:$AA1258,$AA1258))","v":""}]
[1256,null,null,null,null,null,null,null,null,null,null,null,null,null,null,null,null,null,null,null,null,null,null,null,null,null,null,{"$f":"IF($AA1259=\"\",\"\",60*($AA1259-1)+COUNTIF($AA$9:$AA1259,$AA1259))","v":""}]
[1257,null,null,null,null,null,null,null,null,null,null,null,null,null,null,null,null,null,null,null,null,null,null,null,null,null,null,{"$f":"IF($AA1260=\"\",\"\",60*($AA1260-1)+COUNTIF($AA$9:$AA1260,$AA1260))","v":""}]
[1258,null,null,null,null,null,null,null,null,null,null,null,null,null,null,null,null,null,null,null,null,null,null,null,null,null,null,{"$f":"IF($AA1261=\"\",\"\",60*($AA1261-1)+COUNTIF($AA$9:$AA1261,$AA1261))","v":""}]
[1259,null,null,null,null,null,null,null,null,null,null,null,null,null,null,null,null,null,null,null,null,null,null,null,null,null,null,{"$f":"IF($AA1262=\"\",\"\",60*($AA1262-1)+COUNTIF($AA$9:$AA1262,$AA1262))","v":""}]
[1260,null,null,null,null,null,null,null,null,null,null,null,null,null,null,null,null,null,null,null,null,null,null,null,null,null,null,{"$f":"IF($AA1263=\"\",\"\",60*($AA1263-1)+COUNTIF($AA$9:$AA1263,$AA1263))","v":""}]
[1261,null,null,null,null,null,null,null,null,null,null,null,null,null,null,null,null,null,null,null,null,null,null,null,null,null,null,{"$f":"IF($AA1264=\"\",\"\",60*($AA1264-1)+COUNTIF($AA$9:$AA1264,$AA1264))","v":""}]
[1262,null,null,null,null,null,null,null,null,null,null,null,null,null,null,null,null,null,null,null,null,null,null,null,null,null,null,{"$f":"IF($AA1265=\"\",\"\",60*($AA1265-1)+COUNTIF($AA$9:$AA1265,$AA1265))","v":""}]
[1263,null,null,null,null,null,null,null,null,null,null,null,null,null,null,null,null,null,null,null,null,null,null,null,null,null,null,{"$f":"IF($AA1266=\"\",\"\",60*($AA1266-1)+COUNTIF($AA$9:$AA1266,$AA1266))","v":""}]
[1264,null,null,null,null,null,null,null,null,null,null,null,null,null,null,null,null,null,null,null,null,null,null,null,null,null,null,{"$f":"IF($AA1267=\"\",\"\",60*($AA1267-1)+COUNTIF($AA$9:$AA1267,$AA1267))","v":""}]
[1265,null,null,null,null,null,null,null,null,null,null,null,null,null,null,null,null,null,null,null,null,null,null,null,null,null,null,{"$f":"IF($AA1268=\"\",\"\",60*($AA1268-1)+COUNTIF($AA$9:$AA1268,$AA1268))","v":""}]
[1266,null,null,null,null,null,null,null,null,null,null,null,null,null,null,null,null,null,null,null,null,null,null,null,null,null,null,{"$f":"IF($AA1269=\"\",\"\",60*($AA1269-1)+COUNTIF($AA$9:$AA1269,$AA1269))","v":""}]
[1267,null,null,null,null,null,null,null,null,null,null,null,null,null,null,null,null,null,null,null,null,null,null,null,null,null,null,{"$f":"IF($AA1270=\"\",\"\",60*($AA1270-1)+COUNTIF($AA$9:$AA1270,$AA1270))","v":""}]
[1268,null,null,null,null,null,null,null,null,null,null,null,null,null,null,null,null,null,null,null,null,null,null,null,null,null,null,{"$f":"IF($AA1271=\"\",\"\",60*($AA1271-1)+COUNTIF($AA$9:$AA1271,$AA1271))","v":""}]
[1269,null,null,null,null,null,null,null,null,null,null,null,null,null,null,null,null,null,null,null,null,null,null,null,null,null,null,{"$f":"IF($AA1272=\"\",\"\",60*($AA1272-1)+COUNTIF($AA$9:$AA1272,$AA1272))","v":""}]
[1270,null,null,null,null,null,null,null,null,null,null,null,null,null,null,null,null,null,null,null,null,null,null,null,null,null,null,{"$f":"IF($AA1273=\"\",\"\",60*($AA1273-1)+COUNTIF($AA$9:$AA1273,$AA1273))","v":""}]
[1271,null,null,null,null,null,null,null,null,null,null,null,null,null,null,null,null,null,null,null,null,null,null,null,null,null,null,{"$f":"IF($AA1274=\"\",\"\",60*($AA1274-1)+COUNTIF($AA$9:$AA1274,$AA1274))","v":""}]
[1272,null,null,null,null,null,null,null,null,null,null,null,null,null,null,null,null,null,null,null,null,null,null,null,null,null,null,{"$f":"IF($AA1275=\"\",\"\",60*($AA1275-1)+COUNTIF($AA$9:$AA1275,$AA1275))","v":""}]
[1273,null,null,null,null,null,null,null,null,null,null,null,null,null,null,null,null,null,null,null,null,null,null,null,null,null,null,{"$f":"IF($AA1276=\"\",\"\",60*($AA1276-1)+COUNTIF($AA$9:$AA1276,$AA1276))","v":""}]
[1274,null,null,null,null,null,null,null,null,null,null,null,null,null,null,null,null,null,null,null,null,null,null,null,null,null,null,{"$f":"IF($AA1277=\"\",\"\",60*($AA1277-1)+COUNTIF($AA$9:$AA1277,$AA1277))","v":""}]
[1275,null,null,null,null,null,null,null,null,null,null,null,null,null,null,null,null,null,null,null,null,null,null,null,null,null,null,{"$f":"IF($AA1278=\"\",\"\",60*($AA1278-1)+COUNTIF($AA$9:$AA1278,$AA1278))","v":""}]
[1276,null,null,null,null,null,null,null,null,null,null,null,null,null,null,null,null,null,null,null,null,null,null,null,null,null,null,{"$f":"IF($AA1279=\"\",\"\",60*($AA1279-1)+COUNTIF($AA$9:$AA1279,$AA1279))","v":""}]
[1277,null,null,null,null,null,null,null,null,null,null,null,null,null,null,null,null,null,null,null,null,null,null,null,null,null,null,{"$f":"IF($AA1280=\"\",\"\",60*($AA1280-1)+COUNTIF($AA$9:$AA1280,$AA1280))","v":""}]
[1278,null,null,null,null,null,null,null,null,null,null,null,null,null,null,null,null,null,null,null,null,null,null,null,null,null,null,{"$f":"IF($AA1281=\"\",\"\",60*($AA1281-1)+COUNTIF($AA$9:$AA1281,$AA1281))","v":""}]
[1279,null,null,null,null,null,null,null,null,null,null,null,null,null,null,null,null,null,null,null,null,null,null,null,null,null,null,{"$f":"IF($AA1282=\"\",\"\",60*($AA1282-1)+COUNTIF($AA$9:$AA1282,$AA1282))","v":""}]
[1280,null,null,null,null,null,null,null,null,null,null,null,null,null,null,null,null,null,null,null,null,null,null,null,null,null,null,{"$f":"IF($AA1283=\"\",\"\",60*($AA1283-1)+COUNTIF($AA$9:$AA1283,$AA1283))","v":""}]
[1281,null,null,null,null,null,null,null,null,null,null,null,null,null,null,null,null,null,null,null,null,null,null,null,null,null,null,{"$f":"IF($AA1284=\"\",\"\",60*($AA1284-1)+COUNTIF($AA$9:$AA1284,$AA1284))","v":""}]
[1282,null,null,null,null,null,null,null,null,null,null,null,null,null,null,null,null,null,null,null,null,null,null,null,null,null,null,{"$f":"IF($AA1285=\"\",\"\",60*($AA1285-1)+COUNTIF($AA$9:$AA1285,$AA1285))","v":""}]
[1283,null,null,null,null,null,null,null,null,null,null,null,null,null,null,null,null,null,null,null,null,null,null,null,null,null,null,{"$f":"IF($AA1286=\"\",\"\",60*($AA1286-1)+COUNTIF($AA$9:$AA1286,$AA1286))","v":""}]
[1284,null,null,null,null,null,null,null,null,null,null,null,null,null,null,null,null,null,null,null,null,null,null,null,null,null,null,{"$f":"IF($AA1287=\"\",\"\",60*($AA1287-1)+COUNTIF($AA$9:$AA1287,$AA1287))","v":""}]
[1285,null,null,null,null,null,null,null,null,null,null,null,null,null,null,null,null,null,null,null,null,null,null,null,null,null,null,{"$f":"IF($AA1288=\"\",\"\",60*($AA1288-1)+COUNTIF($AA$9:$AA1288,$AA1288))","v":""}]
[1286,null,null,null,null,null,null,null,null,null,null,null,null,null,null,null,null,null,null,null,null,null,null,null,null,null,null,{"$f":"IF($AA1289=\"\",\"\",60*($AA1289-1)+COUNTIF($AA$9:$AA1289,$AA1289))","v":""}]
[1287,null,null,null,null,null,null,null,null,null,null,null,null,null,null,null,null,null,null,null,null,null,null,null,null,null,null,{"$f":"IF($AA1290=\"\",\"\",60*($AA1290-1)+COUNTIF($AA$9:$AA1290,$AA1290))","v":""}]
[1288,null,null,null,null,null,null,null,null,null,null,null,null,null,null,null,null,null,null,null,null,null,null,null,null,null,null,{"$f":"IF($AA1291=\"\",\"\",60*($AA1291-1)+COUNTIF($AA$9:$AA1291,$AA1291))","v":""}]
[1289,null,null,null,null,null,null,null,null,null,null,null,null,null,null,null,null,null,null,null,null,null,null,null,null,null,null,{"$f":"IF($AA1292=\"\",\"\",60*($AA1292-1)+COUNTIF($AA$9:$AA1292,$AA1292))","v":""}]
[1290,null,null,null,null,null,null,null,null,null,null,null,null,null,null,null,null,null,null,null,null,null,null,null,null,null,null,{"$f":"IF($AA1293=\"\",\"\",60*($AA1293-1)+COUNTIF($AA$9:$AA1293,$AA1293))","v":""}]
[1291,null,null,null,null,null,null,null,null,null,null,null,null,null,null,null,null,null,null,null,null,null,null,null,null,null,null,{"$f":"IF($AA1294=\"\",\"\",60*($AA1294-1)+COUNTIF($AA$9:$AA1294,$AA1294))","v":""}]
[1292,null,null,null,null,null,null,null,null,null,null,null,null,null,null,null,null,null,null,null,null,null,null,null,null,null,null,{"$f":"IF($AA1295=\"\",\"\",60*($AA1295-1)+COUNTIF($AA$9:$AA1295,$AA1295))","v":""}]
[1293,null,null,null,null,null,null,null,null,null,null,null,null,null,null,null,null,null,null,null,null,null,null,null,null,null,null,{"$f":"IF($AA1296=\"\",\"\",60*($AA1296-1)+COUNTIF($AA$9:$AA1296,$AA1296))","v":""}]
[1294,null,null,null,null,null,null,null,null,null,null,null,null,null,null,null,null,null,null,null,null,null,null,null,null,null,null,{"$f":"IF($AA1297=\"\",\"\",60*($AA1297-1)+COUNTIF($AA$9:$AA1297,$AA1297))","v":""}]
[1295,null,null,null,null,null,null,null,null,null,null,null,null,null,null,null,null,null,null,null,null,null,null,null,null,null,null,{"$f":"IF($AA1298=\"\",\"\",60*($AA1298-1)+COUNTIF($AA$9:$AA1298,$AA1298))","v":""}]
[1296,null,null,null,null,null,null,null,null,null,null,null,null,null,null,null,null,null,null,null,null,null,null,null,null,null,null,{"$f":"IF($AA1299=\"\",\"\",60*($AA1299-1)+COUNTIF($AA$9:$AA1299,$AA1299))","v":""}]
[1297,null,null,null,null,null,null,null,null,null,null,null,null,null,null,null,null,null,null,null,null,null,null,null,null,null,null,{"$f":"IF($AA1300=\"\",\"\",60*($AA1300-1)+COUNTIF($AA$9:$AA1300,$AA1300))","v":""}]
[1298,null,null,null,null,null,null,null,null,null,null,null,null,null,null,null,null,null,null,null,null,null,null,null,null,null,null,{"$f":"IF($AA1301=\"\",\"\",60*($AA1301-1)+COUNTIF($AA$9:$AA1301,$AA1301))","v":""}]
[1299,null,null,null,null,null,null,null,null,null,null,null,null,null,null,null,null,null,null,null,null,null,null,null,null,null,null,{"$f":"IF($AA1302=\"\",\"\",60*($AA1302-1)+COUNTIF($AA$9:$AA1302,$AA1302))","v":""}]
[1300,null,null,null,null,null,null,null,null,null,null,null,null,null,null,null,null,null,null,null,null,null,null,null,null,null,null,{"$f":"IF($AA1303=\"\",\"\",60*($AA1303-1)+COUNTIF($AA$9:$AA1303,$AA1303))","v":""}]
[1301,null,null,null,null,null,null,null,null,null,null,null,null,null,null,null,null,null,null,null,null,null,null,null,null,null,null,{"$f":"IF($AA1304=\"\",\"\",60*($AA1304-1)+COUNTIF($AA$9:$AA1304,$AA1304))","v":""}]
[1302,null,null,null,null,null,null,null,null,null,null,null,null,null,null,null,null,null,null,null,null,null,null,null,null,null,null,{"$f":"IF($AA1305=\"\",\"\",60*($AA1305-1)+COUNTIF($AA$9:$AA1305,$AA1305))","v":""}]
[1303,null,null,null,null,null,null,null,null,null,null,null,null,null,null,null,null,null,null,null,null,null,null,null,null,null,null,{"$f":"IF($AA1306=\"\",\"\",60*($AA1306-1)+COUNTIF($AA$9:$AA1306,$AA1306))","v":""}]
[1304,null,null,null,null,null,null,null,null,null,null,null,null,null,null,null,null,null,null,null,null,null,null,null,null,null,null,{"$f":"IF($AA1307=\"\",\"\",60*($AA1307-1)+COUNTIF($AA$9:$AA1307,$AA1307))","v":""}]
[1305,null,null,null,null,null,null,null,null,null,null,null,null,null,null,null,null,null,null,null,null,null,null,null,null,null,null,{"$f":"IF($AA1308=\"\",\"\",60*($AA1308-1)+COUNTIF($AA$9:$AA1308,$AA1308))","v":""}]
[1306,null,null,null,null,null,null,null,null,null,null,null,null,null,null,null,null,null,null,null,null,null,null,null,null,null,null,{"$f":"IF($AA1309=\"\",\"\",60*($AA1309-1)+COUNTIF($AA$9:$AA1309,$AA1309))","v":""}]
[1307,null,null,null,null,null,null,null,null,null,null,null,null,null,null,null,null,null,null,null,null,null,null,null,null,null,null,{"$f":"IF($AA1310=\"\",\"\",60*($AA1310-1)+COUNTIF($AA$9:$AA1310,$AA1310))","v":""}]
[1308,null,null,null,null,null,null,null,null,null,null,null,null,null,null,null,null,null,null,null,null,null,null,null,null,null,null,{"$f":"IF($AA1311=\"\",\"\",60*($AA1311-1)+COUNTIF($AA$9:$AA1311,$AA1311))","v":""}]
[1309,null,null,null,null,null,null,null,null,null,null,null,null,null,null,null,null,null,null,null,null,null,null,null,null,null,null,{"$f":"IF($AA1312=\"\",\"\",60*($AA1312-1)+COUNTIF($AA$9:$AA1312,$AA1312))","v":""}]
[1310,null,null,null,null,null,null,null,null,null,null,null,null,null,null,null,null,null,null,null,null,null,null,null,null,null,null,{"$f":"IF($AA1313=\"\",\"\",60*($AA1313-1)+COUNTIF($AA$9:$AA1313,$AA1313))","v":""}]
[1311,null,null,null,null,null,null,null,null,null,null,null,null,null,null,null,null,null,null,null,null,null,null,null,null,null,null,{"$f":"IF($AA1314=\"\",\"\",60*($AA1314-1)+COUNTIF($AA$9:$AA1314,$AA1314))","v":""}]
[1312,null,null,null,null,null,null,null,null,null,null,null,null,null,null,null,null,null,null,null,null,null,null,null,null,null,null,{"$f":"IF($AA1315=\"\",\"\",60*($AA1315-1)+COUNTIF($AA$9:$AA1315,$AA1315))","v":""}]
[1313,null,null,null,null,null,null,null,null,null,null,null,null,null,null,null,null,null,null,null,null,null,null,null,null,null,null,{"$f":"IF($AA1316=\"\",\"\",60*($AA1316-1)+COUNTIF($AA$9:$AA1316,$AA1316))","v":""}]
[1314,null,null,null,null,null,null,null,null,null,null,null,null,null,null,null,null,null,null,null,null,null,null,null,null,null,null,{"$f":"IF($AA1317=\"\",\"\",60*($AA1317-1)+COUNTIF($AA$9:$AA1317,$AA1317))","v":""}]
[1315,null,null,null,null,null,null,null,null,null,null,null,null,null,null,null,null,null,null,null,null,null,null,null,null,null,null,{"$f":"IF($AA1318=\"\",\"\",60*($AA1318-1)+COUNTIF($AA$9:$AA1318,$AA1318))","v":""}]
[1316,null,null,null,null,null,null,null,null,null,null,null,null,null,null,null,null,null,null,null,null,null,null,null,null,null,null,{"$f":"IF($AA1319=\"\",\"\",60*($AA1319-1)+COUNTIF($AA$9:$AA1319,$AA1319))","v":""}]
[1317,null,null,null,null,null,null,null,null,null,null,null,null,null,null,null,null,null,null,null,null,null,null,null,null,null,null,{"$f":"IF($AA1320=\"\",\"\",60*($AA1320-1)+COUNTIF($AA$9:$AA1320,$AA1320))","v":""}]
[1318,null,null,null,null,null,null,null,null,null,null,null,null,null,null,null,null,null,null,null,null,null,null,null,null,null,null,{"$f":"IF($AA1321=\"\",\"\",60*($AA1321-1)+COUNTIF($AA$9:$AA1321,$AA1321))","v":""}]
[1319,null,null,null,null,null,null,null,null,null,null,null,null,null,null,null,null,null,null,null,null,null,null,null,null,null,null,{"$f":"IF($AA1322=\"\",\"\",60*($AA1322-1)+COUNTIF($AA$9:$AA1322,$AA1322))","v":""}]
[1320,null,null,null,null,null,null,null,null,null,null,null,null,null,null,null,null,null,null,null,null,null,null,null,null,null,null,{"$f":"IF($AA1323=\"\",\"\",60*($AA1323-1)+COUNTIF($AA$9:$AA1323,$AA1323))","v":""}]
[1321,null,null,null,null,null,null,null,null,null,null,null,null,null,null,null,null,null,null,null,null,null,null,null,null,null,null,{"$f":"IF($AA1324=\"\",\"\",60*($AA1324-1)+COUNTIF($AA$9:$AA1324,$AA1324))","v":""}]
[1322,null,null,null,null,null,null,null,null,null,null,null,null,null,null,null,null,null,null,null,null,null,null,null,null,null,null,{"$f":"IF($AA1325=\"\",\"\",60*($AA1325-1)+COUNTIF($AA$9:$AA1325,$AA1325))","v":""}]
[1323,null,null,null,null,null,null,null,null,null,null,null,null,null,null,null,null,null,null,null,null,null,null,null,null,null,null,{"$f":"IF($AA1326=\"\",\"\",60*($AA1326-1)+COUNTIF($AA$9:$AA1326,$AA1326))","v":""}]
[1324,null,null,null,null,null,null,null,null,null,null,null,null,null,null,null,null,null,null,null,null,null,null,null,null,null,null,{"$f":"IF($AA1327=\"\",\"\",60*($AA1327-1)+COUNTIF($AA$9:$AA1327,$AA1327))","v":""}]
[1325,null,null,null,null,null,null,null,null,null,null,null,null,null,null,null,null,null,null,null,null,null,null,null,null,null,null,{"$f":"IF($AA1328=\"\",\"\",60*($AA1328-1)+COUNTIF($AA$9:$AA1328,$AA1328))","v":""}]
[1326,null,null,null,null,null,null,null,null,null,null,null,null,null,null,null,null,null,null,null,null,null,null,null,null,null,null,{"$f":"IF($AA1329=\"\",\"\",60*($AA1329-1)+COUNTIF($AA$9:$AA1329,$AA1329))","v":""}]
[1327,null,null,null,null,null,null,null,null,null,null,null,null,null,null,null,null,null,null,null,null,null,null,null,null,null,null,{"$f":"IF($AA1330=\"\",\"\",60*($AA1330-1)+COUNTIF($AA$9:$AA1330,$AA1330))","v":""}]
[1328,null,null,null,null,null,null,null,null,null,null,null,null,null,null,null,null,null,null,null,null,null,null,null,null,null,null,{"$f":"IF($AA1331=\"\",\"\",60*($AA1331-1)+COUNTIF($AA$9:$AA1331,$AA1331))","v":""}]
[1329,null,null,null,null,null,null,null,null,null,null,null,null,null,null,null,null,null,null,null,null,null,null,null,null,null,null,{"$f":"IF($AA1332=\"\",\"\",60*($AA1332-1)+COUNTIF($AA$9:$AA1332,$AA1332))","v":""}]
[1330,null,null,null,null,null,null,null,null,null,null,null,null,null,null,null,null,null,null,null,null,null,null,null,null,null,null,{"$f":"IF($AA1333=\"\",\"\",60*($AA1333-1)+COUNTIF($AA$9:$AA1333,$AA1333))","v":""}]
[1331,null,null,null,null,null,null,null,null,null,null,null,null,null,null,null,null,null,null,null,null,null,null,null,null,null,null,{"$f":"IF($AA1334=\"\",\"\",60*($AA1334-1)+COUNTIF($AA$9:$AA1334,$AA1334))","v":""}]
[1332,null,null,null,null,null,null,null,null,null,null,null,null,null,null,null,null,null,null,null,null,null,null,null,null,null,null,{"$f":"IF($AA1335=\"\",\"\",60*($AA1335-1)+COUNTIF($AA$9:$AA1335,$AA1335))","v":""}]
[1333,null,null,null,null,null,null,null,null,null,null,null,null,null,null,null,null,null,null,null,null,null,null,null,null,null,null,{"$f":"IF($AA1336=\"\",\"\",60*($AA1336-1)+COUNTIF($AA$9:$AA1336,$AA1336))","v":""}]
[1334,null,null,null,null,null,null,null,null,null,null,null,null,null,null,null,null,null,null,null,null,null,null,null,null,null,null,{"$f":"IF($AA1337=\"\",\"\",60*($AA1337-1)+COUNTIF($AA$9:$AA1337,$AA1337))","v":""}]
[1335,null,null,null,null,null,null,null,null,null,null,null,null,null,null,null,null,null,null,null,null,null,null,null,null,null,null,{"$f":"IF($AA1338=\"\",\"\",60*($AA1338-1)+COUNTIF($AA$9:$AA1338,$AA1338))","v":""}]
[1336,null,null,null,null,null,null,null,null,null,null,null,null,null,null,null,null,null,null,null,null,null,null,null,null,null,null,{"$f":"IF($AA1339=\"\",\"\",60*($AA1339-1)+COUNTIF($AA$9:$AA1339,$AA1339))","v":""}]
[1337,null,null,null,null,null,null,null,null,null,null,null,null,null,null,null,null,null,null,null,null,null,null,null,null,null,null,{"$f":"IF($AA1340=\"\",\"\",60*($AA1340-1)+COUNTIF($AA$9:$AA1340,$AA1340))","v":""}]
[1338,null,null,null,null,null,null,null,null,null,null,null,null,null,null,null,null,null,null,null,null,null,null,null,null,null,null,{"$f":"IF($AA1341=\"\",\"\",60*($AA1341-1)+COUNTIF($AA$9:$AA1341,$AA1341))","v":""}]
[1339,null,null,null,null,null,null,null,null,null,null,null,null,null,null,null,null,null,null,null,null,null,null,null,null,null,null,{"$f":"IF($AA1342=\"\",\"\",60*($AA1342-1)+COUNTIF($AA$9:$AA1342,$AA1342))","v":""}]
[1340,null,null,null,null,null,null,null,null,null,null,null,null,null,null,null,null,null,null,null,null,null,null,null,null,null,null,{"$f":"IF($AA1343=\"\",\"\",60*($AA1343-1)+COUNTIF($AA$9:$AA1343,$AA1343))","v":""}]
[1341,null,null,null,null,null,null,null,null,null,null,null,null,null,null,null,null,null,null,null,null,null,null,null,null,null,null,{"$f":"IF($AA1344=\"\",\"\",60*($AA1344-1)+COUNTIF($AA$9:$AA1344,$AA1344))","v":""}]
[1342,null,null,null,null,null,null,null,null,null,null,null,null,null,null,null,null,null,null,null,null,null,null,null,null,null,null,{"$f":"IF($AA1345=\"\",\"\",60*($AA1345-1)+COUNTIF($AA$9:$AA1345,$AA1345))","v":""}]
[1343,null,null,null,null,null,null,null,null,null,null,null,null,null,null,null,null,null,null,null,null,null,null,null,null,null,null,{"$f":"IF($AA1346=\"\",\"\",60*($AA1346-1)+COUNTIF($AA$9:$AA1346,$AA1346))","v":""}]
[1344,null,null,null,null,null,null,null,null,null,null,null,null,null,null,null,null,null,null,null,null,null,null,null,null,null,null,{"$f":"IF($AA1347=\"\",\"\",60*($AA1347-1)+COUNTIF($AA$9:$AA1347,$AA1347))","v":""}]
[1345,null,null,null,null,null,null,null,null,null,null,null,null,null,null,null,null,null,null,null,null,null,null,null,null,null,null,{"$f":"IF($AA1348=\"\",\"\",60*($AA1348-1)+COUNTIF($AA$9:$AA1348,$AA1348))","v":""}]
[1346,null,null,null,null,null,null,null,null,null,null,null,null,null,null,null,null,null,null,null,null,null,null,null,null,null,null,{"$f":"IF($AA1349=\"\",\"\",60*($AA1349-1)+COUNTIF($AA$9:$AA1349,$AA1349))","v":""}]
[1347,null,null,null,null,null,null,null,null,null,null,null,null,null,null,null,null,null,null,null,null,null,null,null,null,null,null,{"$f":"IF($AA1350=\"\",\"\",60*($AA1350-1)+COUNTIF($AA$9:$AA1350,$AA1350))","v":""}]
[1348,null,null,null,null,null,null,null,null,null,null,null,null,null,null,null,null,null,null,null,null,null,null,null,null,null,null,{"$f":"IF($AA1351=\"\",\"\",60*($AA1351-1)+COUNTIF($AA$9:$AA1351,$AA1351))","v":""}]
[1349,null,null,null,null,null,null,null,null,null,null,null,null,null,null,null,null,null,null,null,null,null,null,null,null,null,null,{"$f":"IF($AA1352=\"\",\"\",60*($AA1352-1)+COUNTIF($AA$9:$AA1352,$AA1352))","v":""}]
[1350,null,null,null,null,null,null,null,null,null,null,null,null,null,null,null,null,null,null,null,null,null,null,null,null,null,null,{"$f":"IF($AA1353=\"\",\"\",60*($AA1353-1)+COUNTIF($AA$9:$AA1353,$AA1353))","v":""}]
[1351,null,null,null,null,null,null,null,null,null,null,null,null,null,null,null,null,null,null,null,null,null,null,null,null,null,null,{"$f":"IF($AA1354=\"\",\"\",60*($AA1354-1)+COUNTIF($AA$9:$AA1354,$AA1354))","v":""}]
[1352,null,null,null,null,null,null,null,null,null,null,null,null,null,null,null,null,null,null,null,null,null,null,null,null,null,null,{"$f":"IF($AA1355=\"\",\"\",60*($AA1355-1)+COUNTIF($AA$9:$AA1355,$AA1355))","v":""}]
[1353,null,null,null,null,null,null,null,null,null,null,null,null,null,null,null,null,null,null,null,null,null,null,null,null,null,null,{"$f":"IF($AA1356=\"\",\"\",60*($AA1356-1)+COUNTIF($AA$9:$AA1356,$AA1356))","v":""}]
[1354,null,null,null,null,null,null,null,null,null,null,null,null,null,null,null,null,null,null,null,null,null,null,null,null,null,null,{"$f":"IF($AA1357=\"\",\"\",60*($AA1357-1)+COUNTIF($AA$9:$AA1357,$AA1357))","v":""}]
[1355,null,null,null,null,null,null,null,null,null,null,null,null,null,null,null,null,null,null,null,null,null,null,null,null,null,null,{"$f":"IF($AA1358=\"\",\"\",60*($AA1358-1)+COUNTIF($AA$9:$AA1358,$AA1358))","v":""}]
[1356,null,null,null,null,null,null,null,null,null,null,null,null,null,null,null,null,null,null,null,null,null,null,null,null,null,null,{"$f":"IF($AA1359=\"\",\"\",60*($AA1359-1)+COUNTIF($AA$9:$AA1359,$AA1359))","v":""}]
[1357,null,null,null,null,null,null,null,null,null,null,null,null,null,null,null,null,null,null,null,null,null,null,null,null,null,null,{"$f":"IF($AA1360=\"\",\"\",60*($AA1360-1)+COUNTIF($AA$9:$AA1360,$AA1360))","v":""}]
[1358,null,null,null,null,null,null,null,null,null,null,null,null,null,null,null,null,null,null,null,null,null,null,null,null,null,null,{"$f":"IF($AA1361=\"\",\"\",60*($AA1361-1)+COUNTIF($AA$9:$AA1361,$AA1361))","v":""}]
[1359,null,null,null,null,null,null,null,null,null,null,null,null,null,null,null,null,null,null,null,null,null,null,null,null,null,null,{"$f":"IF($AA1362=\"\",\"\",60*($AA1362-1)+COUNTIF($AA$9:$AA1362,$AA1362))","v":""}]
[1360,null,null,null,null,null,null,null,null,null,null,null,null,null,null,null,null,null,null,null,null,null,null,null,null,null,null,{"$f":"IF($AA1363=\"\",\"\",60*($AA1363-1)+COUNTIF($AA$9:$AA1363,$AA1363))","v":""}]
[1361,null,null,null,null,null,null,null,null,null,null,null,null,null,null,null,null,null,null,null,null,null,null,null,null,null,null,{"$f":"IF($AA1364=\"\",\"\",60*($AA1364-1)+COUNTIF($AA$9:$AA1364,$AA1364))","v":""}]
[1362,null,null,null,null,null,null,null,null,null,null,null,null,null,null,null,null,null,null,null,null,null,null,null,null,null,null,{"$f":"IF($AA1365=\"\",\"\",60*($AA1365-1)+COUNTIF($AA$9:$AA1365,$AA1365))","v":""}]
[1363,null,null,null,null,null,null,null,null,null,null,null,null,null,null,null,null,null,null,null,null,null,null,null,null,null,null,{"$f":"IF($AA1366=\"\",\"\",60*($AA1366-1)+COUNTIF($AA$9:$AA1366,$AA1366))","v":""}]
[1364,null,null,null,null,null,null,null,null,null,null,null,null,null,null,null,null,null,null,null,null,null,null,null,null,null,null,{"$f":"IF($AA1367=\"\",\"\",60*($AA1367-1)+COUNTIF($AA$9:$AA1367,$AA1367))","v":""}]
[1365,null,null,null,null,null,null,null,null,null,null,null,null,null,null,null,null,null,null,null,null,null,null,null,null,null,null,{"$f":"IF($AA1368=\"\",\"\",60*($AA1368-1)+COUNTIF($AA$9:$AA1368,$AA1368))","v":""}]
[1366,null,null,null,null,null,null,null,null,null,null,null,null,null,null,null,null,null,null,null,null,null,null,null,null,null,null,{"$f":"IF($AA1369=\"\",\"\",60*($AA1369-1)+COUNTIF($AA$9:$AA1369,$AA1369))","v":""}]
[1367,null,null,null,null,null,null,null,null,null,null,null,null,null,null,null,null,null,null,null,null,null,null,null,null,null,null,{"$f":"IF($AA1370=\"\",\"\",60*($AA1370-1)+COUNTIF($AA$9:$AA1370,$AA1370))","v":""}]
[1368,null,null,null,null,null,null,null,null,null,null,null,null,null,null,null,null,null,null,null,null,null,null,null,null,null,null,{"$f":"IF($AA1371=\"\",\"\",60*($AA1371-1)+COUNTIF($AA$9:$AA1371,$AA1371))","v":""}]
[1369,null,null,null,null,null,null,null,null,null,null,null,null,null,null,null,null,null,null,null,null,null,null,null,null,null,null,{"$f":"IF($AA1372=\"\",\"\",60*($AA1372-1)+COUNTIF($AA$9:$AA1372,$AA1372))","v":""}]
[1370,null,null,null,null,null,null,null,null,null,null,null,null,null,null,null,null,null,null,null,null,null,null,null,null,null,null,{"$f":"IF($AA1373=\"\",\"\",60*($AA1373-1)+COUNTIF($AA$9:$AA1373,$AA1373))","v":""}]
[1371,null,null,null,null,null,null,null,null,null,null,null,null,null,null,null,null,null,null,null,null,null,null,null,null,null,null,{"$f":"IF($AA1374=\"\",\"\",60*($AA1374-1)+COUNTIF($AA$9:$AA1374,$AA1374))","v":""}]
[1372,null,null,null,null,null,null,null,null,null,null,null,null,null,null,null,null,null,null,null,null,null,null,null,null,null,null,{"$f":"IF($AA1375=\"\",\"\",60*($AA1375-1)+COUNTIF($AA$9:$AA1375,$AA1375))","v":""}]
[1373,null,null,null,null,null,null,null,null,null,null,null,null,null,null,null,null,null,null,null,null,null,null,null,null,null,null,{"$f":"IF($AA1376=\"\",\"\",60*($AA1376-1)+COUNTIF($AA$9:$AA1376,$AA1376))","v":""}]
[1374,null,null,null,null,null,null,null,null,null,null,null,null,null,null,null,null,null,null,null,null,null,null,null,null,null,null,{"$f":"IF($AA1377=\"\",\"\",60*($AA1377-1)+COUNTIF($AA$9:$AA1377,$AA1377))","v":""}]
[1375,null,null,null,null,null,null,null,null,null,null,null,null,null,null,null,null,null,null,null,null,null,null,null,null,null,null,{"$f":"IF($AA1378=\"\",\"\",60*($AA1378-1)+COUNTIF($AA$9:$AA1378,$AA1378))","v":""}]
[1376,null,null,null,null,null,null,null,null,null,null,null,null,null,null,null,null,null,null,null,null,null,null,null,null,null,null,{"$f":"IF($AA1379=\"\",\"\",60*($AA1379-1)+COUNTIF($AA$9:$AA1379,$AA1379))","v":""}]
[1377]
[1378]
[1379]
[1380]
[1381]
[1382]
[1383]
[1384]
[1385]
[1386]
[1387]
[1388]
[1389]
[1390]
[1391]
[1392]
[1393]
[1394]
[1395]
[1396]
[1397]
[1398]
[1399]
[1400]
[1401]
[1402]
[1403]
[1404]
[1405]
[1406]
[1407]
[1408]
[1409]
[1410]
[1411]
[1412]
[1413]
[1414]
[1415]
[1416]
[1417]
[1418]
[1419]
[1420]
[1421]
[1422]
[1423]
[1424]
[1425]
[1426]
[1427]
[1428]
[1429]
[1430]
[1431]
[1432]
[1433]
[1434]
[1435]
[1436]
[1437]
[1438]
[1439]
[1440]
[1441]
[1442]
[1443]
[1444]
[1445]
[1446]
[1447]
[1448]
[1449]
[1450]
[1451]
[1452]
[1453]
[1454]
[1455]
[1456]
[1457]
[1458]
[1459]
[1460]
[1461]
[1462]
[1463]
[1464]
[1465]
[1466]
[1467]
[1468]
[1469]
[1470]
[1471]
[1472]
[1473]
[1474]
[1475]
[1476]
[1477]
[1478]
[1479]
[1480]
[1481]
[1482]
[1483]
[1484]
[1485]
[1486]
[1487]
[1488]
[1489]
[1490]
[1491]
[1492]
[1493]
[1494]
[1495]
[1496]
[1497]
[1498]
[1499]
[1500]
[1501]
[1502]
[1503]
[1504]
[1505]
[1506]
[1507]
[1508]
[1509]
[1510]
[1511]
[1512]
[1513]
[1514]
[1515]
[1516]
[1517]
[1518]
[1519]
[1520]
[1521]
[1522]
[1523]
[1524]
[1525]
[1526]
[1527]
[1528]
[1529]
[1530]
[1531]
[1532]
[1533]
[1534]
[1535]
[1536]
[1537]
[1538]
[1539]
[1540]
[1541]
[1542]
[1543]
[1544]
[1545]
[1546]
[1547]
[1548]
[1549]
[1550]
[1551]
[1552]
[1553]
[1554]
[1555]
[1556]
[1557]
[1558]
[1559]
[1560]
[1561]
[1562]
[1563]
[1564]
[1565]
[1566]
[1567]
[1568]
[1569]
[1570]
[1571]
[1572]
[1573]
[1574]
[1575]
[1576]
[1577]
[1578]
[1579]
[1580]
[1581]
[1582]
[1583]
[1584]
[1585]
[1586]
[1587]
[1588]
[1589]
[1590]
[1591]
[1592]
[1593]
[1594]
[1595]
[1596]
[1597]
[1598]
[1599]
[1600]
[1601]
[1602]
[1603]
[1604]
[1605]
[1606]
[1607]
[1608]
[1609]
[1610]
[1611]
[1612]
[1613]
[1614]
[1615]
[1616]
[1617]
[1618]
[1619]
[1620]
[1621]
[1622]
[1623]
[1624]
[1625]
[1626]
[1627]
[1628]
[1629]
[1630]
[1631]
[1632]
[1633]
[1634]
[1635]
[1636]
[1637]
[1638]
[1639]
[1640]
[1641]
[1642]
[1643]
[1644]
[1645]
[1646]
[1647]
[1648]
[1649]
[1650]
[1651]
[1652]
[1653]
[1654]
[1655]
[1656]
[1657]
[1658]
[1659]
[1660]
[1661]
[1662]
[1663]
[1664]
[1665]
[1666]
[1667]
[1668]
[1669]
[1670]
[1671]
[1672]
[1673]
[1674]
[1675]
[1676]
[1677]
[1678]
[1679]
[1680]
[1681]
[1682]
[1683]
[1684]
[1685]
[1686]
[1687]
[1688]
[1689]
[1690]
[1691]
[1692]
[1693]
[1694]
[1695]
[1696]
[1697]
[1698]
[1699]
[1700]
[1701]
[1702]
[1703]
[1704]
[1705]
[1706]
[1707]
[1708]
[1709]
[1710]
[1711]
[1712]
[1713]
[1714]
[1715]
[1716]
[1717]
[1718]
[1719]
[1720]
[1721]
[1722]
[1723]
[1724]
[1725]
[1726]
[1727]
[1728]
[1729]
[1730]
[1731]
[1732]
[1733]
[1734]
[1735]
[1736]
[1737]
[1738]
[1739]
[1740]
[1741]
[1742]
[1743]
[1744]
[1745]
[1746]
[1747]
[1748]
[1749]
[1750]
[1751]
[1752]
[1753]
[1754]
[1755]
[1756]
[1757]
[1758]
[1759]
[1760]
[1761]
[1762]
[1763]
[1764]
[1765]
[1766]
[1767]
[1768]
[1769]
[1770]
[1771]
[1772]
[1773]
[1774]
[1775]
[1776]
[1777]
[1778]
[1779]
[1780]
[1781]
[1782]
[1783]
[1784]
[1785]
[1786]
[1787]
[1788]
[1789]
[1790]
[1791]
[1792]
[1793]
[1794]
[1795]
[1796]
[1797]
[1798]
[1799]
[1800]
[1801]
[1802]
[1803]
[1804]
[1805]
[1806]
[1807]
[1808]
[1809]
[1810]
[1811]
[1812]
[1813]
[1814]
[1815]
[1816]
[1817]
[1818]
[1819]