{"text_format":"1","workbook":"xlsx","n_sheets":7,"sheets":["المقسطون","حركة تسديد عميل"," تسديد عميل","الاقساط والاشهر","نموذج","data"," الفرق بين التاريخين "],"not_rendered":{"charts":0,"images":0,"macros":1,"external_links":3,"defined_names":296,"comments":0,"pivot_tables":0},"unopened":[],"bounds":{"document_bytes":16777216,"sheet_cells":100000,"rows_first":2000,"rows_last":500,"rows_between":2000,"halvings":0,"cell_chars":16384,"cell_head_chars":4096},"cells_cut":0,"cells_raw":0,"read":"whole","date_system":"1900"}

{"sheet":"المقسطون","index":0,"n_rows":63,"n_cols":14,"rows_kept":63,"cut":false,"hidden":false,"merged":[[23,1,23,3],[3,3,3,7],[1,5,1,7],[23,12,23,13],[4,11,5,13],[4,8,5,9],[14,9,14,10],[5,5,5,6],[7,5,7,6],[4,0,5,2],[13,9,13,10],[16,12,16,13],[17,12,17,13],[11,8,12,9],[15,8,15,11]]}
[]
[null,null,"ملف العميــل",2600,"الاســم ",{"$f":"VLOOKUP(D2,B27:K62,2,0)","v":1},null,null,null,"تاريخ اليوم :",{"$f":"TODAY()","v":"2023-11-19"}]
[]
[null,null,"تقيـيم العميل",{"$f":"'حركة تسديد عميل'!E8","v":"عميل مميز"}]
["نظـام الخصــم ",null,null,null,null,null,null,null,"حساب نســبة التقسـيط ",null,null,"نظام تحويل التاريخ من هجري لميلادي "]
[null,null,null,null,"إسم البضاعة :"]
[null,null,"السعر النقدي",{"$f":"VLOOKUP(D2,B27:K62,4,0)","v":50000},null,null,null,null,"السعر","الاشهر",null,"بداية التسديد ","نهاية التسديد"]
[null,null,"قيمة العقد بالتقسيط",{"$f":"VLOOKUP(D2,B27:K62,5,0)","v":70000},"موديلها :",null,null,null,50000,{"$f":"VLOOKUP(D2,B27:K62,3,1)","v":35},null,{"$f":"D12","v":"2021-03-27"},{"$f":"D13","v":"2023-12-26"}]
[null,null,"المقدم",0,null,null,null,null,"الزيادة  ",{"$f":"SUM(I8*(J8%+5%))","v":20000},null,{"$f":"TEXT(L8,\"[$-,197000]B2yyyy/mm/dd;@\")","v":"2021/03/27"},{"$f":"TEXT(M8,\"[$-,197000]B2yyyy/mm/dd;@\")+1","v":"2023-12-27"}]
[null,null,"القسط الشهري",{"$f":"VLOOKUP(D2,B27:K62,6,0)","v":2000},null,"الأقساط التأخرة ",{"$f":"'حركة تسديد عميل'!E6","v":0},null,"بعد الزيادة",{"$f":"SUM(I8+J9)","v":70000},null,{"$f":"TEXT(L8+1,\"[$-,197]B2yyyy/mm/dd;@\")","v":"1442/08/15"},{"$f":"TEXT(M8+1,\"[$-,197]B2yyyy/mm/dd;@\")","v":"1445/06/14"}]
[null,null,"ماتم سداده من المبلغ",{"$f":"IF($D$12>$K$2,0,IF($D$13<$K$2,$D$8,(SUM(DATEDIF($D$12,$K$2,\"Y\")*12)+(DATEDIF($D$12,$K$2,\"ym\"))+(IF(DATEDIF($D$12,$K$2,\"md\")<>0,1,0)))*D10))","v":64000},null,"المبــالغ المتأخرة ",{"$f":"'حركة تسديد عميل'!E7","v":0},null,"القسط الشهري",{"$f":"SUM(J10/J8)","v":2000}]
[null,null,"بداية التسديد",{"$f":"VLOOKUP(D2,B27:K62,7,0)","v":"2021-03-27"},null,null,null,null,"التاريخ الميلادي والتاريخ الهجري"]
[null,null,"نهاية التسديد",{"$f":"VLOOKUP(D2,B27:K62,8,0)","v":"2023-12-26"},null,"المدة",{"$f":"(D8-D9)/D10","v":35}]
[null,null,"الأشهر المسددة",{"$f":"(D11/D10)","v":32},null,"الربح كامل",{"$f":"D8-D7","v":20000},null,"ملف العميــل","الاســم",null,"مدة العقـد","من ","الى"]
[null,null,"الأشهر المتبقية",{"$f":"D17/D10","v":3},null,"الربح الشهري",{"$f":"G14/G13","v":571.42857142857144},null,{"$f":"D2","v":2600},{"$f":"F2","v":1},null,{"$f":"G13","v":35},{"$f":"D12","v":"2021-03-27"},{"$f":"D13","v":"2023-12-26"}]
[null,null,null,null,null,"النسبة ",{"$f":"(G14/(D7-D9))*100","v":40},null,"حالة الاشهر وقيمة العقد",null,null,null,{"$f":"TEXT(M15,\"[$-,197000]B2yyyy/mm/dd;@\")","v":"2021/03/27"},{"$f":"EDATE(M16,L15)","v":"2024-02-27"}]
[null,null,"الباقي من المبلغ",{"$f":"D8-D11","v":6000},null,"النسبة السنوية",{"$f":"(G16/G13)*12","v":13.714285714285714},null,"الأشهر المسددة",{"$f":"'حركة تسديد عميل'!H7","v":0},"المبــالغ المســدة",{"$f":"(J17*D10)","v":0},"نسبة السداد بـ  %"]
[null,null,"الخصم",{"$f":"((D17*G17%)*(D15/12))/(1+((G17%)*(D15/12)))","v":198.89502762430939},null,"النسبة الشهرية",{"$f":"G16/G13","v":1.1428571428571428},null,"الأشهر المتبقية",{"$f":"L15-J17","v":35},"المبــالغ المتبـقية",{"$f":"'حركة تسديد عميل'!H10","v":42700},{"$f":"L17/D8","v":0}]
[null,null,"المطلوب",{"$f":"D17-D18","v":5801.1049723756905},null,null,null,null,"حـالة العقــد",{"$f":"VLOOKUP(D2,B27:N62,11,0)","v":"العقـد سارى"},"مبلغ السداد المبكر",{"$f":"IF(J19=\"سداد مبكر\",INDEX(N27:N62,MATCH(J19,L27:L62,0)),\"\")","v":""},"تاريخ السداد المبكر",{"$f":"IF(J19=\"سداد مبكر\",INDEX(M27:M62,MATCH(J19,L27:L62,0)),\"\")","v":""}]
[null,null,null,null,null,null,null,null,null,null,null,null,{"$f":"VLOOKUP(D5,B28:L63,11,0)","v":{"$error":"#N/A"}},{"$error":"#N/A"}]
[null,null,null,null,null,null,null,null,null,null,null,null,{"$error":"#N/A"},{"$error":"#N/A"}]
[null,null,null,null,null,null,null,null,null,null,null,null,{"$error":"#N/A"},{"$f":"VLOOKUP(E7,C30:M65,11,0)","v":{"$error":"#N/A"}}]
[null,null,null,null,null,null,null,null,null,null,null,null,{"$error":"#N/A"},{"$f":"VLOOKUP(E8,C31:M66,11,0)","v":{"$error":"#N/A"}}]
[null,"ملاحظة : اذا تم السداد قبل الموعد المحدد يتم إضافة 1000 ( الف ريال )"]
[]
[null,"رقم الملف","الاسم","مدة القرض ( بالشهر ) ","السعر النقدي","القيمة بعد التقسيط","القسط ","من","الى","الربــح ","الدخل الشهري","حـالة العقـد","سداد مبكر بتاريخ","المبلغ المسدد"]
[null,100,1,40,45000,46400,1160,"2008-10-25",{"$f":"MID(TEXT(H27,\"b2dd.mm.yyyy\"),1,2)-MID(TEXT(H27+ROUND((D27-1)*354.367056/12,0),\"b2dd.mm.yyyy\"),1,2)+H27+ROUND((D27-1)*354.367056/12,0)","v":"2011-12-20"},{"$f":"SUM(E27*(D27%+5%))","v":20250},0,{"$f":"IFERROR(IF(AND(M27<>\"\",M27<I27),\"سداد مبكر\",IF(TODAY()=I27,\"العقد انتهى اليوم\",IF(TODAY()>I27,\"العقـد منتهى\",IF(TODAY()<H27,\"لم يتم تداولة\",\"العقـد سارى\")))),\"\")","v":"العقـد منتهى"}]
[null,200,1,40,45000,43500,1087,"2009-01-21","2012-03-18",20250,0,{"$f":"IFERROR(IF(AND(M28<>\"\",M28<I28),\"سداد مبكر\",IF(TODAY()=I28,\"العقد انتهى اليوم\",IF(TODAY()>I28,\"العقـد منتهى\",IF(TODAY()<H28,\"لم يتم تداولة\",\"العقـد سارى\")))),\"\")","v":"العقـد منتهى"}]
[null,300,1,40,45000,46400,1160,"2010-03-10","2013-05-05",20250,0,"العقـد منتهى"]
[null,400,1,40,45000,39160,979,"2010-06-07","2013-08-01",20250,0,"العقـد منتهى"]
{"$rows_left_out":34}
{"sheet":"حركة تسديد عميل","index":1,"n_rows":78,"n_cols":9,"rows_kept":78,"cut":false,"hidden":false,"merged":[[1,3,1,5],[13,3,16,5]]}
[]
["ملف العميــل",2900,"الاســم",{"$f":"VLOOKUP(B2,المقسطون!B26:I61,2,0)","v":1},null,null,null,"تاريخ اليوم :",{"$f":"TODAY()","v":"2023-11-19"}]
[]
[]
[null,"مدة العقد (بالاشهر)",{"$f":"VLOOKUP(B2,المقسطون!$B$26:$H$61,3,0)","v":17},null,null,"حـالة العقــد",{"$f":"VLOOKUP(B2,المقسطون!B27:N62,11,0)","v":"لم يتم تداولة"}]
[null,null,null,"الأقساط التأخرة ",{"$f":"COUNT(I19:I58)","v":0}]
[null," بداية العقد",{"$f":"VLOOKUP(B2,المقسطون!$B$26:$H$61,7,0)","v":"2023-11-27"},"المبــالغ المتأخرة ",{"$f":"IFERROR(SUM(I19:I58),\"\")","v":0},null,"الأشهر المسددة",{"$f":"IF(COUNT(H19:H58)>C9,C9,COUNT(H19:H58))-E6","v":0}]
[null,null,{"$f":"TEXT(C7,\"[$-,197000]B2yyyy/mm/dd;@\")","v":"2023/11/27"},"تقيــم العــــميل",{"$f":"IF(E6=0,\"عميل مميز\",IF(E6=1,\"عميل جيد جداً\",IF(E6=2,\"عميل جيد\",IF(E6>=3,\"بلاك لست Blacklist\"))))","v":"عميل مميز"},null,"الأشهر المتبقية",{"$f":"C5-H7","v":17}]
[null," نهاية العقد",{"$f":"TEXT(C7+((C5-1)*29.5),\"B2yyyy/mm/\")&TEXT(C7,\"B2dd\")","v":"1446/09/15"},null,null,null,"المبــالغ المســدة",{"$f":"SUM(H7*C11)","v":0}]
[null,null,{"$f":"ConvertDate(C9)+1","v":"2025-03-15"},null,null,null,"المبــالغ المتبـقية",{"$f":"SUM(H8*C11)","v":42700}]
[null,"القســـــــط ",{"$f":"VLOOKUP(B2,المقسطون!$B$26:$H$61,6,0)","v":2511.7647058823532},null,null,null,"نسبة السداد بـ  %",{"$f":"H9/C14","v":0}]
[null,"السعر النقدي ",{"$f":"VLOOKUP(B2,المقسطون!$B$26:$H$61,4,0)","v":35000}]
[null,"الربـــــــــح ",{"$f":"VLOOKUP(B2,المقسطون!B27:N62,9,0)","v":7700.0000000000009},null,null,null,"الســداد المبكـر"]
[null,"قيمة العقد",{"$f":"VLOOKUP(B2,المقسطون!$B$26:$H$61,5,0)","v":42700},"حركة تسديد عميل",null,null,"تاريخ السداد المبكر",{"$f":"IF(G5=\"سداد مبكر\",INDEX(المقسطون!M27:M62,MATCH(G5,المقسطون!L27:L62,0)),\"\")","v":""}]
[]
[null,null,null,null,null,null,"قيمة السداد المبكر",{"$f":"IF(G5=\"سداد مبكر\",INDEX(المقسطون!N28:N63,MATCH(G5,المقسطون!L28:L63,0)),\"\")","v":""}]
[]
[null,null,"الشهــر"," التحصيل بالتاريخ ( هـ )"," التحصيل بالتاريخ ( م )","رصيد القرض","القسط","التسديدات","الأقساط المتأخرة"]
[null,null,{"$f":"IF(D19=\"\",\"\",ROW()-18)","v":1},{"$f":"IF(h2g(TEXT($C$7+((ROW()-19)*29.5),\"B2yyyy/mm/\")&TEXT($C$7,\"B2dd\"))>$H$14,\"\",IF(h2g(TEXT($C$7+((ROW()-19)*29.5),\"B2yyyy/mm/\")&TEXT($C$7,\"B2dd\"))>h2g($C$9),\"\",TEXT($C$7+((ROW()-19)*29.5),\"B2yyyy/mm/\")&TEXT($C$7,\"B2dd\")))","v":"1445/05/15"},{"$f":"IF(D19<>\"\",ConvertDate(D19),\"\")","v":"2023/11/27"},{"$f":"C14","v":42700},{"$f":"IF($D$19=\"\",\"\",IF($C$14=\"\",\"\",$C$14/$C$5))","v":2511.7647058823532},{"$f":"IF(I19<>\"\",G19-I19,IF(C19=\"\",\"\",IF(TODAY()>=h2g(D19),G19,\"\")))","v":""},{"$f":"IFERROR(IF(VLOOKUP($B$2,' الفرق بين التاريخين '!#REF!,ROW()-16,0)=0,\"\",VLOOKUP($B$2,' الفرق بين التاريخين '!#REF!,ROW()-16,0)),\"\")","v":""}]
[null,null,{"$f":"IF(D20=\"\",\"\",ROW()-18)","v":2},{"$f":"IF(h2g(TEXT($C$7+((ROW()-19)*29.5),\"B2yyyy/mm/\")&TEXT($C$7,\"B2dd\"))>$H$14,\"\",IF(h2g(TEXT($C$7+((ROW()-19)*29.5),\"B2yyyy/mm/\")&TEXT($C$7,\"B2dd\"))>h2g($C$9),\"\",TEXT($C$7+((ROW()-19)*29.5),\"B2yyyy/mm/\")&TEXT($C$7,\"B2dd\")))","v":"1445/06/15"},{"$f":"IF(D20<>\"\",ConvertDate(D20),\"\")","v":"2023/12/27"},{"$f":"IF(D20=\"\",\"\",F19-G20)","v":40188.23529411765},{"$f":"IF($D$19=\"\",\"\",IF($C$14=\"\",\"\",$C$14/$C$5))","v":2511.7647058823532},{"$f":"IF(I20<>\"\",G20-I20,IF(C20=\"\",\"\",IF(TODAY()>=h2g(D20),G20,\"\")))","v":""},{"$f":"IFERROR(IF(VLOOKUP($B$2,' الفرق بين التاريخين '!#REF!,ROW()-16,0)=0,\"\",VLOOKUP($B$2,' الفرق بين التاريخين '!#REF!,ROW()-16,0)),\"\")","v":""}]
[null,null,3,{"$f":"IF(h2g(TEXT($C$7+((ROW()-19)*29.5),\"B2yyyy/mm/\")&TEXT($C$7,\"B2dd\"))>$H$14,\"\",IF(h2g(TEXT($C$7+((ROW()-19)*29.5),\"B2yyyy/mm/\")&TEXT($C$7,\"B2dd\"))>h2g($C$9),\"\",TEXT($C$7+((ROW()-19)*29.5),\"B2yyyy/mm/\")&TEXT($C$7,\"B2dd\")))","v":"1445/07/15"},"2024/01/25",{"$f":"IF(D21=\"\",\"\",F20-G21)","v":37676.470588235301},2511.7647058823532,{"$f":"IF(I21<>\"\",G21-I21,IF(C21=\"\",\"\",IF(TODAY()>=h2g(D21),G21,\"\")))","v":""},{"$f":"IFERROR(IF(VLOOKUP($B$2,' الفرق بين التاريخين '!#REF!,ROW()-16,0)=0,\"\",VLOOKUP($B$2,' الفرق بين التاريخين '!#REF!,ROW()-16,0)),\"\")","v":""}]
[null,null,4,{"$f":"IF(h2g(TEXT($C$7+((ROW()-19)*29.5),\"B2yyyy/mm/\")&TEXT($C$7,\"B2dd\"))>$H$14,\"\",IF(h2g(TEXT($C$7+((ROW()-19)*29.5),\"B2yyyy/mm/\")&TEXT($C$7,\"B2dd\"))>h2g($C$9),\"\",TEXT($C$7+((ROW()-19)*29.5),\"B2yyyy/mm/\")&TEXT($C$7,\"B2dd\")))","v":"1445/08/15"},"2024/02/24",35164.705882352951,2511.7647058823532,{"$f":"IF(I22<>\"\",G22-I22,IF(C22=\"\",\"\",IF(TODAY()>=h2g(D22),G22,\"\")))","v":""},{"$f":"IFERROR(IF(VLOOKUP($B$2,' الفرق بين التاريخين '!#REF!,ROW()-16,0)=0,\"\",VLOOKUP($B$2,' الفرق بين التاريخين '!#REF!,ROW()-16,0)),\"\")","v":""}]
[null,null,5,{"$f":"IF(h2g(TEXT($C$7+((ROW()-19)*29.5),\"B2yyyy/mm/\")&TEXT($C$7,\"B2dd\"))>$H$14,\"\",IF(h2g(TEXT($C$7+((ROW()-19)*29.5),\"B2yyyy/mm/\")&TEXT($C$7,\"B2dd\"))>h2g($C$9),\"\",TEXT($C$7+((ROW()-19)*29.5),\"B2yyyy/mm/\")&TEXT($C$7,\"B2dd\")))","v":"1445/09/15"},"2024/03/24",32652.941176470598,2511.7647058823532,{"$f":"IF(I23<>\"\",G23-I23,IF(C23=\"\",\"\",IF(TODAY()>=h2g(D23),G23,\"\")))","v":""},{"$f":"IFERROR(IF(VLOOKUP($B$2,' الفرق بين التاريخين '!#REF!,ROW()-16,0)=0,\"\",VLOOKUP($B$2,' الفرق بين التاريخين '!#REF!,ROW()-16,0)),\"\")","v":""}]
[null,null,6,{"$f":"IF(h2g(TEXT($C$7+((ROW()-19)*29.5),\"B2yyyy/mm/\")&TEXT($C$7,\"B2dd\"))>$H$14,\"\",IF(h2g(TEXT($C$7+((ROW()-19)*29.5),\"B2yyyy/mm/\")&TEXT($C$7,\"B2dd\"))>h2g($C$9),\"\",TEXT($C$7+((ROW()-19)*29.5),\"B2yyyy/mm/\")&TEXT($C$7,\"B2dd\")))","v":"1445/10/15"},"2024/04/23",30141.176470588245,2511.7647058823532,{"$f":"IF(I24<>\"\",G24-I24,IF(C24=\"\",\"\",IF(TODAY()>=h2g(D24),G24,\"\")))","v":""},{"$f":"IFERROR(IF(VLOOKUP($B$2,' الفرق بين التاريخين '!#REF!,ROW()-16,0)=0,\"\",VLOOKUP($B$2,' الفرق بين التاريخين '!#REF!,ROW()-16,0)),\"\")","v":""}]
[null,null,7,{"$f":"IF(h2g(TEXT($C$7+((ROW()-19)*29.5),\"B2yyyy/mm/\")&TEXT($C$7,\"B2dd\"))>$H$14,\"\",IF(h2g(TEXT($C$7+((ROW()-19)*29.5),\"B2yyyy/mm/\")&TEXT($C$7,\"B2dd\"))>h2g($C$9),\"\",TEXT($C$7+((ROW()-19)*29.5),\"B2yyyy/mm/\")&TEXT($C$7,\"B2dd\")))","v":"1445/11/15"},"2024/05/22",27629.411764705892,2511.7647058823532,{"$f":"IF(I25<>\"\",G25-I25,IF(C25=\"\",\"\",IF(TODAY()>=h2g(D25),G25,\"\")))","v":""},{"$f":"IFERROR(IF(VLOOKUP($B$2,' الفرق بين التاريخين '!#REF!,ROW()-16,0)=0,\"\",VLOOKUP($B$2,' الفرق بين التاريخين '!#REF!,ROW()-16,0)),\"\")","v":""}]
[null,null,8,{"$f":"IF(h2g(TEXT($C$7+((ROW()-19)*29.5),\"B2yyyy/mm/\")&TEXT($C$7,\"B2dd\"))>$H$14,\"\",IF(h2g(TEXT($C$7+((ROW()-19)*29.5),\"B2yyyy/mm/\")&TEXT($C$7,\"B2dd\"))>h2g($C$9),\"\",TEXT($C$7+((ROW()-19)*29.5),\"B2yyyy/mm/\")&TEXT($C$7,\"B2dd\")))","v":"1445/12/15"},"2024/06/21",25117.647058823539,2511.7647058823532,{"$f":"IF(I26<>\"\",G26-I26,IF(C26=\"\",\"\",IF(TODAY()>=h2g(D26),G26,\"\")))","v":""},{"$f":"IFERROR(IF(VLOOKUP($B$2,' الفرق بين التاريخين '!#REF!,ROW()-16,0)=0,\"\",VLOOKUP($B$2,' الفرق بين التاريخين '!#REF!,ROW()-16,0)),\"\")","v":""}]
[null,null,9,{"$f":"IF(h2g(TEXT($C$7+((ROW()-19)*29.5),\"B2yyyy/mm/\")&TEXT($C$7,\"B2dd\"))>$H$14,\"\",IF(h2g(TEXT($C$7+((ROW()-19)*29.5),\"B2yyyy/mm/\")&TEXT($C$7,\"B2dd\"))>h2g($C$9),\"\",TEXT($C$7+((ROW()-19)*29.5),\"B2yyyy/mm/\")&TEXT($C$7,\"B2dd\")))","v":"1446/01/15"},"2024/07/21",22605.882352941186,2511.7647058823532,{"$f":"IF(I27<>\"\",G27-I27,IF(C27=\"\",\"\",IF(TODAY()>=h2g(D27),G27,\"\")))","v":""},{"$f":"IFERROR(IF(VLOOKUP($B$2,' الفرق بين التاريخين '!#REF!,ROW()-16,0)=0,\"\",VLOOKUP($B$2,' الفرق بين التاريخين '!#REF!,ROW()-16,0)),\"\")","v":""}]
[null,null,10,{"$f":"IF(h2g(TEXT($C$7+((ROW()-19)*29.5),\"B2yyyy/mm/\")&TEXT($C$7,\"B2dd\"))>$H$14,\"\",IF(h2g(TEXT($C$7+((ROW()-19)*29.5),\"B2yyyy/mm/\")&TEXT($C$7,\"B2dd\"))>h2g($C$9),\"\",TEXT($C$7+((ROW()-19)*29.5),\"B2yyyy/mm/\")&TEXT($C$7,\"B2dd\")))","v":"1446/02/15"},"2024/08/20",20094.117647058833,2511.7647058823532,{"$f":"IF(I28<>\"\",G28-I28,IF(C28=\"\",\"\",IF(TODAY()>=h2g(D28),G28,\"\")))","v":""},{"$f":"IFERROR(IF(VLOOKUP($B$2,' الفرق بين التاريخين '!#REF!,ROW()-16,0)=0,\"\",VLOOKUP($B$2,' الفرق بين التاريخين '!#REF!,ROW()-16,0)),\"\")","v":""}]
[null,null,11,{"$f":"IF(h2g(TEXT($C$7+((ROW()-19)*29.5),\"B2yyyy/mm/\")&TEXT($C$7,\"B2dd\"))>$H$14,\"\",IF(h2g(TEXT($C$7+((ROW()-19)*29.5),\"B2yyyy/mm/\")&TEXT($C$7,\"B2dd\"))>h2g($C$9),\"\",TEXT($C$7+((ROW()-19)*29.5),\"B2yyyy/mm/\")&TEXT($C$7,\"B2dd\")))","v":"1446/03/15"},"2024/09/18",17582.352941176479,2511.7647058823532,{"$f":"IF(I29<>\"\",G29-I29,IF(C29=\"\",\"\",IF(TODAY()>=h2g(D29),G29,\"\")))","v":""},{"$f":"IFERROR(IF(VLOOKUP($B$2,' الفرق بين التاريخين '!#REF!,ROW()-16,0)=0,\"\",VLOOKUP($B$2,' الفرق بين التاريخين '!#REF!,ROW()-16,0)),\"\")","v":""}]
[null,null,12,{"$f":"IF(h2g(TEXT($C$7+((ROW()-19)*29.5),\"B2yyyy/mm/\")&TEXT($C$7,\"B2dd\"))>$H$14,\"\",IF(h2g(TEXT($C$7+((ROW()-19)*29.5),\"B2yyyy/mm/\")&TEXT($C$7,\"B2dd\"))>h2g($C$9),\"\",TEXT($C$7+((ROW()-19)*29.5),\"B2yyyy/mm/\")&TEXT($C$7,\"B2dd\")))","v":"1446/04/15"},"2024/10/18",15070.588235294126,2511.7647058823532,{"$f":"IF(I30<>\"\",G30-I30,IF(C30=\"\",\"\",IF(TODAY()>=h2g(D30),G30,\"\")))","v":""},{"$f":"IFERROR(IF(VLOOKUP($B$2,' الفرق بين التاريخين '!#REF!,ROW()-16,0)=0,\"\",VLOOKUP($B$2,' الفرق بين التاريخين '!#REF!,ROW()-16,0)),\"\")","v":""}]
{"$rows_left_out":49}
{"sheet":" تسديد عميل","index":2,"n_rows":78,"n_cols":8,"rows_kept":78,"cut":false,"hidden":false,"merged":[[15,4,16,5]]}
[]
[]
[]
[]
[null,null,null,null,null,null,"تاريخ اليوم :",{"$f":"TODAY()","v":"2023-11-19"}]
[null,"ملف العميــل",2900,"الاســـــم ",{"$f":"VLOOKUP(' تسديد عميل'!C6,المقسطون!B26:I61,2,0)","v":1}]
[]
[null,null,null,"مدة القرض (بالاشهر)",{"$f":"VLOOKUP(C6,المقسطون!$B$26:$H$61,3,0)","v":17},null,"القسـط الشهري",{"$f":"VLOOKUP(C6,المقسطون!$B$26:$H$61,6,0)","v":2511.7647058823532}]
[null,null,null,"تاريـخ بدايـة القـرض",{"$f":"VLOOKUP(C6,المقسطون!$B$26:$H$61,7,0)","v":"2023-11-27"},null,"الســعر النقـدي ",{"$f":"VLOOKUP(C6,المقسطون!$B$26:$H$61,4,0)","v":35000}]
[null,null,null,"تاريـخ نهايـة القـرض",{"$f":"TEXT(E9+((E8-1)*29.5),\"B2yyyy/mm/\")&TEXT(E9,\"B2dd\")","v":"1446/09/15"},null,"الربــــــــــــح ",{"$f":"VLOOKUP(C6,المقسطون!B26:K61,9,0)","v":7700.0000000000009}]
[null,null,null,"حــــــالة العقـــــــد",{"$f":"VLOOKUP(C6,المقسطون!B27:N62,11,0)","v":"لم يتم تداولة"},null,"قيمــة القــرض",{"$f":"VLOOKUP(C6,المقسطون!B26:I61,5,0)","v":42700}]
[null,null,null,"نسبة السداد بـ  %",{"$f":"H12/H11","v":0},null,"المبالغ المســددة",{"$f":"SUM(H19:H58)","v":0}]
[null,null,null,null,null,null,"المبالغ  المتبيقية",{"$f":"SUM(H11-H12)","v":42700}]
[null,null,null,null,null,null,"الأشهر المسددة",{"$f":"(H12/H8)","v":0}]
[null,null,null,null,null,null,"الأشهر المتبقية",{"$f":"H13/H8","v":17}]
[null,null,null,null,"حركة تسديد عميل"]
[]
[null,null,null,"الشهــر","تاريخ التحصيل","رصيد القرض","القسط","التسديدات"]
[null,null,null,{"$f":"IF(ROW()-18>$E$8,\"\",ROW()-18)","v":1},{"$f":"IF(D19=\"\",\"\",TEXT($E$9+((D19-1)*29.5),\"B2yyyy/mm/\")&TEXT($E$9,\"B2dd\"))","v":"1445/05/15"},{"$f":"H11","v":42700},{"$f":"IF(E19=\"\",\"\",IF($H$11=\"\",\"\",$H$11/$E$8))","v":2511.7647058823532},{"$f":"IF(D19=\"\",\"\",IF(TODAY()>=h2g(E19),G19,\"\"))","v":""}]
[null,null,null,2,{"$f":"IF(D20=\"\",\"\",TEXT($E$9+((D20-1)*29.5),\"B2yyyy/mm/\")&TEXT($E$9,\"B2dd\"))","v":"1445/06/15"},{"$f":"IF(E20=\"\",\"\",F19-G20)","v":40188.23529411765},2511.7647058823532,{"$f":"IF(D20=\"\",\"\",IF(TODAY()>=h2g(E20),G20,\"\"))","v":""}]
[null,null,null,3,"1445/07/15",{"$f":"IF(E21=\"\",\"\",F20-G21)","v":37676.470588235301},2511.7647058823532,{"$f":"IF(D21=\"\",\"\",IF(TODAY()>=h2g(E21),G21,\"\"))","v":""}]
[null,null,null,4,{"$f":"IF(D22=\"\",\"\",TEXT($E$9+((D22-1)*29.5),\"B2yyyy/mm/\")&TEXT($E$9,\"B2dd\"))","v":"1445/08/15"},35164.705882352951,2511.7647058823532,{"$f":"IF(D22=\"\",\"\",IF(TODAY()>=h2g(E22),G22,\"\"))","v":""}]
[null,null,null,5,"1445/09/15",32652.941176470598,2511.7647058823532,{"$f":"IF(D23=\"\",\"\",IF(TODAY()>=h2g(E23),G23,\"\"))","v":""}]
[null,null,null,6,"1445/10/15",30141.176470588245,2511.7647058823532,{"$f":"IF(D24=\"\",\"\",IF(TODAY()>=h2g(E24),G24,\"\"))","v":""}]
[null,null,null,7,"1445/11/15",27629.411764705892,2511.7647058823532,{"$f":"IF(D25=\"\",\"\",IF(TODAY()>=h2g(E25),G25,\"\"))","v":""}]
[null,null,null,8,"1445/12/15",25117.647058823539,2511.7647058823532,{"$f":"IF(D26=\"\",\"\",IF(TODAY()>=h2g(E26),G26,\"\"))","v":""}]
[null,null,null,9,"1446/01/15",22605.882352941186,2511.7647058823532,{"$f":"IF(D27=\"\",\"\",IF(TODAY()>=h2g(E27),G27,\"\"))","v":""}]
[null,null,null,10,"1446/02/15",20094.117647058833,2511.7647058823532,{"$f":"IF(D28=\"\",\"\",IF(TODAY()>=h2g(E28),G28,\"\"))","v":""}]
[null,null,null,11,"1446/03/15",17582.352941176479,2511.7647058823532,{"$f":"IF(D29=\"\",\"\",IF(TODAY()>=h2g(E29),G29,\"\"))","v":""}]
[null,null,null,12,"1446/04/15",15070.588235294126,2511.7647058823532,{"$f":"IF(D30=\"\",\"\",IF(TODAY()>=h2g(E30),G30,\"\"))","v":""}]
{"$rows_left_out":49}
{"sheet":"الاقساط والاشهر","index":3,"n_rows":69,"n_cols":5,"rows_kept":69,"cut":false,"hidden":false,"merged":[]}
[]
[null,"الشـــــــهر",60]
[]
[null,"المبلغ الاساسي",50000]
[null,"الـزيادة",{"$f":"INDEX(D10:D69,MATCH(C2,B10:B69,0))","v":32500}]
[null,"المبلغ بعد الزيادة",{"$f":"INDEX(C10:C69,MATCH(C2,B10:B69,0))","v":82500}]
[null,"القسط الشهري",{"$f":"INDEX(E10:E69,MATCH(C2,B10:B69,0))","v":1375}]
[]
[null,"الاشهر ","المبلغ بعد الزيادة","الزيادة ","القسط الشهري"]
[null,1,{"$f":"C4+D10","v":50750},{"$f":"C4*0.015","v":750},{"$f":"C10/1","v":50750}]
[null,2,{"$f":"C4+D11","v":51250},{"$f":"C4*0.025","v":1250},{"$f":"C11/2","v":25625}]
[null,3,{"$f":"C4+D12","v":51750},{"$f":"C4*0.035","v":1750.0000000000002},{"$f":"C12/3","v":17250}]
[null,4,{"$f":"C4+D13","v":52250},{"$f":"C4*0.045","v":2250},{"$f":"C13/4","v":13062.5}]
[null,5,{"$f":"C4+D14","v":52750},{"$f":"C4*0.055","v":2750},{"$f":"C14/5","v":10550}]
[null,6,{"$f":"C4+D15","v":53250},{"$f":"C4*0.065","v":3250},{"$f":"C15/6","v":8875}]
[null,7,{"$f":"C4+D16","v":53750},{"$f":"C4*0.075","v":3750},{"$f":"C16/7","v":7678.5714285714284}]
[null,8,{"$f":"C4+D17","v":54250},{"$f":"C4*0.085","v":4250},{"$f":"C17/8","v":6781.25}]
[null,9,{"$f":"C4+D18","v":54750},{"$f":"C4*0.095","v":4750},{"$f":"C18/9","v":6083.333333333333}]
[null,10,{"$f":"C4+D19","v":57500},{"$f":"C4*0.15","v":7500},{"$f":"C19/10","v":5750}]
[null,11,{"$f":"C4+D20","v":58000},{"$f":"C4*0.16","v":8000},{"$f":"C20/11","v":5272.727272727273}]
[null,12,{"$f":"C4+D21","v":58500},{"$f":"C4*0.17","v":8500},{"$f":"C21/12","v":4875}]
[null,13,{"$f":"C4+D22","v":59000},{"$f":"C4*0.18","v":9000},{"$f":"C22/13","v":4538.4615384615381}]
[null,14,{"$f":"C4+D23","v":59500},{"$f":"C4*0.19","v":9500},{"$f":"C23/14","v":4250}]
[null,15,{"$f":"C4+D24","v":60000},{"$f":"C4*0.2","v":10000},{"$f":"C24/15","v":4000}]
[null,16,{"$f":"C4+D25","v":60500},{"$f":"C4*0.21","v":10500},{"$f":"C25/16","v":3781.25}]
[null,17,{"$f":"C4+D26","v":61000},{"$f":"C4*0.22","v":11000},{"$f":"C26/17","v":3588.2352941176468}]
[null,18,{"$f":"C4+D27","v":61500},{"$f":"C4*0.23","v":11500},{"$f":"C27/18","v":3416.6666666666665}]
[null,19,{"$f":"C4+D28","v":62000},{"$f":"C4*0.24","v":12000},{"$f":"C28/19","v":3263.1578947368421}]
[null,20,{"$f":"C4+D29","v":62500},{"$f":"C4*0.25","v":12500},{"$f":"C29/20","v":3125}]
[null,21,{"$f":"C4+D30","v":63000},{"$f":"C4*0.26","v":13000},{"$f":"C30/21","v":3000}]
{"$rows_left_out":40}
{"sheet":"نموذج","index":4,"n_rows":74,"n_cols":17,"rows_kept":74,"cut":false,"hidden":false,"merged":[[56,2,56,3],[56,5,56,7],[56,9,56,10],[59,2,59,10],[51,1,51,11],[52,3,52,7],[52,9,52,10],[54,2,54,3],[54,5,54,7],[54,9,54,10],[50,1,50,11],[39,2,39,3],[39,5,39,7],[39,9,39,10],[41,2,41,3],[41,5,41,7],[41,9,41,10],[44,1,44,11],[46,2,46,10],[48,2,48,4],[48,6,48,7],[48,9,48,10],[17,13,17,18],[19,2,19,7],[19,9,19,10],[37,3,37,7],[37,9,37,10],[23,1,23,9],[25,4,25,10],[27,2,27,3],[27,6,27,10],[29,2,29,10],[31,4,31,10],[33,4,33,6],[33,8,33,10],[34,1,34,10],[34,15,34,17],[35,1,35,10],[21,2,21,7],[12,1,12,4],[12,5,12,10],[14,1,14,2],[14,5,14,10],[17,2,17,7],[17,9,17,10],[14,13,14,18],[16,1,16,2],[1,9,1,10],[4,1,4,11],[6,1,6,10],[8,2,8,10],[10,3,10,4],[10,6,10,7],[10,9,10,10]]}
[]
[null," الرقم :",100,null,"    ",null,null,null,"التاريخ:"]
[]
[null,null,null,null,null,null,null,null,null,null,null,null,null,1]
[null,"إقـــــــــــــــــــــــــــــرار"]
[]
[null,"الحمد لله رب العالمين والصلاة والسلام على نبينا محمد وعلى آله وصحبه وسلم وبعد :"]
[]
[null,"أقــر أنـا :",{"$f":"VLOOKUP(C2,المقسطون!B26:L62,2,0)","v":"1900-01-01"}]
[]
[null,null,"رقــــم الهويــــة الوطنيـــــة :",null,null,"تاريخها :",null,null,"مصدرها :"]
[]
[null,"وأنــا بحـالتي المعتبـرة شـرعاً بأن عنـدي وفـي ذمتـي للأخ /"]
[]
[null,"مبلغــاً مـن المــال وقــدره :",null,null,"ريـــــــــــــال",{"$f":"IF(LEN($D$15)>0,B_Only(D15,1,0,2,\"ريال\",\"ريالان\",\"ريالات\"),\"\")","v":""}]
[]
[null," وذلك قيمة سيارة :"]
[null,"نوعهـــــــا :",null,null,null,null,null,null,"موديلها :"]
[]
[null,"رقم الهيكل :",null,null,null,null,null,null,"اللـــون :"]
[]
[null,"الحـــــــــالة:"]
[]
[null,"وإستلمتها بعد معاينتها وقبلتها بحالتها الراهنة ، على أن يكون السداد على النحو التالي :"]
[]
[null,"أولاً:","مدة التقسـيط",null,{"$f":"NoToTxt(D26,\"شـهراً\",\"\")","v":"ÕÝÑ"}]
[null,null,null,0]
[null,"ثانياً :","أن أدفــع مبلغــاً مقدمـاً قــدره :",null,null,"ريـــــال",{"$f":"IF(LEN($E$28)>0,B_Only(E28,1,0,2,\"ريال\",\"ريالان\",\"ريالات\"),\"\")","v":""},null,null,null,null," "]
[]
[null,"ثالثاً :","أن أدفــع المتبــقي مــن قيمــة السيــارة عــلى أقســاط شـهريــة قيمــة كــل قســط :"]
{"$rows_left_out":45}
{"sheet":"data","index":5,"n_rows":3,"n_cols":37,"rows_kept":3,"cut":false,"hidden":false,"merged":[]}
[1,2,3,4,5,6,7,8,9,10,11,12,13,14,15,16,17,18,19,20,21,22,23,24,25,26,27,28,29,30,31,32,33,34,35,36,37]
["الرقم","التاريخ","اسم المشتري","الهوية الوطنية","تاريخها","مصدرها","اسم البائع","المبلغ","نوع السيارة","مودليها","رقم الهيكل","لون السيارة","حالة السيارة","مدة القسط","المقدم","القسط الشهري","شهر القسط","تاريخ القسط","اسم المشتري","الوظيفة","جهة العمل","قسم","هاتف العمل","هاتف المنزل","جوال المشتري","اسم الكفيل","ر هوية وطنية","تاريخها","مصدرها","اسم الكفيل","الوظيفة","جهة العمل","قسم","هاتف العمل","هاتف المنزل","جوال الكفيل","ملاحظات"]
[100,null,null,null,null,null,"محمد",5464,null,null,null,null,null,30,3232,null,null,"1436/09/25"]

{"sheet":" الفرق بين التاريخين ","index":6,"n_rows":17,"n_cols":6,"rows_kept":17,"cut":false,"hidden":false,"merged":[[15,4,15,7],[16,4,16,7],[14,1,14,3],[15,1,15,3],[3,1,3,2],[4,1,4,2],[6,0,7,0],[6,1,7,1],[1,1,1,7],[3,3,3,7],[14,4,14,7],[12,5,12,7],[11,3,11,4],[6,3,6,4],[7,3,7,4],[11,5,11,7],[12,3,12,4],[7,5,7,7],[6,5,6,7],[4,3,4,7],[9,5,9,7]]}
[]
[null," الفرق بين التاريخين  عدد السنين بخلية وعدد الاشهر بخلية وعدد الأيام بخلية"]
[]
[null,"تاريخ بداية العقد بالهجري",null,"تاريخ نهاية العقد بالهجري"]
[null,"1442/3/03",null,"1444/1/03"]
[]
[null,"مدة الخدمة ","عدد السنوات","عدد الأشهر",null,"عدد الأيام"]
[null,null,{"$f":"kh_count_y_m_d($B$5,$D$5,\"y\",1)","v":1},{"$f":"kh_count_y_m_d($B$5,$D$5,\"m\",1)","v":10},null,{"$f":"kh_count_y_m_d($B$5,$D$5,\"d\",1)","v":22}]
[]
[null,null,"1443/01/01",null,null,{"$f":"ConvertDate(C10)","v":"2021/08/09"}]
[]
[null,null,"تاريخ الفاتورة","عدد الأشهر",null,"تاريخ الإنتهاء"]
[null,null,"2020-12-09",5,null,{"$f":"MID(TEXT(C13,\"b2dd.mm.yyyy\"),1,2)-MID(TEXT(C13+ROUND((D13)*354.367056/12,0),\"b2dd.mm.yyyy\"),1,2)+C13+ROUND((D13)*354.367056/12,0)","v":"2021-05-05"}]
[]
[null,"=TEXT(B35,\"[$-,197000]B2dd/mm/yyyy;@\")",null,null,"2020-03-01"]
[null,"=TEXT(B35,\"[$-,197000]B2dd/mm/yyyy;@\")",null,null,{"$f":"TEXT(E15,\"[$-,197000]B2yyyy/mm/dd;@\")","v":"2020/03/01"}]
[null,null,null,null,{"$f":"TEXT(E15,\"[$-,197]B2yyyy/mm/dd;@\")","v":"1441/07/06"}]