{"text_format":"1","workbook":"xlsx","n_sheets":2,"sheets":["اسماء الكتاب النهائية ","haneen"],"not_rendered":{"charts":0,"images":2,"macros":1,"external_links":0,"defined_names":4,"comments":0,"pivot_tables":0},"unopened":[],"bounds":{"document_bytes":16777216,"sheet_cells":100000,"rows_first":2000,"rows_last":500,"rows_between":2000,"halvings":0,"cell_chars":16384,"cell_head_chars":4096},"cells_cut":0,"cells_raw":0,"read":"whole","date_system":"1900"}

{"sheet":"اسماء الكتاب النهائية ","index":0,"n_rows":280,"n_cols":5,"rows_kept":280,"cut":false,"hidden":false,"merged":[]}
[null,"أسماء مكتب تحفيظ القرآن الكريم بمسجد خلوصي "]
["م","الاسم","أسم الحلقة/","مُحفّظ /\n مُحفّظة ","KK"]
[1,"احمد رمضان حسين","عثمان بن عفان"," الشيخ حمادة",1]
[2,"عبدالله رمضان عبدالله","عثمان بن عفان"," الشيخ حمادة",1]
[3,"مسعد احمد ناجي","عثمان بن عفان"," الشيخ حمادة",1]
[4,"احمد ربيع محمد","عثمان بن عفان"," الشيخ حمادة",1]
[5,"يوسف خالد صلاح","عثمان بن عفان"," الشيخ حمادة",1]
[6,"حمدي هاني حمدي","عثمان بن عفان"," الشيخ حمادة",1]
[7,"عمار ياسر علي عبدالعال","عثمان بن عفان"," الشيخ حمادة",1]
[8,"محمود فتوح محمود","عثمان بن عفان"," الشيخ حمادة",1]
[9,"محمد حسب الله ابراهيم","عثمان بن عفان"," الشيخ حمادة",1]
[10,"حسام علاء عبد التواب عطوة","عثمان بن عفان"," الشيخ حمادة",1]
[11,"محمد محسن محمد عبد الحميد","عثمان بن عفان"," الشيخ حمادة",1]
[12,"احمد علي سيد","عثمان بن عفان"," الشيخ حمادة",1]
[13,"محمد رمضان احمد عبدالحميد","عثمان بن عفان"," الشيخ حمادة",1]
[14,"محمد هاني رجب درويش","الزبير بن العوام"," الشيخ محمد عبد المنعم",1]
[15,"محمد هاني الهم","الزبير بن العوام"," الشيخ محمد عبد المنعم",1]
[16,"عبدالرحمن احمد جاد","الزبير بن العوام"," الشيخ محمد عبد المنعم",1]
[17,"عبد الله محمد جاد السمان","الزبير بن العوام"," الشيخ محمد عبد المنعم",1]
[18,"يوسف حمادة احمد","الزبير بن العوام"," الشيخ محمد عبد المنعم",1]
[19,"لؤي نبيل ربيع محمد","الزبير بن العوام"," الشيخ محمد عبد المنعم",1]
[20,"يوسف محمود احمد ","الزبير بن العوام"," الشيخ محمد عبد المنعم",1]
[21,"عبدالله ربيع رمضان ","الزبير بن العوام"," الشيخ محمد عبد المنعم",1]
[22,"احمد عبد الله ضيف","الزبير بن العوام"," الشيخ محمد عبد المنعم",1]
[23,"عبد الرحمن طه حسين ","الزبير بن العوام"," الشيخ محمد عبد المنعم",1]
[24,"إبراهيم سيد ربيع","الزبير بن العوام"," الشيخ محمد عبد المنعم",1]
[25,"محمود سعيد محمد عبدالحميد","الزبير بن العوام"," الشيخ محمد عبد المنعم",1]
[26,"انس سعد احمد","الزبير بن العوام"," الشيخ محمد عبد المنعم",1]
[27,"احمد مصباح مبروك","الزبير بن العوام"," الشيخ محمد عبد المنعم",1]
[28,"إبراهيم خالد صلاح","الزبير بن العوام"," الشيخ محمد عبد المنعم",1]
[29,"عمر احمد ثابت","الزبير بن العوام"," الشيخ محمد عبد المنعم",1]
[30,"عبدالملك محسن سيد","الزبير بن العوام"," الشيخ محمد عبد المنعم",1]
[31,"عمر فضل خميس ","الزبير بن العوام"," الشيخ محمد عبد المنعم",1]
[32,"يوسف بدوي سيد","الزبير بن العوام"," الشيخ محمد عبد المنعم",1]
[33,"عبد الرحمن طارق عبدالغني","الزبير بن العوام"," الشيخ محمد عبد المنعم",1]
[34,"عمرو ياسر علي عبدالعال","الزبير بن العوام"," الشيخ محمد عبد المنعم",1]
[35,"حبيبة جمعة عبد الرازق","حفصة بنت عمر بن الخطّاب "," المعلمة ام عمير",1]
[36,"اسراء عبد الخالق ضيفان","حفصة بنت عمر بن الخطّاب "," المعلمة ام عمير",1]
[37,"خديجة محمد حمدي","حفصة بنت عمر بن الخطّاب "," المعلمة ام عمير",1]
[38,"مريم حميدة جمعة","حفصة بنت عمر بن الخطّاب "," المعلمة ام عمير",1]
[39,"حبيبة هاني رجب","حفصة بنت عمر بن الخطّاب "," المعلمة ام عمير",1]
[40,"دنيا محمد إبراهيم","حفصة بنت عمر بن الخطّاب "," المعلمة ام عمير",1]
[41,"ملك جمعة  عبد الله","حفصة بنت عمر بن الخطّاب "," المعلمة ام عمير",1]
[42,"جني حسام عبد الحميد","حفصة بنت عمر بن الخطّاب "," المعلمة ام عمير",1]
[43,"مريم محمد حميدة","حفصة بنت عمر بن الخطّاب "," المعلمة ام عمير",1]
[44,"فاطمة جمعة عبدالحميد","حفصة بنت عمر بن الخطّاب "," المعلمة ام عمير",1]
[45,"ملك احمد حسين","حفصة بنت عمر بن الخطّاب "," المعلمة ام عمير",1]
[46,"اسماء حدوت محمود","حفصة بنت عمر بن الخطّاب "," المعلمة ام عمير",1]
[47,"رحمة صابر عبدالفتاح","حفصة بنت عمر بن الخطّاب "," المعلمة ام عمير",1]
[48,"مريم حسانين جودة","حفصة بنت عمر بن الخطّاب "," المعلمة ام عمير",1]
[49,"منة محمد حسين","حفصة بنت عمر بن الخطّاب "," المعلمة ام عمير",1]
[50,"يمني هاني محمد","حفصة بنت عمر بن الخطّاب "," المعلمة ام عمير",1]
[51,"اية عبد التواب حميدة","حفصة بنت عمر بن الخطّاب "," المعلمة ام عمير",1]
[52,"هبة شعيب عبد الرازق","حفصة بنت عمر بن الخطّاب "," المعلمة ام عمير",1]
[53,"نورهان معتوق جمعة","حفصة بنت عمر بن الخطّاب "," المعلمة ام عمير",1]
[54,"هاجر علي مصطفي","حفصة بنت عمر بن الخطّاب "," المعلمة ام عمير",1]
[55,"سارة صبحي ياسين","حفصة بنت عمر بن الخطّاب "," المعلمة ام عمير",1]
[56,"اسماء محمد مصطفي ايوب","حفصة بنت عمر بن الخطّاب "," المعلمة ام عمير",1]
[57,"اية عبد الواحد عبد ربة","حفصة بنت عمر بن الخطّاب "," المعلمة ام عمير",1]
[58,"جني حماده شحات","حفصة بنت عمر بن الخطّاب "," المعلمة ام عمير",1]
[59,"منال محمد مصطفي ايوب","أبو عبيدة بن الجراح"," المعلمة رانيا ",1]
[60,"رنا عفت رجب","أبو عبيدة بن الجراح"," المعلمة رانيا ",1]
[61,"امنه ايمن خميس ","أبو عبيدة بن الجراح"," المعلمة رانيا ",1]
[62,"رهف محمد ضيف","أبو عبيدة بن الجراح"," المعلمة رانيا ",1]
[63,"هبة صبري محمد","أبو عبيدة بن الجراح"," المعلمة رانيا ",1]
[64,"فاطمة مرسي احمد","أبو عبيدة بن الجراح"," المعلمة رانيا ",1]
[65,"حبيبة محمد عبدالله محمد","أبو عبيدة بن الجراح"," المعلمة رانيا ",1]
[66,"ريتاج محسن محمد","أبو عبيدة بن الجراح"," المعلمة رانيا ",1]
[67,"شيماء شريف عبدالمنعم","أبو عبيدة بن الجراح"," المعلمة رانيا ",1]
[68,"ريناد سلامة حمدي عبدالعال","أبو عبيدة بن الجراح"," المعلمة رانيا ",1]
[69,"ملك سلامة عوض","أبو عبيدة بن الجراح"," المعلمة رانيا ",1]
[70,"سمر وليد رمضان","أبو عبيدة بن الجراح"," المعلمة رانيا ",1]
[71,"فاطمة صلاح عبد الهادي","أبو عبيدة بن الجراح"," المعلمة رانيا ",1]
[72,"ياسمين عمرو جمعة","أبو عبيدة بن الجراح"," المعلمة رانيا ",1]
[73,"رويدة هاني حمدي","أبو عبيدة بن الجراح"," المعلمة رانيا ",1]
[74,"رضوي عرفة سيد ","أبو عبيدة بن الجراح"," المعلمة رانيا ",1]
[75,"دارين صفوت احمد","أبو عبيدة بن الجراح"," المعلمة رانيا ",1]
[76,"جودي ماهر محمد سيد","أبو عبيدة بن الجراح"," المعلمة رانيا ",1]
[77,"حبيبة رمضان عبد الله","أبو عبيدة بن الجراح"," المعلمة رانيا ",1]
[78,"حنين مختار احمد","أبو عبيدة بن الجراح"," المعلمة رانيا ",1]
[79,"بسنت حبيشة علي ","أبو عبيدة بن الجراح"," المعلمة رانيا ",1]
[80,"هيا كرم عبد الله درويش","أبو عبيدة بن الجراح"," المعلمة رانيا ",1]
[81,"ريم احمد صلاح","أبو عبيدة بن الجراح"," المعلمة رانيا ",1]
[82,"ملك بركات عيسي","أبو عبيدة بن الجراح"," المعلمة رانيا ",1]
[83,"ايمان صابر عبدالفتاح","أبو عبيدة بن الجراح"," المعلمة رانيا ",1]
[84,"مصطفي خميس فتحي عبدالمعبود","مصعب بن عمير","الشيخ حجاج",1]
[85,"عمر خميس سيد","عمر بن الخطاب","الشيخ حجاج",1]
[86,"عبدالملك عمر جمعة","عمر بن الخطاب","الشيخ حجاج",1]
[87,"صلاح احمد صلاح محمود","عمر بن الخطاب","الشيخ حجاج",1]
[88,"حذيفة محسن عبد الحميد","عمر بن الخطاب","الشيخ حجاج",1]
[89,"عبدالرحمن محمد اسحاق","عمر بن الخطاب","الشيخ حجاج",1]
[90,"عمر سعد عبدربة","عمر بن الخطاب","الشيخ حجاج",1]
[91,"محمد خالد جادالله","عمر بن الخطاب","الشيخ حجاج",1]
[92,"عبد الرحمن محمود مسعود","عمر بن الخطاب","الشيخ حجاج",1]
[93,"عمر جمعة صلاح","عمر بن الخطاب","الشيخ حجاج",1]
[94,"عمر رمضان جمعة","عمر بن الخطاب","الشيخ حجاج",1]
[95,"محمد احمد ربيع قاسم","عمر بن الخطاب","الشيخ حجاج",1]
[96,"محمد طلبة رمضان","عمر بن الخطاب","الشيخ حجاج",1]
[97,"يوسف شعيب سعد","عمر بن الخطاب","الشيخ حجاج",1]
[98,"محمد خالد صلاح محمود","عمر بن الخطاب","الشيخ حجاج",1]
[99,"عبد الرحمن حدوت كامل","عمر بن الخطاب","الشيخ حجاج",1]
[100,"عبدالله سيد محمد","سعد بن أبي وقاص","الشيخ حمادة رجب",1]
[101,"ياسين عماد سعد","سعد بن أبي وقاص","الشيخ حمادة رجب",1]
[102,"يوسف ربيع عبود","سعد بن أبي وقاص","الشيخ حمادة رجب",1]
[103,"عمار محمد عمار","سعد بن أبي وقاص","الشيخ حمادة رجب",1]
[104,"سيف محمد شحات","سعد بن أبي وقاص","الشيخ حمادة رجب",1]
[105,"احمد جمعة صلاح","سعد بن أبي وقاص","الشيخ حمادة رجب",1]
[106,"حسين احمد حسين","سعد بن أبي وقاص","الشيخ حمادة رجب",1]
[107,"عبد الرحمن ربيع عوض","سعد بن أبي وقاص","الشيخ حمادة رجب",1]
[108,"محمد سلامة عوض","سعد بن أبي وقاص","الشيخ حمادة رجب",1]
[109,"يوسف عماد سعد","سعد بن أبي وقاص","الشيخ حمادة رجب",1]
[110,"احمد محمد عمار عبد الغفار","سعد بن أبي وقاص","الشيخ حمادة رجب",1]
[111,"محمود مختار صالح","سعد بن أبي وقاص","الشيخ حمادة رجب",1]
[112,"حمزة رمضان حامد","سعد بن أبي وقاص","الشيخ حمادة رجب",1]
[113,"محمد مصباح مبروك","سعد بن أبي وقاص","الشيخ حمادة رجب",1]
[114,"يوسف عمرو جمعة عبدالمعبود","سعد بن أبي وقاص","الشيخ حمادة رجب",1]
[115,"عوض فرحات عيسي","سعد بن أبي وقاص","الشيخ حمادة رجب",1]
[116,"عمر رمضان جمعة ","سعد بن أبي وقاص","الشيخ حمادة رجب",1]
[117,"محمد علي سيد","سعد بن أبي وقاص","الشيخ حمادة رجب",1]
[118,"ياسين محمد سلطان","سعد بن أبي وقاص","الشيخ حمادة رجب",1]
[119,"زياد احمد سعيد عبد المنعم","سعد بن أبي وقاص","الشيخ حمادة رجب",1]
[120,"محمد عبدالباسط محمد حجاج","سعد بن أبي وقاص","الشيخ حمادة رجب",1]
[121,"معتز محمود نمر","سعد بن أبي وقاص","الشيخ حمادة رجب",1]
[122,"محمد سامح جمال","سعد بن أبي وقاص","الشيخ حمادة رجب",1]
[123,"معتز سلامة حمدي","سعد بن أبي وقاص","الشيخ حمادة رجب",1]
[124,"عبدالله صبحي قرني","سعد بن أبي وقاص","الشيخ حمادة رجب",1]
[125,"مصطفي محمد  عويس أحمد","سعد بن أبي وقاص","الشيخ حمادة رجب",1]
[126,"محمد سيد أحمد عبدالحميد ","سعد بن أبي وقاص","الشيخ حمادة رجب",1]
[127,"انس حمادة ربيع","سعد بن أبي وقاص","الشيخ حمادة رجب",1]
[128,"معاذ عبدالواحد عبدربة","سعد بن أبي وقاص","الشيخ حمادة رجب",1]
[129,"فارس عبدالواحد عبدربة","سعد بن أبي وقاص","الشيخ حمادة رجب",1]
[130,"علي منصور محمد","سعد بن أبي وقاص","الشيخ حمادة رجب",1]
[131,"عمر احمد فرج","سعد بن أبي وقاص","الشيخ حمادة رجب",1]
[132,"محمد منصور محمود","سعد بن أبي وقاص","الشيخ حمادة رجب",1]
[133,"عبد الله محمد خميس","سعد بن أبي وقاص","الشيخ حمادة رجب",1]
[134,"سيف محمد خميس","سعد بن أبي وقاص","الشيخ حمادة رجب",1]
[135,"عبدالرحمن حسن جودة","سعد بن أبي وقاص","الشيخ حمادة رجب",1]
[136,"مصطفي احمد صلاح","علي بن أبي طالب","الشيخ عبدالله شعبان",1]
[137,"محمد هاني حمدي عبدالعال","علي بن أبي طالب","الشيخ عبدالله شعبان",1]
[138,"محمد حمادة خميس","علي بن أبي طالب","الشيخ عبدالله شعبان",1]
[139,"علي هاني جمال","علي بن أبي طالب","الشيخ عبدالله شعبان",1]
[140,"عبد الله حسين احمد","علي بن أبي طالب","الشيخ عبدالله شعبان",1]
[141,"اسلام احمد سعيد","علي بن أبي طالب","الشيخ عبدالله شعبان",1]
[142,"محمد سامح محمود","علي بن أبي طالب","الشيخ عبدالله شعبان",1]
[143,"طلحة وجية معوض محمد","علي بن أبي طالب","الشيخ عبدالله شعبان",1]
[144,"محمود علاء عبد التواب","علي بن أبي طالب","الشيخ عبدالله شعبان",1]
[145,"عبدالرحمن احمد ربيع قاسم","علي بن أبي طالب","الشيخ عبدالله شعبان",1]
[146,"احمد عبدالواحد عبدربه","علي بن أبي طالب","الشيخ عبدالله شعبان",1]
[147,"عبد الرحمن ربيع رمضان","علي بن أبي طالب","الشيخ عبدالله شعبان",1]
[148,"احمد صفوت احمد","علي بن أبي طالب","الشيخ عبدالله شعبان",1]
[149,"عمرو محمود نمر","علي بن أبي طالب","الشيخ عبدالله شعبان",1]
[150,"حازم محمد مصطفي","علي بن أبي طالب","الشيخ عبدالله شعبان",1]
[151,"معاذ احمد ثابت","علي بن أبي طالب","الشيخ عبدالله شعبان",1]
[152,"ادم محمد عويس","علي بن أبي طالب","الشيخ عبدالله شعبان",1]
[153,"عبد الله حسين فتحي عبدالمعبود","عبد الرّحمن بن عوف","الشيخ عمرو",1]
[154,"يوسف جمعة عبدالله","عبد الرّحمن بن عوف","الشيخ عمرو",1]
[155,"احمد عبد الباسط مرزوق","عبد الرّحمن بن عوف","الشيخ عمرو",1]
[156,"عامر عيد ضيفان سعيد","عبد الرّحمن بن عوف","الشيخ عمرو",1]
[157,"زياد أيوب عبدالباقي","عبد الرّحمن بن عوف","الشيخ عمرو",1]
[158,"محمد نصر جمعة","عبد الرّحمن بن عوف","الشيخ عمرو",1]
[159,"احمد محمد إبراهيم عبدالكريم","عبد الرّحمن بن عوف","الشيخ عمرو",1]
[160,"معاذ جمال عمر","عبد الرّحمن بن عوف","الشيخ عمرو",1]
[161,"عمر هاني كامل","عبد الرّحمن بن عوف","الشيخ عمرو",1]
[162,"محمود احمد ناجي","عبد الرّحمن بن عوف","الشيخ عمرو",1]
[163,"ادهم جمعة عبد الرازق","عبد الرّحمن بن عوف","الشيخ عمرو",1]
[164,"إسماعيل جمعة محمد","عبد الرّحمن بن عوف","الشيخ عمرو",1]
[165,"رأفت محمد  عويس أحمد ","عبد الرّحمن بن عوف","الشيخ عمرو",1]
[166,"احمد سعيد حسين","عبد الرّحمن بن عوف","الشيخ عمرو",1]
[167,"محمد مصطفي  مسعود","عبد الرّحمن بن عوف","الشيخ عمرو",1]
[168,"معاذ فضل مصطفي","عبد الرّحمن بن عوف","الشيخ عمرو",1]
[169,"عبدالرحمن جمال يونس","عبد الرّحمن بن عوف","الشيخ عمرو",1]
[170,"محمد مسعد عبد الرازق","عبد الرّحمن بن عوف","الشيخ عمرو",1]
[171,"محمد احمد محمد ","عبد الرّحمن بن عوف","الشيخ عمرو",1]
[172,"عاصم محمد نعيم","عبد الرّحمن بن عوف","الشيخ عمرو",1]
[173,"محمد حسين خميس","عبد الرّحمن بن عوف","الشيخ عمرو",1]
[174,"احمد صبري محمد","عبد الرّحمن بن عوف","الشيخ عمرو",1]
[175,"مازن يحي ثابت","عبد الرّحمن بن عوف","الشيخ عمرو",1]
[176,"شهاب محمد حسن","مصعب بن عمير","الشيخ محمد مختار ",1]
[177,"يوسف ضيف يونس","مصعب بن عمير","الشيخ محمد مختار ",1]
[178,"آدم عرفة سيد","مصعب بن عمير","الشيخ محمد مختار ",1]
[179,"محمود حامد محمود عبدالعال","مصعب بن عمير","الشيخ محمد مختار ",1]
[180,"طة علي مصطفي","مصعب بن عمير","الشيخ محمد مختار ",1]
[181,"علي جمعة علي سيد","مصعب بن عمير","الشيخ محمد مختار ",1]
[182,"سيد مصطفي سعيد","مصعب بن عمير","الشيخ محمد مختار ",1]
[183,"يوسف محمد عبد الرازق","مصعب بن عمير","الشيخ محمد مختار ",1]
[184,"زياد رجب عثمان","مصعب بن عمير","الشيخ محمد مختار ",1]
[185,"بدر صبري محمد","مصعب بن عمير","الشيخ محمد مختار ",1]
[186,"سهيل وجية معوض محمد","مصعب بن عمير","الشيخ محمد مختار ",1]
[187,"محمد صفوت احمد","مصعب بن عمير","الشيخ محمد مختار ",1]
[188,"فارس عبد الدايم عبدالواحد","مصعب بن عمير","الشيخ محمد مختار ",1]
[189,"ماجد ايهاب حسن","مصعب بن عمير","الشيخ محمد مختار ",1]
[190,"محمد إبراهيم احمد محمود","مصعب بن عمير","الشيخ محمد مختار ",1]
[191,"علي حازم علي","مصعب بن عمير","الشيخ محمد مختار ",1]
[192,"ادهم علي اسحاق","مصعب بن عمير","الشيخ محمد مختار ",1]
[193,"عمار فرحات رمضان كامل","مصعب بن عمير","الشيخ محمد مختار ",1]
[194,"احمد سعد عبدربة","مصعب بن عمير","الشيخ محمد مختار ",1]
[195,"كريم سعد عبد ربة","مصعب بن عمير","الشيخ محمد مختار ",1]
[196,"انس علاء فتحي","مصعب بن عمير","الشيخ محمد مختار "]
[197,"اسماء ربيع عمار","عائشة بنت أبي بكر ","المعلمة ام عبد الله",1]
[198,"ندا محروس رمضان","عائشة بنت أبي بكر ","المعلمة ام عبد الله",1]
[199,"فاطمة محروس رمضان محمد","عائشة بنت أبي بكر ","المعلمة ام عبد الله",1]
[200,"اسماء ربيع عبود","عائشة بنت أبي بكر ","المعلمة ام عبد الله",1]
[201,"شهد ايمن خميس","عائشة بنت أبي بكر ","المعلمة ام عبد الله",1]
[202,"ندا بدوي سيد","عائشة بنت أبي بكر ","المعلمة ام عبد الله",1]
[203,"ياسمين محمد عمار","عائشة بنت أبي بكر ","المعلمة ام عبد الله",1]
[204,"ياسمين شعبان محمد عبدالعال","عائشة بنت أبي بكر ","المعلمة ام عبد الله",1]
[205,"رانيا ربيع محمد","عائشة بنت أبي بكر ","المعلمة ام عبد الله",1]
[206,"فاطمة محمد خميس عبدالعزيز","عائشة بنت أبي بكر ","المعلمة ام عبد الله",1]
[207,"حنين خليل ابراهيم","عائشة بنت أبي بكر ","المعلمة ام عبد الله",1]
[208,"جني سلومة جودة","عمرو بن العاص","المعلمة ام عبيدة",1]
[209,"شاهيناز هاني محمد","عمرو بن العاص","المعلمة ام عبيدة",1]
[210,"ياسمين بدوي سيد","عمرو بن العاص","المعلمة ام عبيدة",1]
[211,"سارة خميس سيد","عمرو بن العاص","المعلمة ام عبيدة",1]
[212,"رحمة محمد عمار","عمرو بن العاص","المعلمة ام عبيدة",1]
[213,"ملك شريف عبد المنعم","عمرو بن العاص","المعلمة ام عبيدة",1]
[214,"امنية هاني كامل احمد","عمرو بن العاص","المعلمة ام عبيدة",1]
[215,"خديجه فتحي مصطفي","عمرو بن العاص","المعلمة ام عبيدة",1]
[216,"ملك تامر بخيت","عمرو بن العاص","المعلمة ام عبيدة",1]
[217,"آيات شعبان نمر","عمرو بن العاص","المعلمة ام عبيدة",1]
[218,"يسرا مرسي أحمد","عمرو بن العاص","المعلمة ام عبيدة",1]
[219,"حنين امير محمد","عمرو بن العاص","المعلمة ام عبيدة",1]
[220,"أسماء عبد الله ضيفان سعيد","عمرو بن العاص","المعلمة ام عبيدة",1]
[221,"ايمان محمود محمد","عمرو بن العاص","المعلمة ام عبيدة",1]
[222,"يمني مرسي أحمد","عمرو بن العاص","المعلمة ام عبيدة",1]
[223,"رغد رمضان احمد توفيق","عمرو بن العاص","المعلمة ام عبيدة",1]
[224,"فاطمة معوض احمد","عمرو بن العاص","المعلمة ام عبيدة",1]
[225,"سما ايهاب حسن محمد","عمرو بن العاص","المعلمة ام عبيدة",1]
[226,"منة علي سيد","عمرو بن العاص","المعلمة ام عبيدة",1]
[227,"حبيبة حمادة خميس","عمرو بن العاص","المعلمة ام عبيدة",1]
[228,"فاطمة حمادة خميس","عمرو بن العاص","المعلمة ام عبيدة",1]
[229,"خديجة معوض احمد","عمرو بن العاص","المعلمة ام عبيدة",1]
[230,"سما حسين غلاب","عمرو بن العاص","المعلمة ام عبيدة",1]
[231,"جني محسن سيد عبدالباقي","عمرو بن العاص","المعلمة ام عبيدة",1]
[232,"اسماء عمرو محمد","خديجة بنت خويلد ","المعلمة ام مدثر ",1]
[233,"ريهام تامر بخيت حميدة","خديجة بنت خويلد ","المعلمة ام مدثر ",1]
[234,"حليمة إبراهيم محمد ايوب","خديجة بنت خويلد ","المعلمة ام مدثر ",1]
[235,"هدي محمود احمد","خديجة بنت خويلد ","المعلمة ام مدثر ",1]
[236,"افنان هشام احمد","خديجة بنت خويلد ","المعلمة ام مدثر ",1]
[237,"عائشة عامر عبد الله احمد","خديجة بنت خويلد ","المعلمة ام مدثر ",1]
[238,"نورهان حمدي غلاب","خديجة بنت خويلد ","المعلمة ام مدثر ",1]
[239,"شروق مصطفي سعيد","خديجة بنت خويلد ","المعلمة ام مدثر ",1]
[240,"حبيبة كرم فرج","خديجة بنت خويلد ","المعلمة ام مدثر ",1]
[241,"امنة شعبان محمد عبد العال","خديجة بنت خويلد ","المعلمة ام مدثر ",1]
[242,"اسماء محمد خميس عبدالعزيز","خديجة بنت خويلد ","المعلمة ام مدثر ",1]
[243,"شروق عماد حسن","خديجة بنت خويلد ","المعلمة ام مدثر ",1]
[244,"هدير سلامة معوض","خديجة بنت خويلد ","المعلمة ام مدثر ",1]
[245,"شهد شعبان فرج","خديجة بنت خويلد ","المعلمة ام مدثر ",1]
[246,"هدير شعبان فرج","خديجة بنت خويلد ","المعلمة ام مدثر ",1]
[247,"فاطمة عبد الله ضيفان سعيد","خديجة بنت خويلد ","المعلمة ام مدثر ",1]
[248,"هاجر مسعد عبدالرازق","خديجة بنت خويلد ","المعلمة ام مدثر ",1]
[249,"اسماء ياسر مصطفي","خديجة بنت خويلد ","المعلمة ام مدثر ",1]
[250,"شهد رمضان جمعة","خديجة بنت خويلد ","المعلمة ام مدثر ",1]
[251,"ملك فضل مصطفي","معاذ بن جبل","المعلمة ياسمين / اماني",1]
[252,"اسينات جمعة مصطفي ","معاذ بن جبل","المعلمة ياسمين / اماني",1]
[253,"اية وليد فرج","معاذ بن جبل","المعلمة ياسمين / اماني",1]
[254,"اية سعيد محمد","معاذ بن جبل","المعلمة ياسمين / اماني",1]
[255,"حبيبة خليل ابراهيم","معاذ بن جبل","المعلمة ياسمين / اماني",1]
[256,"هاجر حسين احمد","معاذ بن جبل","المعلمة ياسمين / اماني",1]
[257,"جني كرم عبد الله درويش","معاذ بن جبل","المعلمة ياسمين / اماني",1]
[258,"فاطمة عبد السلام عبدالواحد","معاذ بن جبل","المعلمة ياسمين / اماني",1]
[259,"بسنت محمد عبد الرازق","معاذ بن جبل","المعلمة ياسمين / اماني",1]
[260,"فاطمة محمد منصور","معاذ بن جبل","المعلمة ياسمين / اماني",1]
[261,"نيجار فرحات رمضان كامل","معاذ بن جبل","المعلمة ياسمين / اماني",1]
[262,"رنا حسن عبد الرازق ","معاذ بن جبل","المعلمة ياسمين / اماني",1]
[263,"حبيبة محمد حسين","معاذ بن جبل","المعلمة ياسمين / اماني",1]
[264,"منسة نادي فوزي","معاذ بن جبل","المعلمة ياسمين / اماني",1]
[265,"زينب محمد إبراهيم","معاذ بن جبل","المعلمة ياسمين / اماني",1]
[266,"سما كرم شحات محمود","معاذ بن جبل","المعلمة ياسمين / اماني",1]
[267,"رحمة سلومة جودة","معاذ بن جبل","المعلمة ياسمين / اماني",1]
[268,"بسمله ربيع معوض ","معاذ بن جبل","المعلمة ياسمين / اماني",1]
[269,"أسماء هاني الهم","معاذ بن جبل","المعلمة ياسمين / اماني",1]
[270,"سارة احمد ربيع","معاذ بن جبل","المعلمة ياسمين / اماني",1]
[271,"هاجر احمد ربيع","معاذ بن جبل","المعلمة ياسمين / اماني",1]
[272,"فريحة عبد السلام عبد الواحد","معاذ بن جبل","المعلمة ياسمين / اماني",1]
[273,"حنين عبد الحميد احمد","معاذ بن جبل","المعلمة ياسمين / اماني",1]
[274,"رحمة حميدة جمعة","معاذ بن جبل","المعلمة ياسمين / اماني",1]
[275,"ملك شريف علي ","معاذ بن جبل","المعلمة ياسمين / اماني",1]
[276,"جومانة شريف علي","معاذ بن جبل","المعلمة ياسمين / اماني",1]
[277,"يمني محمد سلطان","معاذ بن جبل","المعلمة ياسمين / اماني",1]
[278,"بسملة علي حسين ","معاذ بن جبل","المعلمة ياسمين / اماني",1]

{"sheet":"haneen","index":1,"n_rows":31,"n_cols":21,"rows_kept":31,"cut":false,"hidden":false,"merged":[[30,1,30,2],[0,0,0,12],[1,11,1,12],[2,2,2,5],[2,10,2,12],[3,9,4,9],[3,10,4,10],[30,7,30,8],[30,10,30,12],[30,5,30,6],[30,3,30,4],[3,4,3,5],[3,1,4,1],[3,2,4,2],[3,12,4,12],[3,7,4,7],[3,3,4,3],[3,8,4,8],[3,0,4,0],[3,6,4,6],[3,11,4,11]]}
["مكتب خلوصي لتحفيظ القرآن الكريم  "]
[null,"     إستمارة متابعة لشهر / ",null,"نوفمبر",null,null,null,1,"عام / 2023",null,"أسم الحلقة/",{"$f":"VLOOKUP(H2,'اسماء الكتاب النهائية '!A:D,3,0)","v":"عثمان بن عفان"},null,null,null,null,null,null,null,null,{"$f":"COUNTA('اسماء الكتاب النهائية '!$A$3:$A$916)-1","v":277}]
[null,"    اسم الطالب / ",{"$f":"VLOOKUP(H2,'اسماء الكتاب النهائية '!A:D,2,0)","v":"احمد رمضان حسين"},null,null,null,null,null,null,"المُحفّظ / المُحفّظة / ",{"$f":"VLOOKUP(H2,'اسماء الكتاب النهائية '!A:D,4,0)","v":" الشيخ حمادة"}]
["م","الأيـــام","التاريخ","السورة","لوح الحفظ",null,"المستوى","الماضي القريب","المستوى","الماضي البعيد","المستوى","حضور / غياب","الصلاوات الخمس"]
[null,null,null,null,"من الآية","إلى الآية"]
[1,"السبت","2023-11-04"]
[2,"الأحد","2023-11-05"]
[3,"الاثنين","2023-11-06",null,null,null,null,null,null," "]
[4,"الثلاثاء","2023-11-07"]
[5,"الأربعاء","2023-11-08"]
[1,"السبت","2023-11-11"]
[2,"الأحد","2023-11-12"]
[3,"الاثنين","2023-11-13"]
[4,"الثلاثاء","2023-11-14"]
[5,"الأربعاء","2023-11-15"]
[1,"السبت","2023-11-18"]
[2,"الأحد","2023-11-19"]
[3,"الاثنين","2023-11-20"]
[4,"الثلاثاء","2023-11-21"]
[5,"الأربعاء","2023-11-22"]
[1,"السبت","2023-11-25"]
[2,"الأحد","2023-11-26"]
[3,"الاثنين","2023-11-27"]
[4,"الثلاثاء","2023-11-28"]
[5,"الأربعاء","2023-11-29"]
[1,"السبت"]
[2,"الأحد"]
[3,"الاثنين"]
[4,"الثلاثاء"]
[5,"الأربعاء"]
[null,"المستوي /",null,"ممتاز = 100 %",null,"جيد جداً = 90 %",null,"جيد = 80 % ",null,"مقبول = 70 %","غير مرضي = 60%"]