{"text_format":"1","workbook":"xlsx","n_sheets":2,"sheets":["طباعة","بيانات الاصناف"],"not_rendered":{"charts":0,"images":0,"macros":1,"external_links":0,"defined_names":6,"comments":0,"pivot_tables":0},"unopened":[],"bounds":{"document_bytes":16777216,"sheet_cells":100000,"rows_first":2000,"rows_last":500,"rows_between":2000,"halvings":0,"cell_chars":16384,"cell_head_chars":4096},"cells_cut":0,"cells_raw":0,"read":"whole","date_system":"1900"}

{"sheet":"طباعة","index":0,"n_rows":18,"n_cols":9,"rows_kept":18,"cut":false,"hidden":false,"merged":[[0,6,1,8],[2,6,2,8],[6,6,7,8],[8,6,8,8],[0,0,1,2],[2,0,2,2],[6,0,7,2],[8,0,8,2],[0,3,1,5],[2,3,2,5],[6,3,7,5],[8,3,8,5],[12,0,13,2],[12,3,13,5],[12,6,13,8],[14,0,14,2],[14,3,14,5],[14,6,14,8]]}
["عكاوي","ورق عنب","ورق عنب","موزرلا","ورق عنب","ورق عنب","تفاح","ورق عنب","ورق عنب"]
["ورق عنب","ورق عنب","ورق عنب","ورق عنب","ورق عنب","ورق عنب","ورق عنب","ورق عنب","ورق عنب"]
[{"$f":"IF(A1=\"\",\"\", INDEX('بيانات الاصناف'!$B$2:$B$102,   MATCH(A1, 'بيانات الاصناف'!$A$2:$A$102, 0),1))","v":"جبن عكاوي مبشور"},null,null,{"$f":"IF(D1=\"\",\"\", INDEX('بيانات الاصناف'!$B$2:$B$102,   MATCH(D1, 'بيانات الاصناف'!$A$2:$A$102, 0),1))","v":"حبنة موزرلا مبشورة"},null,null,{"$f":"IF(G1=\"\",\"\", INDEX('بيانات الاصناف'!$B$2:$B$102,   MATCH(G1, 'بيانات الاصناف'!$A$2:$A$102, 0),1))","v":"ممتاز"}]
[null,{"$f":"IF(A1=\"\",\"\", INDEX('بيانات الاصناف'!$C$2:$C$102,   MATCH(A1, 'بيانات الاصناف'!$A$2:$A$102, 0),1))","v":"2 KG"},null,null,{"$f":"IF(D1=\"\",\"\", INDEX('بيانات الاصناف'!$C$2:$C$102,   MATCH(D1, 'بيانات الاصناف'!$A$2:$A$102, 0),1))","v":"4 KG"},null,null,{"$f":"IF(G1=\"\",\"\", INDEX('بيانات الاصناف'!$C$2:$C$102,   MATCH(G1, 'بيانات الاصناف'!$A$2:$A$102, 0),1))","v":"6 KG"}]
["PRO",{"$f":"TODAY()","v":"2023-12-03"},null,"PRO",{"$f":"TODAY()","v":"2023-12-03"},null,"PRO",{"$f":"TODAY()","v":"2023-12-03"}]
["EXP",{"$f":"IF(A1=\"\",\"\", INDEX('بيانات الاصناف'!$E$2:$E$102,   MATCH(A1, 'بيانات الاصناف'!$A$2:$A$102, 0),1))","v":"2023-12-07"},null,"EXP",{"$f":"IF(D1=\"\",\"\", INDEX('بيانات الاصناف'!$E$2:$E$102,   MATCH(D1, 'بيانات الاصناف'!$A$2:$A$102, 0),1))","v":"2023-12-23"},null,"EXP",{"$f":"IF(G1=\"\",\"\", INDEX('بيانات الاصناف'!$E$2:$E$102,   MATCH(G1, 'بيانات الاصناف'!$A$2:$A$102, 0),1))","v":"2023-12-06"}]
["ورق عنب","ورق عنب","ورق عنب","كفتة جبن","ورق عنب","ورق عنب","دجاج","ورق عنب","ورق عنب"]
["ورق عنب","ورق عنب","ورق عنب","ورق عنب","ورق عنب","ورق عنب","ورق عنب","ورق عنب","ورق عنب"]
[{"$f":"IF(A7=\"\",\"\", INDEX('بيانات الاصناف'!$B$2:$B$102,   MATCH(A7, 'بيانات الاصناف'!$A$2:$A$102, 0),1))","v":"ورق عنب"},null,null,{"$f":"IF(D7=\"\",\"\", INDEX('بيانات الاصناف'!$B$2:$B$102,   MATCH(D7, 'بيانات الاصناف'!$A$2:$A$102, 0),1))","v":"لحم كفتة"},null,null,{"$f":"IF(G7=\"\",\"\", INDEX('بيانات الاصناف'!$B$2:$B$102,   MATCH(G7, 'بيانات الاصناف'!$A$2:$A$102, 0),1))","v":"جيد"}]
[null,{"$f":"IF(A7=\"\",\"\", INDEX('بيانات الاصناف'!$C$2:$C$102,   MATCH(A7, 'بيانات الاصناف'!$A$2:$A$102, 0),1))","v":"0.3 KG"},null,null,{"$f":"IF(D7=\"\",\"\", INDEX('بيانات الاصناف'!$C$2:$C$102,   MATCH(D7, 'بيانات الاصناف'!$A$2:$A$102, 0),1))","v":"0.4 KG"},null,null,{"$f":"IF(G7=\"\",\"\", INDEX('بيانات الاصناف'!$C$2:$C$102,   MATCH(G7, 'بيانات الاصناف'!$A$2:$A$102, 0),1))","v":"3KG"}]
["PRO",{"$f":"TODAY()","v":"2023-12-03"},null,"PRO",{"$f":"TODAY()","v":"2023-12-03"},null,"PRO",{"$f":"TODAY()","v":"2023-12-03"}]
["EXP",{"$f":"IF(A7=\"\",\"\", INDEX('بيانات الاصناف'!$E$2:$E$102,   MATCH(A7, 'بيانات الاصناف'!$A$2:$A$102, 0),1))","v":"2023-12-06"},null,"EXP",{"$f":"IF(D7=\"\",\"\", INDEX('بيانات الاصناف'!$E$2:$E$102,   MATCH(D7, 'بيانات الاصناف'!$A$2:$A$102, 0),1))","v":"2023-12-05"},null,"EXP",{"$f":"IF(G7=\"\",\"\", INDEX('بيانات الاصناف'!$E$2:$E$102,   MATCH(G7, 'بيانات الاصناف'!$A$2:$A$102, 0),1))","v":"2023-12-07"}]
["تجربة1","ورق عنب","ورق عنب","تجربة2","ورق عنب","ورق عنب","تجربة3","ورق عنب","ورق عنب"]
["ورق عنب","ورق عنب","ورق عنب","ورق عنب","ورق عنب","ورق عنب","ورق عنب","ورق عنب","ورق عنب"]
[{"$f":"IF(A13=\"\",\"\", INDEX('بيانات الاصناف'!$B$2:$B$102,   MATCH(A13, 'بيانات الاصناف'!$A$2:$A$102, 0),1))","v":"منتوج1"},null,null,{"$f":"IF(D13=\"\",\"\", INDEX('بيانات الاصناف'!$B$2:$B$102,   MATCH(D13, 'بيانات الاصناف'!$A$2:$A$102, 0),1))","v":"منتوج2"},null,null,{"$f":"IF(G13=\"\",\"\", INDEX('بيانات الاصناف'!$B$2:$B$102,   MATCH(G13, 'بيانات الاصناف'!$A$2:$A$102, 0),1))","v":"منتوج3"}]
[null,{"$f":"IF(A13=\"\",\"\", INDEX('بيانات الاصناف'!$C$2:$C$102,   MATCH(A13, 'بيانات الاصناف'!$A$2:$A$102, 0),1))","v":"5KG"},null,null,{"$f":"IF(D13=\"\",\"\", INDEX('بيانات الاصناف'!$C$2:$C$102,   MATCH(D13, 'بيانات الاصناف'!$A$2:$A$102, 0),1))","v":"6KG"},null,null,{"$f":"IF(G13=\"\",\"\", INDEX('بيانات الاصناف'!$C$2:$C$102,   MATCH(G13, 'بيانات الاصناف'!$A$2:$A$102, 0),1))","v":"7KG"}]
["PRO",{"$f":"TODAY()","v":"2023-12-03"},null,"PRO",{"$f":"TODAY()","v":"2023-12-03"},null,"PRO",{"$f":"TODAY()","v":"2023-12-03"}]
["EXP",{"$f":"IF(A13=\"\",\"\", INDEX('بيانات الاصناف'!$E$2:$E$102,   MATCH(A13, 'بيانات الاصناف'!$A$2:$A$102, 0),1))","v":"2023-12-13"},null,"EXP",{"$f":"IF(D13=\"\",\"\", INDEX('بيانات الاصناف'!$E$2:$E$102,   MATCH(D13, 'بيانات الاصناف'!$A$2:$A$102, 0),1))","v":"2023-12-11"},null,"EXP",{"$f":"IF(G13=\"\",\"\", INDEX('بيانات الاصناف'!$E$2:$E$102,   MATCH(G13, 'بيانات الاصناف'!$A$2:$A$102, 0),1))","v":"2023-12-09"}]

{"sheet":"بيانات الاصناف","index":1,"n_rows":10,"n_cols":8,"rows_kept":10,"cut":false,"hidden":false,"merged":[]}
["اسم الصنف","المحتويات","الوزن/العدد","الصلاحية بالايام","تاريخ الصلاحية","عدد الاستيكرات","البداية","النهاية"]
["عكاوي","جبن عكاوي مبشور","2 KG",4,{"$f":"TODAY()+$D$2:$D$7","v":"2023-12-07"},3,"$A1","$C6"]
["موزرلا","حبنة موزرلا مبشورة","4 KG",20,{"$f":"TODAY()+$D$2:$D$7","v":"2023-12-23"},3,"$D$1","$F$6"]
["تفاح","ممتاز","6 KG",3,{"$f":"TODAY()+$D$2:$D$10","v":"2023-12-06"},1,"$G$1","$I$6"]
["ورق عنب","ورق عنب","0.3 KG",3,{"$f":"TODAY()+$D$2:$D$7","v":"2023-12-06"},1,"$A$7","$C$12"]
["كفتة جبن","لحم كفتة","0.4 KG",2,{"$f":"TODAY()+$D$2:$D$7","v":"2023-12-05"},4,"$D$7","$F$12"]
["دجاج","جيد","3KG",4,{"$f":"TODAY()+$D$2:$D$10","v":"2023-12-07"},1,"$G$7","$I$12"]
["تجربة1","منتوج1","5KG",10,{"$f":"TODAY()+$D$2:$D$10","v":"2023-12-13"},1,"$A$13","$C$18"]
["تجربة2","منتوج2","6KG",8,{"$f":"TODAY()+$D$2:$D$10","v":"2023-12-11"},1,"$D$13","$F$18"]
["تجربة3","منتوج3","7KG",6,{"$f":"TODAY()+$D$2:$D$10","v":"2023-12-09"},3,"$G$13","$I$18"]