{"text_format":"1","workbook":"xlsx","n_sheets":11,"sheets":["الصفحة الرئيسية","تسجيل","عرض الغياب","الغائبين","تقرير غياب طالب","الطلاب","Database","إحصائية يومية","التقرير الشامل","Setting","Sheet4"],"not_rendered":{"charts":0,"images":7,"macros":1,"external_links":0,"defined_names":5,"comments":0,"pivot_tables":2},"unopened":[],"bounds":{"document_bytes":16777216,"sheet_cells":100000,"rows_first":2000,"rows_last":500,"rows_between":2000,"halvings":0,"cell_chars":16384,"cell_head_chars":4096},"cells_cut":0,"cells_raw":0,"read":"whole","date_system":"1900"}

{"sheet":"الصفحة الرئيسية","index":0,"n_rows":0,"n_cols":0,"rows_kept":0,"cut":false,"hidden":false,"merged":[]}

{"sheet":"تسجيل","index":1,"n_rows":34,"n_cols":13,"rows_kept":34,"cut":false,"hidden":false,"merged":[[1,7,1,8],[2,7,2,8]]}
[]
[null,null,null,"عدد الغياب",null,"الشعبة",null,"التاريخ"]
[null,null,null,{"$f":"COUNTIF($E$6:$E$50,\"غائب\")","v":0},null,"7\\2",null,{"$f":"TODAY()","v":"2023-12-15"},null,null,null,null,"حالة الحضور:"]
[null,null,null,null,null,null,null,null,null,null,null,null,"حاضر"]
[null,"#","اسم الطالب","الشعبة","حال الحضور","التاريخ",null,null,null,null,null,null,"غائب"]
[null,1,"محمد29","7\\2","حاضر","2023-12-15",null,null,null,null,null,null,"غ بعذر"]
[null,2,"محمد30","7\\2","حاضر","2023-12-15"]
[null,3,"محمد31","7\\2","حاضر","2023-12-15"]
[null,4,"محمد32","7\\2","حاضر","2023-12-15"]
[null,5,"محمد33","7\\2","حاضر","2023-12-15"]
[null,6,"محمد34","7\\2","حاضر","2023-12-15"]
[null,7,"محمد35","7\\2","حاضر","2023-12-15"]
[null,8,"محمد36","7\\2","حاضر","2023-12-15"]
[null,9,"محمد37","7\\2","حاضر","2023-12-15"]
[null,10,"محمد38","7\\2","حاضر","2023-12-15"]
[null,11,"محمد39","7\\2","حاضر","2023-12-15"]
[null,12,"محمد40","7\\2","حاضر","2023-12-15"]
[null,13,"محمد41","7\\2","حاضر","2023-12-15"]
[null,14,"محمد42","7\\2","حاضر","2023-12-15"]
[null,15,"محمد43","7\\2","حاضر","2023-12-15"]
[null,16,"محمد44","7\\2","حاضر","2023-12-15"]
[null,17,"محمد45","7\\2","حاضر","2023-12-15"]
[null,18,"محمد46","7\\2","حاضر","2023-12-15"]
[null,19,"محمد47","7\\2","حاضر","2023-12-15"]
[null,20,"محمد48","7\\2","حاضر","2023-12-15"]
[null,21,"محمد49","7\\2","حاضر","2023-12-15"]
[null,22,"محمد50","7\\2","حاضر","2023-12-15"]
[null,23,"محمد51","7\\2","حاضر","2023-12-15"]
[null,24,"محمد52","7\\2","حاضر","2023-12-15"]
[null,25,"محمد53","7\\2","حاضر","2023-12-15"]
[null,26,"محمد54","7\\2","حاضر","2023-12-15"]
[null,27,"محمد55","7\\2","حاضر","2023-12-15"]
[null,28,"محمد56","7\\2","حاضر","2023-12-15"]
[null,29,"محمد57","7\\2","حاضر","2023-12-15"]

{"sheet":"عرض الغياب","index":2,"n_rows":87,"n_cols":25,"rows_kept":87,"cut":false,"hidden":false,"merged":[]}
["اختر الشهر"]
["2023-10-01",null,{"$f":"IF(C3=\"\",\"\",TEXT(C3,\"ddd\"))","v":"الأحد"},{"$f":"IF(D3=\"\",\"\",TEXT(D3,\"ddd\"))","v":"الإثنين"},"الثلاثاء","الأربعاء","الخميس","الأحد","الإثنين","الثلاثاء","الأربعاء","الخميس","الأحد","الإثنين","الثلاثاء","الأربعاء","الخميس","الأحد","الإثنين","الثلاثاء","الأربعاء","الخميس","الأحد","الإثنين","الثلاثاء"]
["اسم الطالب","الصف","2023-10-01","2023-10-02","2023-10-03","2023-10-04","2023-10-05","2023-10-08","2023-10-09","2023-10-10","2023-10-11","2023-10-12","2023-10-15","2023-10-16","2023-10-17","2023-10-18","2023-10-19","2023-10-22","2023-10-23","2023-10-24","2023-10-25","2023-10-26","2023-10-29","2023-10-30","2023-10-31"]
[{"$f":"الطلاب!C7","v":"محمد1"},{"$f":"الطلاب!D7","v":"7\\1"},null,null,null,null,null,null,null,null,null,null,null,null,null,null,null,null,null,null,null,null,null,null,"غ"]
[{"$f":"الطلاب!C8","v":"محمد2"},{"$f":"الطلاب!D8","v":"7\\1"}]
[{"$f":"الطلاب!C9","v":"محمد3"},{"$f":"الطلاب!D9","v":"7\\1"}]
[{"$f":"الطلاب!C10","v":"محمد4"},{"$f":"الطلاب!D10","v":"7\\1"}]
[{"$f":"الطلاب!C11","v":"محمد5"},{"$f":"الطلاب!D11","v":"7\\1"}]
[{"$f":"الطلاب!C12","v":"محمد6"},{"$f":"الطلاب!D12","v":"7\\1"}]
[{"$f":"الطلاب!C13","v":"محمد7"},{"$f":"الطلاب!D13","v":"7\\1"}]
[{"$f":"الطلاب!C14","v":"محمد8"},{"$f":"الطلاب!D14","v":"7\\1"}]
[{"$f":"الطلاب!C15","v":"محمد9"},{"$f":"الطلاب!D15","v":"7\\1"}]
[{"$f":"الطلاب!C16","v":"محمد10"},{"$f":"الطلاب!D16","v":"7\\1"}]
[{"$f":"الطلاب!C17","v":"محمد11"},{"$f":"الطلاب!D17","v":"7\\1"}]
[{"$f":"الطلاب!C18","v":"محمد12"},{"$f":"الطلاب!D18","v":"7\\1"}]
[{"$f":"الطلاب!C19","v":"محمد13"},{"$f":"الطلاب!D19","v":"7\\1"}]
[{"$f":"الطلاب!C20","v":"محمد14"},{"$f":"الطلاب!D20","v":"7\\1"}]
[{"$f":"الطلاب!C21","v":"محمد15"},{"$f":"الطلاب!D21","v":"7\\1"}]
[{"$f":"الطلاب!C22","v":"محمد16"},{"$f":"الطلاب!D22","v":"7\\1"}]
[{"$f":"الطلاب!C23","v":"محمد17"},{"$f":"الطلاب!D23","v":"7\\1"}]
[{"$f":"الطلاب!C24","v":"محمد18"},{"$f":"الطلاب!D24","v":"7\\1"}]
[{"$f":"الطلاب!C25","v":"محمد19"},{"$f":"الطلاب!D25","v":"7\\1"}]
[{"$f":"الطلاب!C26","v":"محمد20"},{"$f":"الطلاب!D26","v":"7\\1"}]
[{"$f":"الطلاب!C27","v":"محمد21"},{"$f":"الطلاب!D27","v":"7\\1"}]
[{"$f":"الطلاب!C28","v":"محمد22"},{"$f":"الطلاب!D28","v":"7\\1"}]
[{"$f":"الطلاب!C29","v":"محمد23"},{"$f":"الطلاب!D29","v":"7\\1"}]
[{"$f":"الطلاب!C30","v":"محمد24"},{"$f":"الطلاب!D30","v":"7\\1"}]
[{"$f":"الطلاب!C31","v":"محمد25"},{"$f":"الطلاب!D31","v":"7\\1"}]
[{"$f":"الطلاب!C32","v":"محمد26"},{"$f":"الطلاب!D32","v":"7\\1"}]
[{"$f":"الطلاب!C33","v":"محمد27"},{"$f":"الطلاب!D33","v":"7\\1"}]
[{"$f":"الطلاب!C34","v":"محمد28"},{"$f":"الطلاب!D34","v":"7\\1"}]
[{"$f":"الطلاب!C35","v":"محمد29"},{"$f":"الطلاب!D35","v":"7\\2"}]
[{"$f":"الطلاب!C36","v":"محمد30"},{"$f":"الطلاب!D36","v":"7\\2"}]
[{"$f":"الطلاب!C37","v":"محمد31"},{"$f":"الطلاب!D37","v":"7\\2"}]
[{"$f":"الطلاب!C38","v":"محمد32"},{"$f":"الطلاب!D38","v":"7\\2"}]
[{"$f":"الطلاب!C39","v":"محمد33"},{"$f":"الطلاب!D39","v":"7\\2"}]
[{"$f":"الطلاب!C40","v":"محمد34"},{"$f":"الطلاب!D40","v":"7\\2"}]
[{"$f":"الطلاب!C41","v":"محمد35"},{"$f":"الطلاب!D41","v":"7\\2"}]
[{"$f":"الطلاب!C42","v":"محمد36"},{"$f":"الطلاب!D42","v":"7\\2"}]
[{"$f":"الطلاب!C43","v":"محمد37"},{"$f":"الطلاب!D43","v":"7\\2"}]
{"$rows_left_out":48}
{"sheet":"الغائبين","index":3,"n_rows":4,"n_cols":7,"rows_kept":4,"cut":false,"hidden":false,"merged":[]}
[null,null,"عدد الطلاب",null,null,"عدد مرات الغياب فأكثر","عدد مرات غياب محدد"]
[null,null,{"$f":"SUBTOTAL(2,$A$4:$A$9000)","v":1},null,null,1]
["#","اسم الطالب","الشعبة","عدد مرات الغياب"]
[1,"محمد1","7\\1",3]

{"sheet":"تقرير غياب طالب","index":4,"n_rows":7,"n_cols":9,"rows_kept":7,"cut":false,"hidden":false,"merged":[[3,2,3,3],[4,2,4,3],[2,7,2,8]]}
[]
[]
[null,null,null,null,null,null,null,{"$f":"TODAY()","v":"2023-12-15"}]
[null,null,"الصف"]
[null,null,"اسم الطالب:"]
[]
[null,null,"م","اسم الطالب","الصف","حال الحضور","التاريخ","الشهر","السنة"]

{"sheet":"الطلاب","index":5,"n_rows":720,"n_cols":11,"rows_kept":720,"cut":false,"hidden":false,"merged":[[1,8,1,10]]}
[]
[null,null,null,null,null,"عدد الطلاب","عدد الشعب",null,"عدد طلاب كل شعبة"]
[null,null,null,null,null,{"$f":"COUNTA(Table1[اسم الطالب])","v":84},{"$f":"COUNTA(_xlfn.UNIQUE(Table1[الشعبة]))","v":4},null,"السابع",{"$f":"Sheet4!A4","v":"7\\1"},{"$f":"COUNTIF(Table1[الشعبة],Sheet4!A4)","v":28}]
[null,null,null,null,null,null,null,null,null,{"$f":"Sheet4!A5","v":"7\\2"},{"$f":"COUNTIF(Table1[الشعبة],Sheet4!A5)","v":29}]
[null,null,null,null,null,null,null,null,null,{"$f":"Sheet4!A6","v":"7\\3"},{"$f":"COUNTIF(Table1[الشعبة],Sheet4!A6)","v":27}]
[null,"#","اسم الطالب","الشعبة","عدد مرات الغياب",null,null,null,null,{"$f":"Sheet4!A7","v":"7\\4"},{"$f":"COUNTIF(Table1[الشعبة],Sheet4!A7)","v":0}]
[null,{"$f":"ROW()-6","v":1},"محمد1","7\\1",{"$f":"COUNTIFS(Table13[حال الحضور],\"غائب\",Table13[اسم الطالب],Table1[[#This Row],[اسم الطالب]])","v":3},null,null,null,null,{"$f":"Sheet4!A8","v":"7\\5"},{"$f":"COUNTIF(Table1[الشعبة],Sheet4!A8)","v":0}]
[null,{"$f":"ROW()-6","v":2},"محمد2","7\\1",{"$f":"COUNTIFS(Table13[حال الحضور],\"غائب\",Table13[اسم الطالب],Table1[[#This Row],[اسم الطالب]])","v":0},null,null,null,null,{"$f":"Sheet4!A9","v":"7\\6"},{"$f":"COUNTIF(Table1[الشعبة],Sheet4!A9)","v":0}]
[null,3,"محمد3","7\\1",{"$f":"COUNTIFS(Table13[حال الحضور],\"غائب\",Table13[اسم الطالب],Table1[[#This Row],[اسم الطالب]])","v":0},null,null,null,null,{"$f":"Sheet4!A10","v":"7\\7"},{"$f":"COUNTIF(Table1[الشعبة],Sheet4!A10)","v":0}]
[null,4,"محمد4","7\\1",{"$f":"COUNTIFS(Table13[حال الحضور],\"غائب\",Table13[اسم الطالب],Table1[[#This Row],[اسم الطالب]])","v":0},null,null,null,null,{"$f":"Sheet4!A14","v":"8\\1"},{"$f":"COUNTIF(Table1[الشعبة],Sheet4!A14)","v":0}]
[null,5,"محمد5","7\\1",{"$f":"COUNTIFS(Table13[حال الحضور],\"غائب\",Table13[اسم الطالب],Table1[[#This Row],[اسم الطالب]])","v":0},null,null,null,null,{"$f":"Sheet4!A15","v":"8\\2"},{"$f":"COUNTIF(Table1[الشعبة],Sheet4!A15)","v":0}]
[null,6,"محمد6","7\\1",{"$f":"COUNTIFS(Table13[حال الحضور],\"غائب\",Table13[اسم الطالب],Table1[[#This Row],[اسم الطالب]])","v":0},null,null,null,null,{"$f":"Sheet4!A16","v":"8\\3"},{"$f":"COUNTIF(Table1[الشعبة],Sheet4!A16)","v":0}]
[null,7,"محمد7","7\\1",{"$f":"COUNTIFS(Table13[حال الحضور],\"غائب\",Table13[اسم الطالب],Table1[[#This Row],[اسم الطالب]])","v":0},null,null,null,"الثامن",{"$f":"Sheet4!A14","v":"8\\1"},{"$f":"COUNTIF(Table1[الشعبة],Sheet4!A14)","v":0}]
[null,8,"محمد8","7\\1",{"$f":"COUNTIFS(Table13[حال الحضور],\"غائب\",Table13[اسم الطالب],Table1[[#This Row],[اسم الطالب]])","v":0},null,null,null,null,{"$f":"Sheet4!A15","v":"8\\2"},{"$f":"COUNTIF(Table1[الشعبة],Sheet4!A15)","v":0}]
[null,9,"محمد9","7\\1",{"$f":"COUNTIFS(Table13[حال الحضور],\"غائب\",Table13[اسم الطالب],Table1[[#This Row],[اسم الطالب]])","v":0},null,null,null,null,{"$f":"Sheet4!A16","v":"8\\3"},{"$f":"COUNTIF(Table1[الشعبة],Sheet4!A16)","v":0}]
[null,10,"محمد10","7\\1",{"$f":"COUNTIFS(Table13[حال الحضور],\"غائب\",Table13[اسم الطالب],Table1[[#This Row],[اسم الطالب]])","v":0},null,null,null,null,{"$f":"Sheet4!A17","v":"8\\4"},{"$f":"COUNTIF(Table1[الشعبة],Sheet4!A17)","v":0}]
[null,11,"محمد11","7\\1",{"$f":"COUNTIFS(Table13[حال الحضور],\"غائب\",Table13[اسم الطالب],Table1[[#This Row],[اسم الطالب]])","v":0},null,null,null,null,{"$f":"Sheet4!A18","v":"8\\5"},{"$f":"COUNTIF(Table1[الشعبة],Sheet4!A18)","v":0}]
[null,12,"محمد12","7\\1",{"$f":"COUNTIFS(Table13[حال الحضور],\"غائب\",Table13[اسم الطالب],Table1[[#This Row],[اسم الطالب]])","v":0},null,null,null,null,{"$f":"Sheet4!A19","v":"8\\6"},{"$f":"COUNTIF(Table1[الشعبة],Sheet4!A19)","v":0}]
[null,13,"محمد13","7\\1",{"$f":"COUNTIFS(Table13[حال الحضور],\"غائب\",Table13[اسم الطالب],Table1[[#This Row],[اسم الطالب]])","v":0},null,null,null,null,{"$f":"Sheet4!A20","v":"8\\7"},{"$f":"COUNTIF(Table1[الشعبة],Sheet4!A20)","v":0}]
[null,{"$f":"ROW()-6","v":14},"محمد14","7\\1",{"$f":"COUNTIFS(Table13[حال الحضور],\"غائب\",Table13[اسم الطالب],Table1[[#This Row],[اسم الطالب]])","v":0},null,null,null,null,{"$f":"Sheet4!A21","v":"8\\8"},{"$f":"COUNTIF(Table1[الشعبة],Sheet4!A21)","v":0}]
[null,{"$f":"ROW()-6","v":15},"محمد15","7\\1",{"$f":"COUNTIFS(Table13[حال الحضور],\"غائب\",Table13[اسم الطالب],Table1[[#This Row],[اسم الطالب]])","v":0},null,null,null,"التاسع",{"$f":"Sheet4!A22","v":"9\\1"},{"$f":"COUNTIF(Table1[الشعبة],Sheet4!A22)","v":0}]
[null,16,"محمد16","7\\1",{"$f":"COUNTIFS(Table13[حال الحضور],\"غائب\",Table13[اسم الطالب],Table1[[#This Row],[اسم الطالب]])","v":0},null,null,null,null,{"$f":"Sheet4!A23","v":"9\\2"},{"$f":"COUNTIF(Table1[الشعبة],Sheet4!A23)","v":0}]
[null,17,"محمد17","7\\1",{"$f":"COUNTIFS(Table13[حال الحضور],\"غائب\",Table13[اسم الطالب],Table1[[#This Row],[اسم الطالب]])","v":0},null,null,null,null,{"$f":"Sheet4!A24","v":"9\\3"},{"$f":"COUNTIF(Table1[الشعبة],Sheet4!A24)","v":0}]
[null,18,"محمد18","7\\1",{"$f":"COUNTIFS(Table13[حال الحضور],\"غائب\",Table13[اسم الطالب],Table1[[#This Row],[اسم الطالب]])","v":0},null,null,null,null,{"$f":"Sheet4!A25","v":"9\\4"},{"$f":"COUNTIF(Table1[الشعبة],Sheet4!A25)","v":0}]
[null,19,"محمد19","7\\1",{"$f":"COUNTIFS(Table13[حال الحضور],\"غائب\",Table13[اسم الطالب],Table1[[#This Row],[اسم الطالب]])","v":0},null,null,null,null,{"$f":"Sheet4!A26","v":"9\\5"},{"$f":"COUNTIF(Table1[الشعبة],Sheet4!A26)","v":0}]
[null,20,"محمد20","7\\1",{"$f":"COUNTIFS(Table13[حال الحضور],\"غائب\",Table13[اسم الطالب],Table1[[#This Row],[اسم الطالب]])","v":0},null,null,null,null,{"$f":"Sheet4!A27","v":"9\\6"},{"$f":"COUNTIF(Table1[الشعبة],Sheet4!A27)","v":0}]
[null,21,"محمد21","7\\1",{"$f":"COUNTIFS(Table13[حال الحضور],\"غائب\",Table13[اسم الطالب],Table1[[#This Row],[اسم الطالب]])","v":0},null,null,null,null,{"$f":"Sheet4!A28","v":"9\\7"},{"$f":"COUNTIF(Table1[الشعبة],Sheet4!A28)","v":0}]
[null,22,"محمد22","7\\1",{"$f":"COUNTIFS(Table13[حال الحضور],\"غائب\",Table13[اسم الطالب],Table1[[#This Row],[اسم الطالب]])","v":0},null,null,null,null,{"$f":"Sheet4!A29","v":0},{"$f":"COUNTIF(Table1[الشعبة],Sheet4!A29)","v":0}]
[null,23,"محمد23","7\\1",{"$f":"COUNTIFS(Table13[حال الحضور],\"غائب\",Table13[اسم الطالب],Table1[[#This Row],[اسم الطالب]])","v":0}]
[null,24,"محمد24","7\\1",{"$f":"COUNTIFS(Table13[حال الحضور],\"غائب\",Table13[اسم الطالب],Table1[[#This Row],[اسم الطالب]])","v":0}]
[null,25,"محمد25","7\\1",{"$f":"COUNTIFS(Table13[حال الحضور],\"غائب\",Table13[اسم الطالب],Table1[[#This Row],[اسم الطالب]])","v":0}]
[null,26,"محمد26","7\\1",{"$f":"COUNTIFS(Table13[حال الحضور],\"غائب\",Table13[اسم الطالب],Table1[[#This Row],[اسم الطالب]])","v":0}]
[null,27,"محمد27","7\\1",{"$f":"COUNTIFS(Table13[حال الحضور],\"غائب\",Table13[اسم الطالب],Table1[[#This Row],[اسم الطالب]])","v":0}]
[null,28,"محمد28","7\\1",{"$f":"COUNTIFS(Table13[حال الحضور],\"غائب\",Table13[اسم الطالب],Table1[[#This Row],[اسم الطالب]])","v":0}]
[null,29,"محمد29","7\\2",{"$f":"COUNTIFS(Table13[حال الحضور],\"غائب\",Table13[اسم الطالب],Table1[[#This Row],[اسم الطالب]])","v":0}]
[null,30,"محمد30","7\\2",{"$f":"COUNTIFS(Table13[حال الحضور],\"غائب\",Table13[اسم الطالب],Table1[[#This Row],[اسم الطالب]])","v":0}]
[null,31,"محمد31","7\\2",{"$f":"COUNTIFS(Table13[حال الحضور],\"غائب\",Table13[اسم الطالب],Table1[[#This Row],[اسم الطالب]])","v":0}]
[null,32,"محمد32","7\\2",{"$f":"COUNTIFS(Table13[حال الحضور],\"غائب\",Table13[اسم الطالب],Table1[[#This Row],[اسم الطالب]])","v":0}]
[null,33,"محمد33","7\\2",{"$f":"COUNTIFS(Table13[حال الحضور],\"غائب\",Table13[اسم الطالب],Table1[[#This Row],[اسم الطالب]])","v":0}]
[null,34,"محمد34","7\\2",{"$f":"COUNTIFS(Table13[حال الحضور],\"غائب\",Table13[اسم الطالب],Table1[[#This Row],[اسم الطالب]])","v":0}]
{"$rows_left_out":681}
{"sheet":"Database","index":6,"n_rows":10,"n_cols":10,"rows_kept":10,"cut":false,"hidden":false,"merged":[]}
[]
[]
[]
[null,{"$f":"IF(A4<>\"\",\"حاضر\",\"\")","v":""}]
[]
[null,"#","اسم الطالب","الشعبة","حال الحضور","التاريخ","الصف","اسم المدرسة","السنة","الشهر"]
[null,1]
[null,2,"محمد1","7\\1","غائب","2023-10-31","سابع",null,2023,10]
[null,3,"محمد1","7\\1","غائب","2023-10-31","سابع",null,2023,10]
[null,4,"محمد1","7\\1","غائب","2023-10-31","سابع",null,2023,10]

{"sheet":"إحصائية يومية","index":7,"n_rows":6,"n_cols":3,"rows_kept":6,"cut":false,"hidden":false,"merged":[[0,0,0,22]]}
["إحصائية الغياب اليومي"]
["  ","     "]
["التاريخ","عدد الغياب","(blank)"]
["(blank)"]
["2023-10-31",3]
["مجموع الغياب",3]

{"sheet":"التقرير الشامل","index":8,"n_rows":6,"n_cols":6,"rows_kept":6,"cut":false,"hidden":false,"merged":[]}
["التقرير الشامل "]
["   ",null,null,"حال الحضور"]
["السنة","الشهر","التاريخ","غائب","(blank)","المجموع "]
[2023,10,"2023-10-31",3,null,3]
["(blank)","(blank)","(blank)"]
["المجموع ",null,null,3,null,3]

{"sheet":"Setting","index":9,"n_rows":133,"n_cols":15,"rows_kept":133,"cut":false,"hidden":false,"merged":[[2,3,2,13]]}
[null,null,null,"أغسطس","سبتمبر","أكتوبر","نوفمبر","ديسمبر","يناير","فبراير","مارس","أبريل","مايو","يونيو"]
["أدخل أيام العمل وأيام الإجازات الرسمية:",null,null,"2023-08-01","2023-09-01","2023-10-01","2023-11-01","2023-12-01","2024-01-01","2024-02-01","2024-03-01","2024-04-01","2024-05-01","2024-06-01"]
["اسم الإجازة","التاريخ",null,"عدد أيام الشهر من غير جمعة وسبت ومن غير الإجازات الرسمية"]
["إجازة الصيف","2023-08-01",null,{"$f":"COUNTA(D5:D27)-COUNTBLANK(D5:D27)","v":5},{"$f":"COUNTA(E5:E27)-COUNTBLANK(E5:E27)","v":20},{"$f":"COUNTA(F5:F27)-COUNTBLANK(F5:F27)","v":18},22,14,18,20,21,22,22,{"$f":"COUNTA(N5:N27)-COUNTBLANK(N5:N27)","v":8},{"$f":"SUM(D4:N4)","v":190}]
["إجازة الصيف","2023-08-02",null,{"$f":"IF(WORKDAY.INTL($D$2-1,ROW(A1),\"0000110\",$B$4:$B$129)>EOMONTH($D$2,0),\"\",WORKDAY.INTL($D$2-1,ROW(A1),\"0000110\",$B$4:$B$129))","v":"2023-08-27"},{"$f":"IF(WORKDAY.INTL($E$2-1,ROW(A1),\"0000110\",$B$4:$B$129)>EOMONTH($E$2,0),\"\",WORKDAY.INTL($E$2-1,ROW(A1),\"0000110\",$B$4:$B$129))","v":"2023-09-03"},{"$f":"IF(WORKDAY.INTL($F$2-1,ROW(A1),\"0000110\",$B$4:$B$129)>EOMONTH($F$2,0),\"\",WORKDAY.INTL($F$2-1,ROW(A1),\"0000110\",$B$4:$B$129))","v":"2023-10-01"},{"$f":"IF(WORKDAY.INTL($G$2-1,ROW(A1),\"0000110\",$B$4:$B$129)>EOMONTH($G$2,0),\"\",WORKDAY.INTL($G$2-1,ROW(A1),\"0000110\",$B$4:$B$129))","v":"2023-11-01"},{"$f":"IF(WORKDAY.INTL($H$2-1,ROW(A1),\"0000110\",$B$4:$B$129)>EOMONTH($H$2,0),\"\",WORKDAY.INTL($H$2-1,ROW(A1),\"0000110\",$B$4:$B$129))","v":"2023-12-03"},{"$f":"IF(WORKDAY.INTL($I$2-1,ROW(A1),\"0000110\",$B$4:$B$129)>EOMONTH($I$2,0),\"\",WORKDAY.INTL($I$2-1,ROW(A1),\"0000110\",$B$4:$B$129))","v":"2024-01-08"},{"$f":"IF(WORKDAY.INTL($J$2-1,ROW(A1),\"0000110\",$B$4:$B$129)>EOMONTH($J$2,0),\"\",WORKDAY.INTL($J$2-1,ROW(A1),\"0000110\",$B$4:$B$129))","v":"2024-02-01"},{"$f":"IF(WORKDAY.INTL($K$2-1,ROW(A1),\"0000110\",$B$4:$B$129)>EOMONTH($K$2,0),\"\",WORKDAY.INTL($K$2-1,ROW(A1),\"0000110\",$B$4:$B$129))","v":"2024-03-03"},{"$f":"IF(WORKDAY.INTL($L$2-1,ROW(A1),\"0000110\",$B$4:$B$129)>EOMONTH($L$2,0),\"\",WORKDAY.INTL($L$2-1,ROW(A1),\"0000110\",$B$4:$B$129))","v":"2024-04-01"},{"$f":"IF(WORKDAY.INTL($M$2-1,ROW(A1),\"0000110\",$B$4:$B$129)>EOMONTH($M$2,0),\"\",WORKDAY.INTL($M$2-1,ROW(A1),\"0000110\",$B$4:$B$129))","v":"2024-05-01"},{"$f":"IF(WORKDAY.INTL($N$2-1,ROW(A1),\"0000110\",$B$4:$B$129)>EOMONTH($N$2,0),\"\",WORKDAY.INTL($N$2-1,ROW(A1),\"0000110\",$B$4:$B$129))","v":"2024-06-02"}]
["إجازة الصيف","2023-08-03",null,"2023-08-28","2023-09-04","2023-10-02","2023-11-02","2023-12-04","2024-01-09","2024-02-04","2024-03-04","2024-04-02","2024-05-02","2024-06-03"]
["إجازة الصيف","2023-08-04",null,"2023-08-29","2023-09-05","2023-10-03","2023-11-05","2023-12-05","2024-01-10","2024-02-05","2024-03-05","2024-04-03","2024-05-05","2024-06-04"]
["إجازة الصيف","2023-08-05",null,"2023-08-30","2023-09-06","2023-10-04","2023-11-06","2023-12-06","2024-01-11","2024-02-06","2024-03-06","2024-04-04","2024-05-06","2024-06-05"]
["إجازة الصيف","2023-08-06",null,"2023-08-31","2023-09-07","2023-10-05","2023-11-07","2023-12-07","2024-01-14","2024-02-07","2024-03-07","2024-04-07","2024-05-07","2024-06-06"]
["إجازة الصيف","2023-08-07",null,"","2023-09-10","2023-10-08","2023-11-08","2023-12-10","2024-01-15","2024-02-08","2024-03-10","2024-04-08","2024-05-08","2024-06-09"]
["إجازة الصيف","2023-08-08",null,"","2023-09-11","2023-10-09","2023-11-09","2023-12-11","2024-01-16","2024-02-11","2024-03-11","2024-04-09","2024-05-09","2024-06-10"]
["إجازة الصيف","2023-08-09",null,"","2023-09-12","2023-10-10","2023-11-12","2023-12-12","2024-01-17","2024-02-12","2024-03-12","2024-04-10","2024-05-12","2024-06-11"]
["إجازة الصيف","2023-08-10",null,"","2023-09-13","2023-10-11","2023-11-13","2023-12-13","2024-01-18","2024-02-13","2024-03-13","2024-04-11","2024-05-13",""]
["إجازة الصيف","2023-08-11",null,"","2023-09-14","2023-10-12","2023-11-14","2023-12-14","2024-01-21","2024-02-15","2024-03-14","2024-04-14","2024-05-14",""]
["إجازة الصيف","2023-08-12",null,"","2023-09-17","2023-10-15","2023-11-15","2023-12-17","2024-01-22","2024-02-18","2024-03-17","2024-04-15","2024-05-15",""]
["إجازة الصيف","2023-08-13",null,"","2023-09-18","2023-10-16","2023-11-16","2023-12-19","2024-01-23","2024-02-19","2024-03-18","2024-04-16","2024-05-16",""]
["إجازة الصيف","2023-08-14",null,"","2023-09-19","2023-10-17","2023-11-19","2023-12-20","2024-01-24","2024-02-20","2024-03-19","2024-04-17","2024-05-19",""]
["إجازة الصيف","2023-08-15",null,"","2023-09-20","2023-10-18","2023-11-20","2023-12-21","2024-01-25","2024-02-21","2024-03-20","2024-04-18","2024-05-20",""]
["إجازة الصيف","2023-08-16",null,"","2023-09-21","2023-10-19","2023-11-21","","2024-01-28","2024-02-22","2024-03-21","2024-04-21","2024-05-21",""]
["إجازة الصيف","2023-08-17",null,"","2023-09-24","2023-10-29","2023-11-22","","2024-01-29","2024-02-25","2024-03-24","2024-04-22","2024-05-22",""]
["إجازة الصيف","2023-08-18",null,"","2023-09-25","2023-10-30","2023-11-23","","2024-01-30","2024-02-26","2024-03-25","2024-04-23","2024-05-23",""]
["إجازة الصيف","2023-08-19",null,"","2023-09-26","2023-10-31","2023-11-26","","2024-01-31","2024-02-27","2024-03-26","2024-04-24","2024-05-26",""]
["إجازة الصيف","2023-08-20",null,"","2023-09-27","","2023-11-27","","","2024-02-28","2024-03-27","2024-04-25","2024-05-27",""]
["إجازة الصيف","2023-08-21",null,"","2023-09-28","","2023-11-28","","","2024-02-29","2024-03-28","2024-04-28","2024-05-28",""]
["إجازة الصيف","2023-08-22",null,"","","","2023-11-29","","","","2024-03-31","2024-04-29","2024-05-29",""]
["إجازة الصيف","2023-08-23",null,"","","","2023-11-30","","","","","2024-04-30","2024-05-30",""]
["إجازة الصيف","2023-08-24",null,"","","","","","","","","","",""]
["إجازة الصيف","2023-08-25",null,"","","","","","","","","","",""]
["نهاية الإجازة الصيفية","2023-08-26",null,"","","","","","","","","","",""]
["إجازة منتصف الفصل الأول","2023-10-22"]
["إجازة منتصف الفصل الأول","2023-10-23"]
["إجازة منتصف الفصل الأول","2023-10-24"]
["إجازة منتصف الفصل الأول","2023-10-25"]
["إجازة منتصف الفصل الأول","2023-10-26"]
["إجازة منتصف الفصل الأول","2023-10-27"]
["نهاية الإجازة","2023-10-28"]
["اليوم الوطني","2023-12-18"]
["إجازة منتصف العام الأكاديمي","2023-12-24"]
["إجازة منتصف العام الأكاديمي","2023-12-25"]
["إجازة منتصف العام الأكاديمي","2023-12-26"]
{"$rows_left_out":94}
{"sheet":"Sheet4","index":10,"n_rows":28,"n_cols":2,"rows_kept":28,"cut":false,"hidden":false,"merged":[]}
[]
[]
["اكتب الصف والشعبة:"]
["7\\1","سابع"]
["7\\2","سابع"]
["7\\3","سابع"]
["7\\4","سابع"]
["7\\5","سابع"]
["7\\6","سابع"]
["7\\7","سابع"]
["7\\8","سابع"]
["7\\9","سابع"]
["7\\10","سابع"]
["8\\1","ثامن"]
["8\\2","ثامن"]
["8\\3","ثامن"]
["8\\4","ثامن"]
["8\\5","ثامن"]
["8\\6","ثامن"]
["8\\7","ثامن"]
["8\\8","ثامن"]
["9\\1","تاسع"]
["9\\2","تاسع"]
["9\\3","تاسع"]
["9\\4","تاسع"]
["9\\5","تاسع"]
["9\\6","تاسع"]
["9\\7","تاسع"]