{"text_format":"1","workbook":"xlsx","n_sheets":5,"sheets":["الكود الأساس","كود الاختبار من أبي أحمد","كود السائل الأخير","النتيجة المطلوبة بعد التصحيح","السجلات قبل التصحيح"],"not_rendered":{"charts":0,"images":0,"macros":1,"external_links":0,"defined_names":0,"comments":0,"pivot_tables":0},"unopened":[],"bounds":{"document_bytes":16777216,"sheet_cells":100000,"rows_first":2000,"rows_last":500,"rows_between":2000,"halvings":0,"cell_chars":16384,"cell_head_chars":4096},"cells_cut":0,"cells_raw":0,"read":"whole","date_system":"1900"}

{"sheet":"الكود الأساس","index":0,"n_rows":11,"n_cols":5,"rows_kept":11,"cut":false,"hidden":false,"merged":[]}
["Code ","Nom du Produit","Quantité en stock ","Nom du magasin ","Date de fin d'un article"]
[100,"Produit",12,"magasin","2024-05-01"]
[100,"Produit",0,"magasin","2024-01-01"]
[101,"Produit1",50,"magasin1","2024-01-01"]
[101,"Produit1",100,"magasin1","2024-05-01"]
[101,"Produit1",0,"magasin1","2024-01-01"]
[100,"Produit",0,"magasin","2024-05-01"]
[100,"Produit",0,"magasin","2024-01-01"]
[101,"Produit1",0,"magasin1","2024-01-01"]
[101,"Produit1",0,"magasin1","2024-05-01"]
[101,"Produit1",0,"magasin1","2024-01-01"]

{"sheet":"كود الاختبار من أبي أحمد","index":1,"n_rows":11,"n_cols":8,"rows_kept":11,"cut":false,"hidden":false,"merged":[]}
["Code ","Nom du Produit","Quantité en stock ","Nom du magasin ","Date de fin d'un article","Key","Dup","Del"]
[100,"Produit",12,"magasin","2024-05-01",{"$f":"A2 & \"-\" & D2 & \"-\"  & E2","v":"100-magasin-45413"},{"$f":"COUNTIF(F:F,F2) - 1","v":1},{"$f":"IF(G2=0,\"\",IF(C2=0,\"Yes\",\"\"))","v":""}]
[100,"Produit",0,"magasin","2024-01-01",{"$f":"A3 & \"-\" & D3 & \"-\"  & E3","v":"100-magasin-45292"},1,{"$f":"IF(G3=0,\"\",IF(C3=0,\"Yes\",\"\"))","v":"Yes"}]
[101,"Produit1",50,"magasin1","2024-01-01","101-magasin1-45292",3,""]
[101,"Produit1",100,"magasin1","2024-05-01","101-magasin1-45413",1,""]
[101,"Produit1",0,"magasin1","2024-01-01","101-magasin1-45292",3,"Yes"]
[100,"Produit",0,"magasin","2024-05-01",{"$f":"A7 & \"-\" & D7 & \"-\"  & E7","v":"100-magasin-45413"},1,{"$f":"IF(G7=0,\"\",IF(C7=0,\"Yes\",\"\"))","v":"Yes"}]
[100,"Produit",0,"magasin","2024-01-01",{"$f":"A8 & \"-\" & D8 & \"-\"  & E8","v":"100-magasin-45292"},1,{"$f":"IF(G8=0,\"\",IF(C8=0,\"Yes\",\"\"))","v":"Yes"}]
[101,"Produit1",0,"magasin1","2024-01-01","101-magasin1-45292",3,"Yes"]
[101,"Produit1",0,"magasin1","2024-05-01","101-magasin1-45413",1,"Yes"]
[101,"Produit1",0,"magasin1","2024-01-01","101-magasin1-45292",3,"Yes"]

{"sheet":"كود السائل الأخير","index":2,"n_rows":11,"n_cols":5,"rows_kept":11,"cut":false,"hidden":false,"merged":[]}
["Code ","Nom du Produit","Quantité en stock ","Nom du magasin ","Date de fin d'un article"]
[100,"Produit",12,"magasin","2024-05-01"]
[100,"Produit",0,"magasin","2024-01-01"]
[101,"Produit1",50,"magasin1","2024-01-01"]
[101,"Produit1",100,"magasin1","2024-05-01"]
[101,"Produit1",0,"magasin1","2024-01-01"]
[100,"Produit",0,"magasin","2024-05-01"]
[100,"Produit",0,"magasin","2024-01-01"]
[101,"Produit1",0,"magasin1","2024-01-01"]
[101,"Produit1",0,"magasin1","2024-05-01"]
[101,"Produit1",0,"magasin1","2024-01-01"]

{"sheet":"النتيجة المطلوبة بعد التصحيح","index":3,"n_rows":5,"n_cols":5,"rows_kept":5,"cut":false,"hidden":false,"merged":[]}
["Code ","Nom du Produit","Quantité en stock ","Nom du magasin ","Date de fin d'un article"]
[100,"Produit",12,"magasin","2024-05-01"]
[100,"Produit",0,"magasin","2024-01-01"]
[101,"Produit1",50,"magasin1","2024-01-01"]
[101,"Produit1",100,"magasin1","2024-05-01"]

{"sheet":"السجلات قبل التصحيح","index":4,"n_rows":11,"n_cols":8,"rows_kept":11,"cut":false,"hidden":false,"merged":[]}
["Code ","Nom du Produit","Quantité en stock ","Nom du magasin ","Date de fin d'un article","Key","Dup","Del"]
[100,"Produit",12,"magasin","2024-05-01",{"$f":"A2 & \"-\" & D2 & \"-\"  & E2","v":"100-magasin-45413"},{"$f":"COUNTIF(F:F,F2) - 1","v":1},{"$f":"IF(G2=0,\"\",IF(C2=0,\"Yes\",\"\"))","v":""}]
[100,"Produit",0,"magasin","2024-01-01",{"$f":"A3 & \"-\" & D3 & \"-\"  & E3","v":"100-magasin-45292"},1,{"$f":"IF(G3=0,\"\",IF(C3=0,\"Yes\",\"\"))","v":"Yes"}]
[101,"Produit1",50,"magasin1","2024-01-01","101-magasin1-45292",3,""]
[101,"Produit1",100,"magasin1","2024-05-01","101-magasin1-45413",1,""]
[101,"Produit1",0,"magasin1","2024-01-01","101-magasin1-45292",3,"Yes"]
[100,"Produit",0,"magasin","2024-05-01",{"$f":"A7 & \"-\" & D7 & \"-\"  & E7","v":"100-magasin-45413"},1,{"$f":"IF(G7=0,\"\",IF(C7=0,\"Yes\",\"\"))","v":"Yes"}]
[100,"Produit",0,"magasin","2024-01-01",{"$f":"A8 & \"-\" & D8 & \"-\"  & E8","v":"100-magasin-45292"},1,{"$f":"IF(G8=0,\"\",IF(C8=0,\"Yes\",\"\"))","v":"Yes"}]
[101,"Produit1",0,"magasin1","2024-01-01","101-magasin1-45292",3,"Yes"]
[101,"Produit1",0,"magasin1","2024-05-01","101-magasin1-45413",1,"Yes"]
[101,"Produit1",0,"magasin1","2024-01-01","101-magasin1-45292",3,"Yes"]