{"text_format":"1","workbook":"xlsx","n_sheets":2,"sheets":["السجل","استدعاء"],"not_rendered":{"charts":0,"images":0,"macros":0,"external_links":0,"defined_names":6,"comments":0,"pivot_tables":0},"unopened":[],"bounds":{"document_bytes":16777216,"sheet_cells":100000,"rows_first":2000,"rows_last":500,"rows_between":2000,"halvings":0,"cell_chars":16384,"cell_head_chars":4096},"cells_cut":0,"cells_raw":0,"read":"whole","date_system":"1900"}

{"sheet":"السجل","index":0,"n_rows":11,"n_cols":30,"rows_kept":11,"cut":false,"hidden":false,"merged":[]}
["ت","الاسم الكامل","الاسم","اسم الاب","اسم الجد","اسم اب الجد","االقب","تاريخ الميلاد","محل الولادة","اسم الأم الثلاثي","اسم الام","اسم اب الام","اسم جد الام","اسم الزوج/الزوجة الثلاثي","اسم الزوج/الزوجة","اسم اب الزوج/الزوجة","اسم جد الزوج/الزوجة","دائرة الاحوال","رقم الهوية /البطاقة الوطنية","السجل","الصحيفة","المحافظة","الحي","المحلة","الزقاق","رقم الدار","اقرب نقطة دالة","رقم التموينية","الحالة","هل لديه ملف امني"]
[1,"علي",null,null,null,null,null,"1975-05-04","الحي","خالده عباس كريم",null,null,null,"اعزب",null,null,null,"بلا",11,9456,"بلا","الأولى","الرياض"]
[2,"احمد",null,null,null,null,null,"1988-08-27","الحي","خالده عباس كريم",null,null,null,"اعزب",null,null,null,"بلا",12,"بلا","بلا","الأولى","الرياض"]
[3,"يونس",null,null,null,null,null,"1990-10-31","الحي","خالده عباس كريم",null,null,null,"اعزب",null,null,null,"بلا",13,"بلا","بلا","الأولى","الرياض"]
[4,"صالح",null,null,null,null,null,"1973-01-31","الحي","خالده عباس كريم",null,null,null,"اعزب",null,null,null,"بلا",14,"بلا","بلا","الأولى","الرياض"]
[5,"خليل",null,null,null,null,null,"1982-11-28","الحي","خالده عباس كريم",null,null,null,"اعزب",null,null,null,"بلا",15,"بلا","بلا","الأولى","الرياض"]
[6,"فاضل",null,null,null,null,null,"1982-03-14","الحي","خالده عباس كريم",null,null,null,"اعزب",null,null,null,"بلا",16,"بلا","بلا","الأولى","الرياض"]
[7,"إبراهيم",null,null,null,null,null,"1966-10-01","الحي","خالده عباس كريم",null,null,null,"اعزب",null,null,null,"بلا",17,"بلا","بلا","الأولى","الرياض"]
[8,"محمد",null,null,null,null,null,"1983-08-19","الحي","خالده عباس كريم",null,null,null,"اعزب",null,null,null,"بلا",18,"بلا","بلا","الأولى","الرياض"]
[9,"ناظم",null,null,null,null,null,"1977-12-28","الحي","خالده عباس كريم",null,null,null,"اعزب",null,null,null,"بلا",19,"بلا","بلا","الأولى","الرياض"]
[10,"سلمان",null,null,null,null,null,"1977-04-20","الحي","خالده عباس كريم",null,null,null,"اعزب",null,null,null,"بلا",20,"بلا","بلا","الأولى","الرياض"]

{"sheet":"استدعاء","index":1,"n_rows":18,"n_cols":8,"rows_kept":18,"cut":false,"hidden":false,"merged":[[0,2,0,5],[5,3,5,4],[7,1,7,2],[21,5,21,7]]}
[]
[]
[]
[]
[]
[]
[]
["الاسم","علي"]
[]
["تاريخ الميلاد","محل الولادة","اسم الأم الثلاثي","اسم الزوج/الزوجة الثلاثي","دائرة الاحوال","رقم الهوية /البطاقة الوطنية","السجل","الصحيفة"]
[{"$f":"VLOOKUP($B$8,السجل!$B$1:$BL$3783,MATCH($A$10,السجل!$B$1:$BL$1,0),0)","v":"1975-05-04"},{"$f":"VLOOKUP($B$8,السجل!$B$1:$BL$3783,MATCH($B$10,السجل!$B$1:$BL$1,0),0)","v":"الحي"},{"$f":"VLOOKUP($B$8,السجل!$B$1:$BL$3783,MATCH($C$10,السجل!$B$1:$BL$1,0),0)","v":"خالده عباس كريم"},{"$f":"VLOOKUP($B$8,السجل!$B$1:$BL$3783,MATCH($D$10,السجل!$B$1:$BL$1,0),0)","v":"اعزب"},{"$f":"VLOOKUP($B$8,السجل!$B$1:$BL$3783,MATCH($E$10,السجل!$B$1:$BL$1,0),0)","v":"بلا"},{"$f":"VLOOKUP($B$8,السجل!$B$1:$BL$3783,MATCH($F$10,السجل!$B$1:$BL$1,0),0)","v":11},{"$f":"VLOOKUP($B$8,السجل!$B$1:$BL$3783,MATCH($G$10,السجل!$B$1:$BL$1,0),0)","v":9456},{"$f":"VLOOKUP($B$8,السجل!$B$1:$BL$3783,MATCH($H$10,السجل!$B$1:$BL$1,0),0)","v":"بلا"}]
["2024-01-01",null,null,"متزوج",null,null,null,555]
["المحافظة","الحي","المحلة","الزقاق","رقم الدار","اقرب نقطة دالة","رقم التموينية","الحالة"]
[{"$f":"VLOOKUP($B$8,السجل!$B$1:$BL$3783,MATCH($A$13,السجل!$B$1:$BL$1,0),0)","v":"الأولى"},{"$f":"VLOOKUP($B$8,السجل!$B$1:$BL$3783,MATCH($B$13,السجل!$B$1:$BL$1,0),0)","v":"الرياض"},{"$f":"VLOOKUP($B$8,السجل!$B$1:$BL$3783,MATCH($C$13,السجل!$B$1:$BL$1,0),0)","v":0},{"$f":"VLOOKUP($B$8,السجل!$B$1:$BL$3783,MATCH($D$13,السجل!$B$1:$BL$1,0),0)","v":0},{"$f":"VLOOKUP($B$8,السجل!$B$1:$BL$3783,MATCH($E$13,السجل!$B$1:$BL$1,0),0)","v":0},{"$f":"VLOOKUP($B$8,السجل!$B$1:$BL$3783,MATCH($F$13,السجل!$B$1:$BL$1,0),0)","v":0},{"$f":"VLOOKUP($B$8,السجل!$B$1:$BL$3783,MATCH($G$13,السجل!$B$1:$BL$1,0),0)","v":0},{"$f":"VLOOKUP($B$8,السجل!$B$1:$BL$3783,MATCH($H$13,السجل!$B$1:$BL$1,0),0)","v":0}]
[]
["هل لديه ملف امني"]
[{"$f":"VLOOKUP($B$8,السجل!$B$1:$BL$3783,MATCH($A$16,السجل!$B$1:$BL$1,0),0)","v":0}]
["نعم"]