{"text_format":"1","workbook":"xlsx","n_sheets":4,"sheets":["بيانات أساسية","اللجان","الطلبة","مناداة"],"not_rendered":{"charts":0,"images":2,"macros":1,"external_links":1,"defined_names":5,"comments":0,"pivot_tables":0},"unopened":[],"bounds":{"document_bytes":16777216,"sheet_cells":100000,"rows_first":2000,"rows_last":500,"rows_between":2000,"halvings":0,"cell_chars":16384,"cell_head_chars":4096},"cells_cut":0,"cells_raw":0,"read":"whole","date_system":"1900"}

{"sheet":"بيانات أساسية","index":0,"n_rows":19,"n_cols":4,"rows_kept":19,"cut":false,"hidden":false,"merged":[[1,3,1,5],[10,0,10,2],[13,0,13,2],[11,0,11,2],[12,3,12,5],[12,0,12,2],[11,3,11,5],[10,3,10,5],[8,0,8,2],[5,0,5,2],[9,0,9,2],[9,3,9,5],[8,3,8,5],[6,3,6,5],[4,3,4,5],[5,3,5,5],[3,3,3,5],[7,3,7,5],[3,0,3,2],[4,0,4,2],[6,0,6,2],[7,0,7,2],[16,0,16,2],[13,3,13,5],[14,3,14,5],[14,0,14,2],[16,3,16,5],[15,0,15,2],[15,3,15,5]]}
[]
[null,null,null,"ادخل  البيانات  أولا"]
[]
["المحافظة "]
["الإدارة ",null,null,"إدارة قويسنا التعليمية"]
["المدرسة ",null,null,"مدرسة عرب الرمل الإبتدائية سكة حديد"]
["القسم"]
["رئيس الكنترول",null,null,"أ/ محـــمد سعيـــد"]
["رئيس اللجــنة",null,null,"أ/عزه البدرى"]
["رئيس لجنة سير الامتحان",null,null,333333]
[" وكيل شئون الطلبة ",null,null,44444444]
["مسئول الحاسب",null,null,555555]
["امتحان",null,null,"امتحان الفصل الدراسى الأول"]
["الصف ",null,null,"الصف الرابع"]
["السنة الدراسية",null,null,"الفصل الدراسى الأول 2025/2024"]
[]
["تاريخ امتحان الدور الثانى"]
[]
[null,null,null," "]

{"sheet":"اللجان","index":1,"n_rows":44,"n_cols":12,"rows_kept":44,"cut":false,"hidden":false,"merged":[[2,2,2,3],[2,1,3,1],[1,3,1,4],[0,8,0,14]]}
[null,null,null,null,null,null,null,null,"اكتب فى الخلايا ذات اللون الابيض فقط"]
[null,null,null,{"$f":"'بيانات أساسية'!$D$14","v":"الصف الرابع"}]
[null,"م","اكتب أول رقم جلوس هنا",null,{"$f":"SUM(E5:E44)","v":119},{"$f":"COUNT(F5:F44)","v":6},null,null,null,"مقيد","موزع","متبقى"]
[null,null,null,"إلى","عدد الطلبه فى اللجنه","رقم اللجنة","الصف","الدمج",null,{"$f":"COUNTA(الطلبة!C5:C487)","v":119},{"$f":"SUM(E5:E44)","v":119},{"$f":"J4-K4","v":0}]
[null,{"$f":"IF(C5=\"\",\"\",COUNT($C$5:C5))","v":1},301,{"$f":"IF(E5=\"\",\"\",C5+E5-1)","v":320},20,{"$f":"IF(C5=\"\",\"\",COUNT($C$5:C5))","v":1},"الرابع"]
[null,{"$f":"IF(C6=\"\",\"\",COUNT($C$5:C6))","v":2},{"$f":"IF(E6=\"\",\"\",D5+1)","v":321},340,20,{"$f":"IF(C6=\"\",\"\",COUNT($C$5:C6))","v":2},{"$f":"G5","v":"الرابع"},"1ب"]
[null,{"$f":"IF(C7=\"\",\"\",COUNT($C$5:C7))","v":3},{"$f":"IF(E7=\"\",\"\",D6+1)","v":341},360,20,{"$f":"IF(C7=\"\",\"\",COUNT($C$5:C7))","v":3},{"$f":"G6","v":"الرابع"}]
[null,{"$f":"IF(C8=\"\",\"\",COUNT($C$5:C8))","v":4},{"$f":"IF(E8=\"\",\"\",D7+1)","v":361},380,20,{"$f":"IF(C8=\"\",\"\",COUNT($C$5:C8))","v":4},{"$f":"G7","v":"الرابع"}]
[null,{"$f":"IF(C9=\"\",\"\",COUNT($C$5:C9))","v":5},{"$f":"IF(E9=\"\",\"\",D8+1)","v":381},400,20,{"$f":"IF(C9=\"\",\"\",COUNT($C$5:C9))","v":5},{"$f":"G8","v":"الرابع"},"1ب"]
[null,{"$f":"IF(C10=\"\",\"\",COUNT($C$5:C10))","v":6},{"$f":"IF(E10=\"\",\"\",D9+1)","v":401},419,19,{"$f":"IF(C10=\"\",\"\",COUNT($C$5:C10))","v":6},{"$f":"G9","v":"الرابع"}]
[null,{"$f":"IF(C11=\"\",\"\",COUNT($C$5:C11))","v":""},{"$f":"IF(E11=\"\",\"\",D10+1)","v":""},{"$f":"IF(E11=\"\",\"\",C11+E11-1)","v":""},null,{"$f":"IF(C11=\"\",\"\",COUNT($C$5:C11))","v":""}]
[null,{"$f":"IF(C12=\"\",\"\",COUNT($C$5:C12))","v":""},"","",null,{"$f":"IF(C12=\"\",\"\",COUNT($C$5:C12))","v":""}]
[null,{"$f":"IF(C13=\"\",\"\",COUNT($C$5:C13))","v":""},"","",null,{"$f":"IF(C13=\"\",\"\",COUNT($C$5:C13))","v":""}]
[null,{"$f":"IF(C14=\"\",\"\",COUNT($C$5:C14))","v":""},"","",null,{"$f":"IF(C14=\"\",\"\",COUNT($C$5:C14))","v":""}]
[null,{"$f":"IF(C15=\"\",\"\",COUNT($C$5:C15))","v":""},"","",null,{"$f":"IF(C15=\"\",\"\",COUNT($C$5:C15))","v":""}]
[null,{"$f":"IF(C16=\"\",\"\",COUNT($C$5:C16))","v":""},"","",null,{"$f":"IF(C16=\"\",\"\",COUNT($C$5:C16))","v":""}]
[null,{"$f":"IF(C17=\"\",\"\",COUNT($C$5:C17))","v":""},"","",null,{"$f":"IF(C17=\"\",\"\",COUNT($C$5:C17))","v":""}]
[null,{"$f":"IF(C18=\"\",\"\",COUNT($C$5:C18))","v":""},"","",null,{"$f":"IF(C18=\"\",\"\",COUNT($C$5:C18))","v":""}]
[null,{"$f":"IF(C19=\"\",\"\",COUNT($C$5:C19))","v":""},"","",null,{"$f":"IF(C19=\"\",\"\",COUNT($C$5:C19))","v":""}]
[null,{"$f":"IF(C20=\"\",\"\",COUNT($C$5:C20))","v":""},"","",null,{"$f":"IF(C20=\"\",\"\",COUNT($C$5:C20))","v":""}]
[null,{"$f":"IF(C21=\"\",\"\",COUNT($C$5:C21))","v":""},"","",null,{"$f":"IF(C21=\"\",\"\",COUNT($C$5:C21))","v":""}]
[null,{"$f":"IF(C22=\"\",\"\",COUNT($C$5:C22))","v":""},"","",null,{"$f":"IF(C22=\"\",\"\",COUNT($C$5:C22))","v":""}]
[null,{"$f":"IF(C23=\"\",\"\",COUNT($C$5:C23))","v":""},"","",null,{"$f":"IF(C23=\"\",\"\",COUNT($C$5:C23))","v":""}]
[null,{"$f":"IF(C24=\"\",\"\",COUNT($C$5:C24))","v":""},"","",null,{"$f":"IF(C24=\"\",\"\",COUNT($C$5:C24))","v":""}]
[null,{"$f":"IF(C25=\"\",\"\",COUNT($C$5:C25))","v":""},"","",null,{"$f":"IF(C25=\"\",\"\",COUNT($C$5:C25))","v":""}]
[null,{"$f":"IF(C26=\"\",\"\",COUNT($C$5:C26))","v":""},"","",null,{"$f":"IF(C26=\"\",\"\",COUNT($C$5:C26))","v":""}]
[null,{"$f":"IF(C27=\"\",\"\",COUNT($C$5:C27))","v":""},"","",null,{"$f":"IF(C27=\"\",\"\",COUNT($C$5:C27))","v":""}]
[null,{"$f":"IF(C28=\"\",\"\",COUNT($C$5:C28))","v":""},"","",null,{"$f":"IF(C28=\"\",\"\",COUNT($C$5:C28))","v":""}]
[null,{"$f":"IF(C29=\"\",\"\",COUNT($C$5:C29))","v":""},"","",null,{"$f":"IF(C29=\"\",\"\",COUNT($C$5:C29))","v":""}]
[null,{"$f":"IF(C30=\"\",\"\",COUNT($C$5:C30))","v":""},"","",null,{"$f":"IF(C30=\"\",\"\",COUNT($C$5:C30))","v":""}]
[null,{"$f":"IF(C31=\"\",\"\",COUNT($C$5:C31))","v":""},"","",null,{"$f":"IF(C31=\"\",\"\",COUNT($C$5:C31))","v":""}]
[null,{"$f":"IF(C32=\"\",\"\",COUNT($C$5:C32))","v":""},"","",null,{"$f":"IF(C32=\"\",\"\",COUNT($C$5:C32))","v":""}]
[null,{"$f":"IF(C33=\"\",\"\",COUNT($C$5:C33))","v":""},"","",null,{"$f":"IF(C33=\"\",\"\",COUNT($C$5:C33))","v":""}]
[null,{"$f":"IF(C34=\"\",\"\",COUNT($C$5:C34))","v":""},"","",null,{"$f":"IF(C34=\"\",\"\",COUNT($C$5:C34))","v":""}]
[null,{"$f":"IF(C35=\"\",\"\",COUNT($C$5:C35))","v":""},"","",null,{"$f":"IF(C35=\"\",\"\",COUNT($C$5:C35))","v":""}]
[null,{"$f":"IF(C36=\"\",\"\",COUNT($C$5:C36))","v":""},"","",null,{"$f":"IF(C36=\"\",\"\",COUNT($C$5:C36))","v":""}]
[null,{"$f":"IF(C37=\"\",\"\",COUNT($C$5:C37))","v":""},"","",null,{"$f":"IF(C37=\"\",\"\",COUNT($C$5:C37))","v":""}]
[null,{"$f":"IF(C38=\"\",\"\",COUNT($C$5:C38))","v":""},"","",null,{"$f":"IF(C38=\"\",\"\",COUNT($C$5:C38))","v":""}]
[null,{"$f":"IF(C39=\"\",\"\",COUNT($C$5:C39))","v":""},"","",null,{"$f":"IF(C39=\"\",\"\",COUNT($C$5:C39))","v":""}]
[null,{"$f":"IF(C40=\"\",\"\",COUNT($C$5:C40))","v":""},"","",null,{"$f":"IF(C40=\"\",\"\",COUNT($C$5:C40))","v":""}]
[null,{"$f":"IF(C41=\"\",\"\",COUNT($C$5:C41))","v":""},"","",null,{"$f":"IF(C41=\"\",\"\",COUNT($C$5:C41))","v":""}]
[null,{"$f":"IF(C42=\"\",\"\",COUNT($C$5:C42))","v":""},"","",null,{"$f":"IF(C42=\"\",\"\",COUNT($C$5:C42))","v":""}]
[null,{"$f":"IF(C43=\"\",\"\",COUNT($C$5:C43))","v":""},"","",null,{"$f":"IF(C43=\"\",\"\",COUNT($C$5:C43))","v":""}]
[null,{"$f":"IF(C44=\"\",\"\",COUNT($C$5:C44))","v":""},"","",null,{"$f":"IF(C44=\"\",\"\",COUNT($C$5:C44))","v":""}]

{"sheet":"الطلبة","index":2,"n_rows":604,"n_cols":15,"rows_kept":604,"cut":false,"hidden":false,"merged":[[1,6,1,10]]}
[]
["العدد",{"$f":"COUNT(I6A5:A604)","v":0},{"$f":"'بيانات أساسية'!D14","v":"الصف الرابع"},null,null,null,"ادخل  البيانات فى الأعمدة   B  C   D    فقط أولا "]
["أرقام الجلوس",{"$f":"MAX(اللجان!C5:D44)","v":419},null,null,null,null,null,null,null,null,null,null,null,null,"معادلة اكسل في العمود E7:E بشرط الاسم قي B7:Bلاستدعاء بيانات من شيت الطلبة من النطاق H5:H علما بان الأسماء في شين الطلبة في العمود C"]
["م","رقم الجلوس","الاسم",null,"اللجنة","نهاية اللجنة","نهاية الفصل","المجموعة","رقم اللجنه","أ","ب","ج"]
[{"$f":"IF(C5=\"\",\"\",COUNTA($C$5:C5))","v":1},{"$f":"اللجان!C5","v":301},"السيد ماهر السيد حسين غلوش",null,{"$f":"IF(B5=\"\",\"\",VLOOKUP(B5,أول_ز,4))","v":1},{"$f":"IF(E5=E6,\"\",\"نهاية اللجنة\")","v":""},{"$f":"IF(D5=D6,\"\",\"نهاية الفصل\")","v":""},"ب",1,{"$f":"COUNTIF($H$5:$H$24,\"أ\")","v":6},{"$f":"COUNTIF($H$5:$H$24,\"ب\")","v":8},{"$f":"COUNTIF($H$5:$H$24,\"ج\")","v":6}]
[{"$f":"IF(C6=\"\",\"\",COUNTA($C$5:C6))","v":2},{"$f":"IF(B5=\"\",\"\",IF(B5+1>$B$3,\"\",B5+1))","v":302},"إبراهيم حسن حسينى عبد الهادى ",null,1,{"$f":"IF(E6=E7,\"\",\"نهاية اللجنة\")","v":""},{"$f":"IF(D6=D7,\"\",\"نهاية الفصل\")","v":""},"ب",2,{"$f":"COUNTIF($H$25:$H$44,\"أ\")","v":7},{"$f":"COUNTIF($H$25:$H$44,\"ب\")","v":6},{"$f":"COUNTIF($H$25:$H$44,\"ج\")","v":6}]
[{"$f":"IF(C7=\"\",\"\",COUNTA($C$5:C7))","v":3},{"$f":"IF(B6=\"\",\"\",IF(B6+1>$B$3,\"\",B6+1))","v":303},"إياد عبد المحسن رمضان إمام نصر",null,1,"","","ج",3,{"$f":"COUNTIF($H$45:$H$64,\"أ\")","v":7},{"$f":"COUNTIF($H$45:$H$64,\"ب\")","v":7},{"$f":"COUNTIF($H$45:$H$64,\"ج\")","v":6}]
[{"$f":"IF(C8=\"\",\"\",COUNTA($C$5:C8))","v":4},{"$f":"IF(B7=\"\",\"\",IF(B7+1>$B$3,\"\",B7+1))","v":304},"إياد عمرو محمد عبد الفتاح حماد",null,1,"","","أ",4,{"$f":"COUNTIF($H$85:$H$104,\"أ\")","v":7},{"$f":"COUNTIF($H$65:$H$84,\"ب\")","v":7},{"$f":"COUNTIF($H$65:$H$84,\"ج\")","v":6}]
[{"$f":"IF(C9=\"\",\"\",COUNTA($C$5:C9))","v":5},305,"إياد محمد زايد عبدالرازق",null,1,"","","ب",5,{"$f":"COUNTIF($H$85:$H$104,\"أ\")","v":7},{"$f":"COUNTIF($H$85:$H$104,\"ب\")","v":6},{"$f":"COUNTIF($H$85:$H$104,\"ج\")","v":6}]
[{"$f":"IF(C10=\"\",\"\",COUNTA($C$5:C10))","v":6},306,"إياد محمد فتحى عبدالستار",null,1,"","","ج",6,{"$f":"COUNTIF($H$105:$H$123,\"أ\")","v":7},{"$f":"COUNTIF($H$105:$H$123,\"ب\")","v":6},{"$f":"COUNTIF($H$105:$H$123,\"ج\")","v":6}]
[{"$f":"IF(C11=\"\",\"\",COUNTA($C$5:C11))","v":7},307,"أحمد السيد محمد السيد أبو الفتوح",null,1,"","","أ"]
[{"$f":"IF(C12=\"\",\"\",COUNTA($C$5:C12))","v":8},308,"أحمد بلال عبدالسميع عبدالمنعم",null,1,"","","ب"]
[{"$f":"IF(C13=\"\",\"\",COUNTA($C$5:C13))","v":9},309,"أحمد حسام عطيه المغازى أبو زيد",null,1,"","","ج"]
[{"$f":"IF(C14=\"\",\"\",COUNTA($C$5:C14))","v":10},310,"أحمد رامى محمود محمد",null,1,"","","أ"]
[{"$f":"IF(C15=\"\",\"\",COUNTA($C$5:C15))","v":11},311,"أحمد رضا محمد على جلاله",null,1,"","","ب"]
[{"$f":"IF(C16=\"\",\"\",COUNTA($C$5:C16))","v":12},312,"أحمد عبدالحميد أحمد الحنفي",null,1,"","","ج"]
[{"$f":"IF(C17=\"\",\"\",COUNTA($C$5:C17))","v":13},313,"أحمد متولى احمد متولى",null,1,"","","أ"]
[{"$f":"IF(C18=\"\",\"\",COUNTA($C$5:C18))","v":14},314,"أحمد محمد عبدالعزيز محمد عبدالغنى",null,1,"","","ب"]
[{"$f":"IF(C19=\"\",\"\",COUNTA($C$5:C19))","v":15},315,"أحمد هانى صلاح الدين غنيم",null,1,"","","ج"]
[{"$f":"IF(C20=\"\",\"\",COUNTA($C$5:C20))","v":16},316,"أنس مصطفى عبد ربه عبد اللطيف",null,1,"","","أ"]
[{"$f":"IF(C21=\"\",\"\",COUNTA($C$5:C21))","v":17},317,"آدم عصام الحفنى عبدالمعطي",null,1,"","","ب"]
[{"$f":"IF(C22=\"\",\"\",COUNTA($C$5:C22))","v":18},318,"آدم عمرو الصادق المرادى",null,1,"","","ج"]
[{"$f":"IF(C23=\"\",\"\",COUNTA($C$5:C23))","v":19},319,"آدم محمد السيد عبدالمنعم العليمي",null,1,"","","أ"]
[{"$f":"IF(C24=\"\",\"\",COUNTA($C$5:C24))","v":20},320,"حسام محمد حسام الدين محمود",null,1,"نهاية اللجنة","","ب"]
[{"$f":"IF(C25=\"\",\"\",COUNTA($C$5:C25))","v":21},321,"حمزة عبد الفتاح أحمد عبد الفتاح",null,2,{"$f":"IF(E25=E26,\"\",\"نهاية اللجنة\")","v":""},"","أ"]
[{"$f":"IF(C26=\"\",\"\",COUNTA($C$5:C26))","v":22},322,"خالد السعيد مسعد السعيد سيد أحمد",null,2,"","","ب"]
[{"$f":"IF(C27=\"\",\"\",COUNTA($C$5:C27))","v":23},323,"رأفت ربيع رضوان محمد الهادى ",null,2,"","","ج"]
[{"$f":"IF(C28=\"\",\"\",COUNTA($C$5:C28))","v":24},324,"رحيم ربيع رضوان محمد الهادى ",null,2,"","","أ"]
[{"$f":"IF(C29=\"\",\"\",COUNTA($C$5:C29))","v":25},325,"زياد احمد عبدالتواب موسي",null,2,"","","دمج ب"]
[{"$f":"IF(C30=\"\",\"\",COUNTA($C$5:C30))","v":26},326,"زياد أمير أحمد موسى منتصر",null,2,"","","ج"]
[{"$f":"IF(C31=\"\",\"\",COUNTA($C$5:C31))","v":27},327,"سعد أحمد سعد توفيق",null,2,"","","أ"]
[{"$f":"IF(C32=\"\",\"\",COUNTA($C$5:C32))","v":28},328,"صبحى محمد صبحى عبدالرازق",null,2,"","","ب"]
[{"$f":"IF(C33=\"\",\"\",COUNTA($C$5:C33))","v":29},329,"صلاح محمود صلاح الدين غنيم",null,2,"","","ج"]
[{"$f":"IF(C34=\"\",\"\",COUNTA($C$5:C34))","v":30},330,"عبد الحليم عمرو عبد الحليم السيد",null,2,"","","أ"]
[{"$f":"IF(C35=\"\",\"\",COUNTA($C$5:C35))","v":31},331,"عبد الرحمن السيد عبد العزيز محمد ",null,2,"","","ب"]
[{"$f":"IF(C36=\"\",\"\",COUNTA($C$5:C36))","v":32},332,"عبد الرحمن عماد عاطف مكاوى ",null,2,"","","ج"]
[{"$f":"IF(C37=\"\",\"\",COUNTA($C$5:C37))","v":33},333,"عبد الرحمن محمد مسعد رمضان ",null,{"$f":"IF(B37=\"\",\"\",VLOOKUP(B37,أول_ز,4))","v":2},"","","أ"]
[{"$f":"IF(C38=\"\",\"\",COUNTA($C$5:C38))","v":34},334,"عبد العزيز محمد عبد العزيز موسى ",null,2,"","","ب"]
[{"$f":"IF(C39=\"\",\"\",COUNTA($C$5:C39))","v":35},335,"على عادل على محمد",null,2,"","","ج"]
[{"$f":"IF(C40=\"\",\"\",COUNTA($C$5:C40))","v":36},336,"عماد موسى إبراهيم موسى أحمد ",null,2,"","","أ"]
[{"$f":"IF(C41=\"\",\"\",COUNTA($C$5:C41))","v":37},337,"عمر احمد حامد زكى",null,2,"","","ب"]
[{"$f":"IF(C42=\"\",\"\",COUNTA($C$5:C42))","v":38},338,"عمر أحمد محمد محمد على",null,2,"","","ج"]
[{"$f":"IF(C43=\"\",\"\",COUNTA($C$5:C43))","v":39},339,"عمر علاء سلامة محمد الخضرى",null,2,"","","أ"]
[{"$f":"IF(C44=\"\",\"\",COUNTA($C$5:C44))","v":40},340,"فتحى محمود فتحى عواد فرج",null,2,"نهاية اللجنة","","ب"]
[{"$f":"IF(C45=\"\",\"\",COUNTA($C$5:C45))","v":41},341,"كامل محمد كامل الشريف",null,3,"","","أ"]
[{"$f":"IF(C46=\"\",\"\",COUNTA($C$5:C46))","v":42},342,"مالك السيد عبد المجيد السيد بكر",null,3,"","","ب"]
[{"$f":"IF(C47=\"\",\"\",COUNTA($C$5:C47))","v":43},343,"محمد احمد سمير احمد العليمي",null,3,"","","ج"]
[{"$f":"IF(C48=\"\",\"\",COUNTA($C$5:C48))","v":44},344,"محمد أحمد عبدالمنعم زايد محمد",null,3,"","","أ"]
[{"$f":"IF(C49=\"\",\"\",COUNTA($C$5:C49))","v":45},345,"محمد سمير عبدالحفيظ المهدى",null,3,"","","ب"]
[{"$f":"IF(C50=\"\",\"\",COUNTA($C$5:C50))","v":46},346,"محمد عبد الغنى معتمد عبد الغنى",null,3,"","","ج"]
[{"$f":"IF(C51=\"\",\"\",COUNTA($C$5:C51))","v":47},347,"محمد ماجد عبدالعزيز ابوالفتوح",null,3,"","","أ"]
[{"$f":"IF(C52=\"\",\"\",COUNTA($C$5:C52))","v":48},348,"محمد محمود السيد محمود",null,3,"","","ب"]
[{"$f":"IF(C53=\"\",\"\",COUNTA($C$5:C53))","v":49},349,"محمد محمود ذكي حماد",null,3,"","","ج"]
[{"$f":"IF(C54=\"\",\"\",COUNTA($C$5:C54))","v":50},350,"محمد هانى البيومي السيد سيد احمد",null,3,"","","أ"]
[{"$f":"IF(C55=\"\",\"\",COUNTA($C$5:C55))","v":51},351,"محمد هانى السيد محمد",null,3,"","","ب"]
[{"$f":"IF(C56=\"\",\"\",COUNTA($C$5:C56))","v":52},352,"محمد هانى محمد العليمى",null,3,"","","ج"]
[{"$f":"IF(C57=\"\",\"\",COUNTA($C$5:C57))","v":53},353,"محمد ياسر احمد موسى المرادى",null,3,"","","أ"]
[{"$f":"IF(C58=\"\",\"\",COUNTA($C$5:C58))","v":54},354,"محمود احمد محمد العليمى",null,3,"","","ب"]
[{"$f":"IF(C59=\"\",\"\",COUNTA($C$5:C59))","v":55},355,"محمود السيد ابراهيم مصيلحى",null,3,"","","ج"]
[{"$f":"IF(C60=\"\",\"\",COUNTA($C$5:C60))","v":56},356,"محمود محمد عبدالحفيظ مهدى ",null,3,"","","أ"]
{"$rows_left_out":545}
{"sheet":"مناداة","index":3,"n_rows":35,"n_cols":18,"rows_kept":35,"cut":false,"hidden":false,"merged":[[3,2,4,2],[3,7,4,7],[2,17,2,19]]}
[null,{"$f":"'بيانات أساسية'!$D5","v":"إدارة قويسنا التعليمية"},null,null,null,null,{"$f":"'بيانات أساسية'!$D5","v":"إدارة قويسنا التعليمية"},null,null,null,null,null,null,1,{"$f":"MAX(اللجان!B5:B44)","v":6},{"$f":"VLOOKUP(C4,اللجان!B5:F44,4)","v":20},{"$f":"VLOOKUP(H4,اللجان!B5:F44,4)","v":20}]
["عدد",{"$f":"'بيانات أساسية'!$D6","v":"مدرسة عرب الرمل الإبتدائية سكة حديد"},null,null,null,"عدد",{"$f":"'بيانات أساسية'!$D6","v":"مدرسة عرب الرمل الإبتدائية سكة حديد"}]
[{"$f":"COUNT(A6:A106)","v":20},{"$f":"'بيانات أساسية'!D15","v":"الفصل الدراسى الأول 2025/2024"},null,null,null,{"$f":"COUNT(F6:F106)","v":20},{"$f":"'بيانات أساسية'!D15","v":"الفصل الدراسى الأول 2025/2024"},null,null,null,null,null,null,null,null,null,null,{"$f":"الطلبة!$C$2","v":"الصف الرابع"}]
["دمج","        كشف مناداة لجنة رقم ",{"$f":"IF(N1>O1,\"\",N1)","v":1},null,null,"دمج",{"$f":"B4","v":"        كشف مناداة لجنة رقم "},{"$f":"IF(N1+1>O1,\"\",N1+1)","v":2}]
[{"$f":"COUNTIF(D7:D35,\"دمج*\")","v":0},{"$f":"'بيانات أساسية'!$D$14","v":"الصف الرابع"},null,null,null,{"$f":"COUNTIF(I7:I35,\"دمج*\")","v":1},{"$f":"'بيانات أساسية'!$D$14","v":"الصف الرابع"},null,null,null,null,null,"   "]
["م","اسم الطالب","رقم الجلوس",null,"رقم المجموعه","م","اسم الطالب","رقم الجلوس",null,"رقم المجموعه"]
[{"$f":"IF(P1=\"\",\"\",1)","v":1},{"$f":"IF(A7=\"\",\"\",VLOOKUP(C7,بيانات,2))","v":"السيد ماهر السيد حسين غلوش"},{"$f":"IF(C4=\"\",\"\",VLOOKUP(C4,اللجان!B5:F44,2))","v":301},{"$f":"IF(OR(B7=$M$10,B7=$M$11,B7=$M$12,B7=$M$13,B7=$M$14,B7=$M$15,B7=$M$16,B7=$M$17,B7=$M$18,B7=$M$19),\"دمج\",\"\")","v":""},{"$f":"IFERROR(VLOOKUP(B7, الطلبة!$C$5:$H$1000, 6, FALSE), \"\")","v":"ب"},{"$f":"IF(Q1=\"\",\"\",1)","v":1},{"$f":"IF(F7=\"\",\"\",VLOOKUP(H7,بيانات,2))","v":"حمزة عبد الفتاح أحمد عبد الفتاح"},{"$f":"IF(H4=\"\",\"\",VLOOKUP(H4,اللجان!B5:F44,2))","v":321},{"$f":"IF(OR(G7=$M$10,G7=$M$11,G7=$M$12,G7=$M$13,G7=$M$14,G7=$M$15,G7=$M$16,G7=$M$17,G7=$M$18,G7=$M$19),\"دمج\",\"\")","v":""},{"$f":"IFERROR(VLOOKUP(G7, الطلبة!$C$5:$H$1000, 6, FALSE), \"\")","v":"أ"}]
[{"$f":"IF(A7=\"\",\"\",IF(A7+1>$P$1,\"\",A7+1))","v":2},{"$f":"IF(A8=\"\",\"\",VLOOKUP(C8,بيانات,2))","v":"إبراهيم حسن حسينى عبد الهادى "},{"$f":"IF(A7=\"\",\"\",IF(A8=\"\",\"\",C7+1))","v":302},"",{"$f":"IFERROR(VLOOKUP(B8, الطلبة!$C$5:$H$1000, 6, FALSE), \"\")","v":"ب"},{"$f":"IF(F7=\"\",\"\",IF(F7+1>$Q$1,\"\",F7+1))","v":2},"خالد السعيد مسعد السعيد سيد أحمد",{"$f":"IF(F7=\"\",\"\",IF(F8=\"\",\"\",H7+1))","v":322},{"$f":"IF(OR(G8=$M$10,G8=$M$11,G8=$M$12,G8=$M$13,G8=$M$14,G8=$M$15,G8=$M$16,G8=$M$17,G8=$M$18,G8=$M$19),\"دمج\",\"\")","v":""},{"$f":"IFERROR(VLOOKUP(G8, الطلبة!$C$5:$H$1000, 6, FALSE), \"\")","v":"ب"},null,null,"يتم تظليل طلبة الدمج التاليين عند ظهورهما بكشف المناداه ويختفى التظليل بإختفاؤهم"]
[3,{"$f":"IF(A9=\"\",\"\",VLOOKUP(C9,بيانات,2))","v":"إياد عبد المحسن رمضان إمام نصر"},{"$f":"IF(A8=\"\",\"\",IF(A9=\"\",\"\",C8+1))","v":303},"",{"$f":"IFERROR(VLOOKUP(B9, الطلبة!$C$5:$H$1000, 6, FALSE), \"\")","v":"ج"},3,"رأفت ربيع رضوان محمد الهادى ",{"$f":"IF(F8=\"\",\"\",IF(F9=\"\",\"\",H8+1))","v":323},"",{"$f":"IFERROR(VLOOKUP(G9, الطلبة!$C$5:$H$1000, 6, FALSE), \"\")","v":"ج"},null,null,"طلبة الدمج "]
[4,"إياد عمرو محمد عبد الفتاح حماد",304,"",{"$f":"IFERROR(VLOOKUP(B10, الطلبة!$C$5:$H$1000, 6, FALSE), \"\")","v":"أ"},4,"رحيم ربيع رضوان محمد الهادى ",324,"",{"$f":"IFERROR(VLOOKUP(G10, الطلبة!$C$5:$H$1000, 6, FALSE), \"\")","v":"أ"},null,null,"زياد احمد عبدالتواب موسي"]
[5,"إياد محمد زايد عبدالرازق",305,"",{"$f":"IFERROR(VLOOKUP(B11, الطلبة!$C$5:$H$1000, 6, FALSE), \"\")","v":"ب"},5,"زياد احمد عبدالتواب موسي",325,"دمج",{"$f":"IFERROR(VLOOKUP(G11, الطلبة!$C$5:$H$1000, 6, FALSE), \"\")","v":"دمج ب"},null,null,"ريتاج مصطفي محمد مصطفى علي "]
[6,"إياد محمد فتحى عبدالستار",306,"",{"$f":"IFERROR(VLOOKUP(B12, الطلبة!$C$5:$H$1000, 6, FALSE), \"\")","v":"ج"},6,"زياد أمير أحمد موسى منتصر",326,"",{"$f":"IFERROR(VLOOKUP(G12, الطلبة!$C$5:$H$1000, 6, FALSE), \"\")","v":"ج"},null,null,1]
[7,"أحمد السيد محمد السيد أبو الفتوح",{"$f":"IF(A12=\"\",\"\",IF(A13=\"\",\"\",C12+1))","v":307},"",{"$f":"IFERROR(VLOOKUP(B13, الطلبة!$C$5:$H$1000, 6, FALSE), \"\")","v":"أ"},7,"سعد أحمد سعد توفيق",327,{"$f":"IF(OR(G13=$M$10,G13=$M$11,G13=$M$12,G13=$M$13,G13=$M$14,G13=$M$15,G13=$M$16,G13=$M$17,G13=$M$18,G13=$M$19),\"دمج\",\"\")","v":""},{"$f":"IFERROR(VLOOKUP(G13, الطلبة!$C$5:$H$1000, 6, FALSE), \"\")","v":"أ"},null,null,1]
[8,"أحمد بلال عبدالسميع عبدالمنعم",308,"",{"$f":"IFERROR(VLOOKUP(B14, الطلبة!$C$5:$H$1000, 6, FALSE), \"\")","v":"ب"},8,"صبحى محمد صبحى عبدالرازق",328,"",{"$f":"IFERROR(VLOOKUP(G14, الطلبة!$C$5:$H$1000, 6, FALSE), \"\")","v":"ب"},null,null,1]
[9,"أحمد حسام عطيه المغازى أبو زيد",309,"",{"$f":"IFERROR(VLOOKUP(B15, الطلبة!$C$5:$H$1000, 6, FALSE), \"\")","v":"ج"},9,"صلاح محمود صلاح الدين غنيم",329,"",{"$f":"IFERROR(VLOOKUP(G15, الطلبة!$C$5:$H$1000, 6, FALSE), \"\")","v":"ج"},null,null,1]
[10,"أحمد رامى محمود محمد",310,"",{"$f":"IFERROR(VLOOKUP(B16, الطلبة!$C$5:$H$1000, 6, FALSE), \"\")","v":"أ"},10,"عبد الحليم عمرو عبد الحليم السيد",330,"",{"$f":"IFERROR(VLOOKUP(G16, الطلبة!$C$5:$H$1000, 6, FALSE), \"\")","v":"أ"},null,null,1]
[11,"أحمد رضا محمد على جلاله",311,"",{"$f":"IFERROR(VLOOKUP(B17, الطلبة!$C$5:$H$1000, 6, FALSE), \"\")","v":"ب"},11,"عبد الرحمن السيد عبد العزيز محمد ",331,"",{"$f":"IFERROR(VLOOKUP(G17, الطلبة!$C$5:$H$1000, 6, FALSE), \"\")","v":"ب"},null,null,1]
[12,"أحمد عبدالحميد أحمد الحنفي",312,"",{"$f":"IFERROR(VLOOKUP(B18, الطلبة!$C$5:$H$1000, 6, FALSE), \"\")","v":"ج"},12,"عبد الرحمن عماد عاطف مكاوى ",332,"",{"$f":"IFERROR(VLOOKUP(G18, الطلبة!$C$5:$H$1000, 6, FALSE), \"\")","v":"ج"},null,null,1]
[13,"أحمد متولى احمد متولى",313,"",{"$f":"IFERROR(VLOOKUP(B19, الطلبة!$C$5:$H$1000, 6, FALSE), \"\")","v":"أ"},13,"عبد الرحمن محمد مسعد رمضان ",333,"",{"$f":"IFERROR(VLOOKUP(G19, الطلبة!$C$5:$H$1000, 6, FALSE), \"\")","v":"أ"},null,null,1]
[14,"أحمد محمد عبدالعزيز محمد عبدالغنى",314,"",{"$f":"IFERROR(VLOOKUP(B20, الطلبة!$C$5:$H$1000, 6, FALSE), \"\")","v":"ب"},14,"عبد العزيز محمد عبد العزيز موسى ",334,{"$f":"IF(OR(G20=$M$10,G20=$M$11,G20=$M$12,G20=$M$13,G20=$M$14,G20=$M$15,G20=$M$16,G20=$M$17,G20=$M$18,G20=$M$19),\"دمج\",\"\")","v":""},{"$f":"IFERROR(VLOOKUP(G20, الطلبة!$C$5:$H$1000, 6, FALSE), \"\")","v":"ب"},null,null,1]
[15,"أحمد هانى صلاح الدين غنيم",315,"",{"$f":"IFERROR(VLOOKUP(B21, الطلبة!$C$5:$H$1000, 6, FALSE), \"\")","v":"ج"},15,"على عادل على محمد",335,"",{"$f":"IFERROR(VLOOKUP(G21, الطلبة!$C$5:$H$1000, 6, FALSE), \"\")","v":"ج"},null,null,1]
[16,"أنس مصطفى عبد ربه عبد اللطيف",316,"",{"$f":"IFERROR(VLOOKUP(B22, الطلبة!$C$5:$H$1000, 6, FALSE), \"\")","v":"أ"},16,"عماد موسى إبراهيم موسى أحمد ",336,"",{"$f":"IFERROR(VLOOKUP(G22, الطلبة!$C$5:$H$1000, 6, FALSE), \"\")","v":"أ"},null,null,1]
[17,"آدم عصام الحفنى عبدالمعطي",317,"",{"$f":"IFERROR(VLOOKUP(B23, الطلبة!$C$5:$H$1000, 6, FALSE), \"\")","v":"ب"},17,"عمر احمد حامد زكى",337,"",{"$f":"IFERROR(VLOOKUP(G23, الطلبة!$C$5:$H$1000, 6, FALSE), \"\")","v":"ب"},null,null,1]
[18,"آدم عمرو الصادق المرادى",318,"",{"$f":"IFERROR(VLOOKUP(B24, الطلبة!$C$5:$H$1000, 6, FALSE), \"\")","v":"ج"},18,"عمر أحمد محمد محمد على",338,"",{"$f":"IFERROR(VLOOKUP(G24, الطلبة!$C$5:$H$1000, 6, FALSE), \"\")","v":"ج"},null,null,1]
[19,"آدم محمد السيد عبدالمنعم العليمي",319,"",{"$f":"IFERROR(VLOOKUP(B25, الطلبة!$C$5:$H$1000, 6, FALSE), \"\")","v":"أ"},19,"عمر علاء سلامة محمد الخضرى",339,"",{"$f":"IFERROR(VLOOKUP(G25, الطلبة!$C$5:$H$1000, 6, FALSE), \"\")","v":"أ"},null,null,1]
[20,"حسام محمد حسام الدين محمود",320,"",{"$f":"IFERROR(VLOOKUP(B26, الطلبة!$C$5:$H$1000, 6, FALSE), \"\")","v":"ب"},20,"فتحى محمود فتحى عواد فرج",340,"",{"$f":"IFERROR(VLOOKUP(G26, الطلبة!$C$5:$H$1000, 6, FALSE), \"\")","v":"ب"},null,null,1]
["","","","",{"$f":"IFERROR(VLOOKUP(B27, الطلبة!$C$5:$H$1000, 6, FALSE), \"\")","v":""},"","","","",{"$f":"IFERROR(VLOOKUP(G27, الطلبة!$C$5:$H$1000, 6, FALSE), \"\")","v":""},null,null,1]
["","",{"$f":"IF(A27=\"\",\"\",IF(A28=\"\",\"\",C27+1))","v":""},"",{"$f":"IFERROR(VLOOKUP(B28, الطلبة!$C$5:$H$1000, 6, FALSE), \"\")","v":""},"","",{"$f":"IF(F27=\"\",\"\",IF(F28=\"\",\"\",H27+1))","v":""},"",{"$f":"IFERROR(VLOOKUP(G28, الطلبة!$C$5:$H$1000, 6, FALSE), \"\")","v":""},null,null,1]
["",{"$f":"IF(A29=\"\",\"\",VLOOKUP(C29,بيانات,2))","v":""},"","",{"$f":"IFERROR(VLOOKUP(B29, الطلبة!$C$5:$H$1000, 6, FALSE), \"\")","v":""},"","","","",{"$f":"IFERROR(VLOOKUP(G29, الطلبة!$C$5:$H$1000, 6, FALSE), \"\")","v":""}]
["",{"$f":"IF(A30=\"\",\"\",VLOOKUP(C30,بيانات,2))","v":""},"","",{"$f":"IFERROR(VLOOKUP(B30, الطلبة!$C$5:$H$1000, 6, FALSE), \"\")","v":""},"",{"$f":"IF(F30=\"\",\"\",VLOOKUP(H30,بيانات,2))","v":""},"","",{"$f":"IFERROR(VLOOKUP(G30, الطلبة!$C$5:$H$1000, 6, FALSE), \"\")","v":""}]
["",{"$f":"IF(A31=\"\",\"\",VLOOKUP(C31,بيانات,2))","v":""},"","",{"$f":"IFERROR(VLOOKUP(B31, الطلبة!$C$5:$H$1000, 6, FALSE), \"\")","v":""},"",{"$f":"IF(F31=\"\",\"\",VLOOKUP(H31,بيانات,2))","v":""},"","",{"$f":"IFERROR(VLOOKUP(G31, الطلبة!$C$5:$H$1000, 6, FALSE), \"\")","v":""}]
["",{"$f":"IF(A32=\"\",\"\",VLOOKUP(C32,بيانات,2))","v":""},"","",{"$f":"IFERROR(VLOOKUP(B32, الطلبة!$C$5:$H$1000, 6, FALSE), \"\")","v":""},"",{"$f":"IF(F32=\"\",\"\",VLOOKUP(H32,بيانات,2))","v":""},"",""]
["",{"$f":"IF(A33=\"\",\"\",VLOOKUP(C33,بيانات,2))","v":""},"",null,null,"",{"$f":"IF(F33=\"\",\"\",VLOOKUP(H33,بيانات,2))","v":""},"",""]
[null,{"$f":"'بيانات أساسية'!$A$9","v":"رئيس اللجــنة"},{"$f":"H34","v":0},{"$f":"IF(OR(B34=$M$10,B34=$M$11,B34=$M$12,B34=$M$13,B34=$M$14,B34=$M$15,B34=$M$16,B34=$M$17,B34=$M$18,B34=$M$19),\"دمج\",\"\")","v":""},null,null,{"$f":"'بيانات أساسية'!$A$9","v":"رئيس اللجــنة"},null,{"$f":"IF(OR(G34=$M$10,G34=$M$11,G34=$M$12,G34=$M$13,G34=$M$14,G34=$M$15,G34=$M$16,G34=$M$17,G34=$M$18,G34=$M$19),\"دمج\",\"\")","v":""}]
[null,{"$f":"'بيانات أساسية'!$D$9","v":"أ/عزه البدرى"},{"$f":"'بيانات أساسية'!$D$8","v":"أ/ محـــمد سعيـــد"},{"$f":"IF(OR(B35=$M$10,B35=$M$11,B35=$M$12,B35=$M$13,B35=$M$14,B35=$M$15,B35=$M$16,B35=$M$17,B35=$M$18,B35=$M$19),\"دمج\",\"\")","v":""},null,null,{"$f":"'بيانات أساسية'!$D$9","v":"أ/عزه البدرى"},{"$f":"'بيانات أساسية'!$D$8","v":"أ/ محـــمد سعيـــد"},{"$f":"IF(OR(G35=$M$10,G35=$M$11,G35=$M$12,G35=$M$13,G35=$M$14,G35=$M$15,G35=$M$16,G35=$M$17,G35=$M$18,G35=$M$19),\"دمج\",\"\")","v":""}]