{"text_format":"1","workbook":"xlsx","n_sheets":2,"sheets":["1","2"],"not_rendered":{"charts":0,"images":0,"macros":1,"external_links":0,"defined_names":1,"comments":0,"pivot_tables":0},"unopened":[],"bounds":{"document_bytes":16777216,"sheet_cells":100000,"rows_first":2000,"rows_last":500,"rows_between":2000,"halvings":0,"cell_chars":16384,"cell_head_chars":4096},"cells_cut":0,"cells_raw":0,"read":"whole","date_system":"1900"}

{"sheet":"1","index":0,"n_rows":14,"n_cols":32,"rows_kept":14,"cut":false,"hidden":false,"merged":[[1,5,3,5],[1,0,3,0],[1,1,3,1],[1,2,3,2],[1,3,3,3],[1,4,3,4],[1,6,1,7],[1,8,1,9],[1,10,1,11],[1,12,1,13],[1,14,1,15],[2,17,3,17],[2,19,3,19],[2,21,3,21],[2,23,3,23],[1,18,1,19],[1,20,1,21],[1,22,1,23],[1,16,1,17],[2,7,3,7],[2,9,3,9],[2,11,3,11],[2,13,3,13],[2,15,3,15],[2,25,3,25],[2,27,3,27],[2,29,3,29],[2,31,3,31],[1,30,1,31],[1,24,1,25],[1,26,1,27],[1,28,1,29]]}
[null,{"$f":"COUNTA(B5:B14)","v":10}]
["م","الاســــــــــــــم","رقم الجلوس","النوع","النتيجة","الفصل","لغة عربية",null,"رياضيات",null,"دراسات",null,"علوم",null,"لغة إنجليزية",null,"المجموع",null,"اختيارى1",null,"اختيارى2",null,"التربية الدينية",null,"التربية الفنية",null,"التربية الرياضية",null,"التربية الموسيقية",null,"الحاسب الآلى"]
[null,null,null,null,null,null,"الدرجة","التقدير","الدرجة","التقدير","الدرجة","التقدير","الدرجة","التقدير","الدرجة","التقدير","الدرجة","التقدير","الدرجة","التقدير","الدرجة","التقدير","الدرجة","التقدير","الدرجة","التقدير","الدرجة","التقدير","الدرجة","التقدير","الدرجة","التقدير"]
[null,null,null,null,null,null,80,null,60,null,40,null,40,null,60,null,280,null,20,null,20,null,40,null,20,null,20,null,20,null,20]
[1,"s1",1,"ذكر","له برنامج علاجى","1/1",73.599999999999994,"ممتاز",30.6,"دون المستوى",30.6,"جيد جداً",31.4,"جيد جداً",38.4,"مقبول",204.6,"جيد",20,"ممتاز",20,"ممتاز",36,"ممتاز",17.399999999999999,"ممتاز",20,"ممتاز",20,"ممتاز",12.8,"مقبول"]
[2,"s2",2,"ذكر","له برنامج علاجى","1/1",71.2,"ممتاز",33,"دون المستوى",27.2,"جيد",30.4,"جيد جداً",38.4,"مقبول",200.20000000000002,"جيد",20,"ممتاز",20,"ممتاز",34,"ممتاز",14.8,"جيد",20,"ممتاز",20,"ممتاز",13.6,"جيد"]
[3,"s3",3,"ذكر","له برنامج علاجى","1/1",72,"ممتاز",27,"دون المستوى",23.6,"مقبول",31.8,"جيد جداً",41.4,"جيد",195.8,"جيد",20,"ممتاز",20,"ممتاز",32,"جيد جداً",14.8,"جيد",20,"ممتاز",20,"ممتاز",12.4,"مقبول"]
[4,"s4",4,"ذكر","ناجح","1/1",75.2,"ممتاز",41.4,"جيد",28.2,"جيد",33.200000000000003,"جيد جداً",34.799999999999997,"مقبول",212.8,"جيد جداً",20,"ممتاز",20,"ممتاز",35.6,"ممتاز",16.2,"جيد جداً",20,"ممتاز",20,"ممتاز",14,"جيد"]
[5,"s5",5,"ذكر","ناجح","1/1",76,"ممتاز",49.2,"جيد جداً",30.6,"جيد جداً",32.4,"جيد جداً",48.6,"جيد جداً",236.8,"جيد جداً",20,"ممتاز",20,"ممتاز",34,"ممتاز",17.2,"ممتاز",20,"ممتاز",20,"ممتاز",14,"جيد"]
[6,"s6",6,"ذكر","له برنامج علاجى","1/1",63.2,"جيد جداً",29.4,"دون المستوى",19.399999999999999,"دون المستوى",30.8,"جيد جداً",29.4,"دون المستوى",172.20000000000002,"مقبول",20,"ممتاز",20,"ممتاز",32.200000000000003,"جيد جداً",14.4,"جيد",20,"ممتاز",20,"ممتاز",13.8,"جيد"]
[7,"s7",7,"ذكر","له برنامج علاجى","1/1",49.6,"مقبول",21,"دون المستوى",19.2,"دون المستوى",30.4,"جيد جداً",28.2,"دون المستوى",148.39999999999998,"مقبول",20,"ممتاز",20,"ممتاز",33.6,"جيد جداً",14.4,"جيد",20,"ممتاز",20,"ممتاز",14.4,"جيد"]
[8,"s8",8,"ذكر","ناجح","1/1",78.400000000000006,"ممتاز",37.799999999999997,"مقبول",34.799999999999997,"ممتاز",36.200000000000003,"ممتاز",33.6,"مقبول",220.79999999999998,"جيد جداً",20,"ممتاز",20,"ممتاز",30.8,"جيد جداً",15.8,"جيد جداً",20,"ممتاز",20,"ممتاز",14.6,"جيد"]
[9,"s9",9,"ذكر","ناجح","1/1",75.2,"ممتاز",46.8,"جيد جداً",38,"ممتاز",35.6,"ممتاز",43.8,"جيد",239.39999999999998,"ممتاز",20,"ممتاز",20,"ممتاز",35.200000000000003,"ممتاز",16.2,"جيد جداً",20,"ممتاز",20,"ممتاز",14.6,"جيد"]
[10,"s10",10,"ذكر","له برنامج علاجى","1/1",72,"ممتاز",33,"دون المستوى",25.8,"مقبول",31.2,"جيد جداً",34.799999999999997,"مقبول",196.8,"جيد",20,"ممتاز",20,"ممتاز",34,"ممتاز",15.4,"جيد جداً",20,"ممتاز",20,"ممتاز",14.4,"جيد"]

{"sheet":"2","index":1,"n_rows":44,"n_cols":21,"rows_kept":44,"cut":false,"hidden":false,"merged":[[16,2,16,3],[3,1,3,14],[4,2,4,3],[5,2,5,3],[9,1,9,2],[9,3,9,4],[10,1,10,4],[10,7,10,10],[11,1,11,4],[11,7,11,10],[11,12,11,14],[14,1,14,14],[15,2,15,3],[20,1,20,2],[20,3,20,4],[21,1,21,4],[21,7,21,10],[22,1,22,4],[22,7,22,10],[33,1,33,4],[33,7,33,10],[33,12,33,14],[36,1,36,14],[22,12,22,14],[25,1,25,14],[26,2,26,3],[27,2,27,3],[31,1,31,2],[31,3,31,4],[11,18,11,20],[44,1,44,4],[44,7,44,10],[44,12,44,14],[4,4,4,7],[15,4,15,7],[26,4,26,7],[37,4,37,7],[37,2,37,3],[38,2,38,3],[42,1,42,2],[42,3,42,4],[43,1,43,4],[43,7,43,10],[32,1,32,4],[32,7,32,10]]}
[null,null,null,null,null,null,null,1,null,null,null,null,null,null,null,null,null,null,null,null,{"$f":"'1'!B1","v":10}]
[null,null,null,null,null,null,null,null,null,null,"للعام الدراسى 2024/ 2025م",null,null,null,29]
[]
[null,"شهادة تقييم الفصل الدراسى الأول للصف الأول الإعدادي"]
[null,null,"اسم الطالب :",null,{"$f":"VLOOKUP(H1,'1'!A5:AF14,2,0)","v":"s1"},null,null,null,null,"",null,"glose",{"$f":"VLOOKUP($H$1,'1'!A5:AF14,3,0)","v":1},null,9]
[null,null,"الفصل : ",null,"",null,null,null,null,"للعام الدراسى 2024/ 2025م"]
[null,"المادة","لغة عربية","رياضيات","دراسات","علوم","لغة إنجليزية","المجموع","اختيارى1","اختيارى2","التربية الدينية","التربية الفنية","التربية الرياضية","التربية الموسيقية","الحاسب الآلى"]
[null,"الدرجة العظمى",80,60,40,40,60,280,20,20,40,20,20,20,20]
[null,"الدرجة",55,15,30,30,30,100,11,12,11,20,20,20,20]
[null,"نتيجة التلميذ : ",null,""]
[null,"مسئول الحاسب الآلى ",null,null,null,null,null,"رئيس الكنترول",null,null,null,null,null,"مدير المدرسة"]
[null,null,null,null,null,null,null,null,null,null,null,null,null,null,null,null,null,null,"للتوضيح فقط"]
[null,null,null,null,null,null,null,null,null,null,"للعام الدراسى 2024/ 2025م",null,null,null,30]
[]
[null,"شهادة تقييم الفصل الدراسى الأول للصف الأول الإعدادي"]
[null,null,"اسم الطالب :",null,{"$f":"VLOOKUP(H1+1,'1'!A5:AF14,2,0)","v":"s2"},null,null,null,null,null,null,"glose",{"$f":"VLOOKUP($H$1+1,'1'!A5:AF14,3,0)","v":2}]
[null,null,"الفصل : ",null,"1/1",null,null,null,null,"للعام الدراسى 2024/ 2025م"]
[null,"المادة","لغة عربية","رياضيات","دراسات","علوم","لغة إنجليزية","المجموع","اختيارى1","اختيارى2","التربية الدينية","التربية الفنية","التربية الرياضية","التربية الموسيقية","الحاسب الآلى"]
[null,"الدرجة العظمى",80,60,40,40,60,280,20,20,40,20,20,20,20]
[null,"الدرجة",73.599999999999994,30.6,30.6,31.4,38.4,204.6,20,20,36,17.399999999999999,20,20,12.8]
[null,"نتيجة التلميذ : ",null,"له برنامج علاجى"]
[null,"مسئول الحاسب الآلى ",null,null,null,null,null,"رئيس الكنترول",null,null,null,null,null,"مدير المدرسة"]
[]
[null,null,null,null,null,null,null,null,null,null,"للعام الدراسى 2024/ 2025م",null,null,null,31]
[]
[null,"شهادة تقييم الفصل الدراسى الأول للصف الأول الإعدادي"]
[null,null,"اسم الطالب :",null,{"$f":"VLOOKUP(H1+2,'1'!A5:AF14,2,0)","v":"s3"},null,null,null,null,null,null,"glose",{"$f":"VLOOKUP($H$1+2,'1'!A5:AF14,3,0)","v":3}]
[null,null,"الفصل : ",null,"1/1",null,null,null,null,"للعام الدراسى 2024/ 2025م"]
[null,"المادة","لغة عربية","رياضيات","دراسات","علوم","لغة إنجليزية","المجموع","اختيارى1","اختيارى2","التربية الدينية","التربية الفنية","التربية الرياضية","التربية الموسيقية","الحاسب الآلى"]
[null,"الدرجة العظمى",80,60,40,40,60,280,20,20,40,20,20,20,20]
[null,"الدرجة",71.2,33,27.2,30.4,38.4,200.20000000000002,20,20,34,14.8,20,20,13.6]
[null,"نتيجة التلميذ : ",null,"له برنامج علاجى"]
[null,"مسئول الحاسب الآلى ",null,null,null,null,null,"رئيس الكنترول",null,null,null,null,null,"مدير المدرسة"]
[]
[null,null,null,null,null,null,null,null,null,null,"للعام الدراسى 2024/ 2025م",null,null,null,32]
[]
[null,"شهادة تقييم الفصل الدراسى الأول للصف الأول الإعدادي"]
[null,null,"اسم الطالب :",null,{"$f":"VLOOKUP(H1+3,'1'!A5:AF14,2,0)","v":"s4"},null,null,null,null,null,null,"glose",{"$f":"VLOOKUP($H$1+3,'1'!A5:AF14,3,0)","v":4}]
[null,null,"الفصل : ",null,"1/1",null,null,null,null,"للعام الدراسى 2024/ 2025م"]
[null,"المادة","لغة عربية","رياضيات","دراسات","علوم","لغة إنجليزية","المجموع","اختيارى1","اختيارى2","التربية الدينية","التربية الفنية","التربية الرياضية","التربية الموسيقية","الحاسب الآلى"]
[null,"الدرجة العظمى",80,60,40,40,60,280,20,20,40,20,20,20,20]
[null,"الدرجة",72,27,23.6,31.8,41.4,195.8,20,20,32,14.8,20,20,12.4]
[null,"نتيجة التلميذ : ",null,"له برنامج علاجى"]
[null,"مسئول الحاسب الآلى ",null,null,null,null,null,"رئيس الكنترول",null,null,null,null,null,"مدير المدرسة"]