{"text_format":"1","workbook":"xlsx","n_sheets":6,"sheets":["STName","Monthly1","MidYear","Monthly2","FinalYear","الشهادة"],"not_rendered":{"charts":0,"images":0,"macros":1,"external_links":1,"defined_names":12,"comments":0,"pivot_tables":0},"unopened":[],"bounds":{"document_bytes":16777216,"sheet_cells":100000,"rows_first":2000,"rows_last":500,"rows_between":2000,"halvings":0,"cell_chars":16384,"cell_head_chars":4096},"cells_cut":0,"cells_raw":0,"read":"whole","date_system":"1900"}

{"sheet":"STName","index":0,"n_rows":36,"n_cols":17,"rows_kept":36,"cut":false,"hidden":false,"merged":[[0,0,0,17],[1,8,1,17],[1,0,1,7],[2,16,2,17],[2,13,2,15],[2,10,2,11],[2,7,2,8]]}
["اسم المدرسة"]
["Academic Year: 2024-2025",null,null,null,null,null,null,null,"Teacher:"]
[null,"2024-2025",null,null,null,null,null,"Moon",null,"A","Section:",null,null,"Grade 01",null,null,"Class:"]
[]
[]
[null,"اسم الطالب / أقصى علامة"]
[1,"اسم الطالب 1"]
[2,"اسم الطالب 2"]
[3,"اسم الطالب 3"]
[4,"اسم الطالب 4"]
[5,"اسم الطالب 5"]
[6,"اسم الطالب 6"]
[7,"اسم الطالب 7"]
[8,"اسم الطالب 8"]
[9,"اسم الطالب 9"]
[10,"اسم الطالب 10"]
[11,"اسم الطالب 11"]
[12,"اسم الطالب 12"]
[13,"اسم الطالب 13"]
[14,"اسم الطالب 14"]
[15,"اسم الطالب 15"]
[16,"اسم الطالب 16"]
[17,"اسم الطالب 17"]
[18,"اسم الطالب 18"]
[19,"اسم الطالب 19"]
[20,"اسم الطالب 20"]
[21]
[22]
[23]
[24]
[25]
[26]
[27]
[28]
[29]
[30]

{"sheet":"Monthly1","index":1,"n_rows":41,"n_cols":27,"rows_kept":41,"cut":false,"hidden":false,"merged":[[0,0,0,22],[1,2,1,4],[2,2,2,4],[2,5,2,7],[1,16,1,19],[2,16,2,19],[1,20,1,22],[2,20,2,22]]}
[{"$f":"[1]STName!A1","v":"International Lessing School"}]
[null,"الصــــــــــــــــــــف:",{"$f":"[1]STName!N3","v":"Grade 02"},null,null,null,null,null,null,null,null,null,null,null,null,null,"العـام الدراســـي:",null,null,null,{"$f":"[1]STName!B3","v":"2024-2025"}]
[null,"الشــــــــــــــــــــعبة:",{"$f":"[1]STName!J3","v":"A"},null,null,{"$f":"[1]STName!H3","v":"Moon"},null,null,null,null,null,null,null,null,null,null,"عــلامــات شـهر:",null,null,null,"Monthly1"]
[]
["الرقم","اسم الطالب","Reading","Grammar","Dictation","Comp + Conv","Poetry","Handwriting","Science","Mathematics","القراءة","القواعد","الإملاء","التعبير والمحادثة","المحفوظات","الخط","تربية مدنية","Sport","المجموع","المعدل","الترتيب","الفئة","النتيجة",null,null,"ترتيب تصاعدي"]
[null,"العلامة القصوى",20,20,20,20,10,10,20,20,20,20,20,20,10,10,10,10,{"$f":"IF(C6<>0,SUM(C6:R6),\"\")","v":260},20]
[{"$f":"IF(B7<>0,[1]STName!A7,\"\")","v":1},{"$f":"[1]STName!B7","v":"اسم الطالب 1"},8,16,13,13,2,7,14,20,12,19,19,2,7,6,7,7,{"$f":"IF(C7<>0,SUM(C7:R7),\"\")","v":172},{"$f":"IF(C7<>0,S7/13,\"\")","v":13.23076923076923},{"$f":"IF(C7<>0,RANK(T7,$T$7:$T$36),\"\")","v":14},{"$f":"IF(C7<>0,IF(T7>=15,\"A\",IF(T7>=12,\"B\",IF(T7>=10,\"C\",IF(T7>=7.5,\"D\",\"E\")))),\"\")","v":"B"},{"$f":"IF(C7<>0,IF(T7>=10,\"ناجح\",\"راسب\"),\"\")","v":"ناجح"},null,1,{"$f":"IF(B7=0,\"\",TOPTEN($S$7:$S$36,$B$7:$B$36,1,FALSE))","v":"اسم الطالب 13"},{"$f":"IF(C7=0,\"\",TOPTEN($S$7:$S$36,$B$7:$B$36,1,TRUE))","v":"الأول"}]
[{"$f":"IF(B8<>0,[1]STName!A8,\"\")","v":2},{"$f":"[1]STName!B8","v":"اسم الطالب 2"},12,19,19,15,7,7,2,2,2,5,2,1,7,7,7,7,121,9.3076923076923084,{"$f":"IF(C8<>0,RANK(T8,$T$7:$T$36),\"\")","v":19},{"$f":"IF(C8<>0,IF(T8>=15,\"A\",IF(T8>=12,\"B\",IF(T8>=10,\"C\",IF(T8>=7.5,\"D\",\"E\")))),\"\")","v":"D"},{"$f":"IF(C8<>0,IF(T8>=10,\"ناجح\",\"راسب\"),\"\")","v":"راسب"},null,2,{"$f":"IF(B8=0,\"\",TOPTEN($S$7:$S$36,$B$7:$B$36,2,FALSE))","v":"اسم الطالب 7"},{"$f":"IF(C8=0,\"\",TOPTEN($S$7:$S$36,$B$7:$B$36,2,TRUE))","v":"الثاني"}]
[{"$f":"IF(B9<>0,[1]STName!A9,\"\")","v":3},{"$f":"[1]STName!B9","v":"اسم الطالب 3"},14,20,19,15,7,7,20,20,12,20,20,15,7,6,7,7,216,16.615384615384617,4,"A","ناجح",null,3,{"$f":"IF(B9=0,\"\",TOPTEN($S$7:$S$36,$B$7:$B$36,3,FALSE))","v":"اسم الطالب 19"},{"$f":"IF(C9=0,\"\",TOPTEN($S$7:$S$36,$B$7:$B$36,3,TRUE))","v":"الثاني مكرر"}]
[{"$f":"IF(B10<>0,[1]STName!A10,\"\")","v":4},{"$f":"[1]STName!B10","v":"اسم الطالب 4"},6,12,11,12,5,5,9,8,9,12,10,6,6,5,7,7,130,10,17,"C","ناجح",null,4,{"$f":"IF(B10=0,\"\",TOPTEN($S$7:$S$36,$B$7:$B$36,4,FALSE))","v":"اسم الطالب 3"},{"$f":"IF(C10=0,\"\",TOPTEN($S$7:$S$36,$B$7:$B$36,4,TRUE))","v":"الرابع"}]
[{"$f":"IF(B11<>0,[1]STName!A11,\"\")","v":5},{"$f":"[1]STName!B11","v":"اسم الطالب 5"},12,20,16,14,5,6,19,20,13,17,19,15,7,5,7,7,202,15.538461538461538,9,"A","ناجح",null,5,{"$f":"IF(B11=0,\"\",TOPTEN($S$7:$S$36,$B$7:$B$36,5,FALSE))","v":"اسم الطالب 10"},{"$f":"IF(C11=0,\"\",TOPTEN($S$7:$S$36,$B$7:$B$36,5,TRUE))","v":"الرابع مكرر"}]
[{"$f":"IF(B12<>0,[1]STName!A12,\"\")","v":6},{"$f":"[1]STName!B12","v":"اسم الطالب 6"},13,20,19,14,7,7,19,17,12,19,20,14,7,6,7,7,208,16,7,"A","ناجح",null,6,{"$f":"IF(B12=0,\"\",TOPTEN($S$7:$S$36,$B$7:$B$36,6,FALSE))","v":"اسم الطالب 14"},{"$f":"IF(C12=0,\"\",TOPTEN($S$7:$S$36,$B$7:$B$36,6,TRUE))","v":"السادس"}]
[{"$f":"IF(B13<>0,[1]STName!A13,\"\")","v":7},{"$f":"[1]STName!B13","v":"اسم الطالب 7"},14,20,20,14,7,7,20,20,13,20,20,15,7,7,7,7,218,16.76923076923077,2,"A","ناجح",null,7,{"$f":"IF(B13=\"\",\"\",TOPTEN($S$7:$S$36,$B$7:$B$36,7,FALSE))","v":"اسم الطالب 6"},{"$f":"IF(C13=\"\",\"\",TOPTEN($S$7:$S$36,$B$7:$B$36,7,TRUE))","v":"السابع"}]
[{"$f":"IF(B14<>0,[1]STName!A14,\"\")","v":8},{"$f":"[1]STName!B14","v":"اسم الطالب 8"},8,16,13,13,2,7,14,20,12,19,19,2,7,6,7,7,172,13.23076923076923,14,"B","ناجح",null,8,{"$f":"IF(B14=\"\",0,TOPTEN($S$7:$S$36,$B$7:$B$36,8,FALSE))","v":"اسم الطالب 18"},{"$f":"IF(C14=\"\",0,TOPTEN($S$7:$S$36,$B$7:$B$36,8,TRUE))","v":"السابع مكرر"}]
[{"$f":"IF(B15<>0,[1]STName!A15,\"\")","v":9},{"$f":"[1]STName!B15","v":"اسم الطالب 9"},12,19,19,15,7,7,2,2,2,5,2,1,7,7,7,7,121,9.3076923076923084,19,"D","راسب",null,9,{"$f":"IF(B15=0,\"\",TOPTEN($S$7:$S$36,$B$7:$B$36,9,FALSE))","v":"اسم الطالب 5"},{"$f":"IF(C15=0,\"\",TOPTEN($S$7:$S$36,$B$7:$B$36,9,TRUE))","v":"التاسع"}]
[{"$f":"IF(B16<>0,[1]STName!A16,\"\")","v":10},{"$f":"[1]STName!B16","v":"اسم الطالب 10"},14,20,19,15,7,7,20,20,12,20,20,15,7,6,7,7,216,16.615384615384617,4,"A","ناجح",null,10,{"$f":"IF(B16=0,\"\",TOPTEN($S$7:$S$36,$B$7:$B$36,10,FALSE))","v":"اسم الطالب 12"},{"$f":"IF(C16=0,\"\",TOPTEN($S$7:$S$36,$B$7:$B$36,10,TRUE))","v":"التاسع مكرر"}]
[{"$f":"IF(B17<>0,[1]STName!A17,\"\")","v":11},{"$f":"[1]STName!B17","v":"اسم الطالب 11"},6,12,11,12,5,5,9,8,9,12,10,6,6,5,7,7,130,10,17,"C","ناجح",null,11,{"$f":"IF(B17=0,\"\",TOPTEN($S$7:$S$36,$B$7:$B$36,11,FALSE))","v":"اسم الطالب 16"},{"$f":"IF(C17=0,\"\",TOPTEN($S$7:$S$36,$B$7:$B$36,11,TRUE))","v":"الحادى عشر"}]
[{"$f":"IF(B18<>0,[1]STName!A18,\"\")","v":12},{"$f":"[1]STName!B18","v":"اسم الطالب 12"},12,20,16,14,5,6,19,20,13,17,19,15,7,5,7,7,202,15.538461538461538,9,"A","ناجح",null,12,{"$f":"IF(B18=0,\"\",TOPTEN($S$7:$S$36,$B$7:$B$36,12,FALSE))","v":"اسم الطالب 20"},{"$f":"IF(C18=0,\"\",TOPTEN($S$7:$S$36,$B$7:$B$36,12,TRUE))","v":"الحادى عشر مكرر"}]
[{"$f":"IF(B19<>0,[1]STName!A19,\"\")","v":13},{"$f":"[1]STName!B19","v":"اسم الطالب 13"},20,20,14,7,7,20,20,20,13,20,20,15,7,7,7,7,224,17.23076923076923,1,"A","ناجح",null,13,{"$f":"IF(B19=0,\"\",TOPTEN($S$7:$S$36,$B$7:$B$36,13,FALSE))","v":"اسم الطالب 15"},{"$f":"IF(C19=0,\"\",TOPTEN($S$7:$S$36,$B$7:$B$36,13,TRUE))","v":"الثالث عشر"}]
[{"$f":"IF(B20<>0,[1]STName!A20,\"\")","v":14},{"$f":"[1]STName!B20","v":"اسم الطالب 14"},12,20,20,15,7,6,20,17,12,20,20,15,7,5,7,7,210,16.153846153846153,6,"A","ناجح",null,14,{"$f":"IF(B20=0,\"\",TOPTEN($S$7:$S$36,$B$7:$B$36,14,FALSE))","v":"اسم الطالب 1"},{"$f":"IF(C20=0,\"\",TOPTEN($S$7:$S$36,$B$7:$B$36,14,TRUE))","v":"الرايع عشر"}]
[{"$f":"IF(B21<>0,[1]STName!A21,\"\")","v":15},{"$f":"[1]STName!B21","v":"اسم الطالب 15"},8,17,18,13,7,6,15,14,10,15,19,8,7,5,7,7,176,13.538461538461538,13,"B","ناجح",null,15,{"$f":"IF(B21=0,\"\",TOPTEN($S$7:$S$36,$B$7:$B$36,15,FALSE))","v":"اسم الطالب 8"},{"$f":"IF(C21=0,\"\",TOPTEN($S$7:$S$36,$B$7:$B$36,15,TRUE))","v":"الرايع عشر مكرر"}]
[{"$f":"IF(B22<>0,[1]STName!A22,\"\")","v":16},{"$f":"[1]STName!B22","v":"اسم الطالب 16"},12,16,20,15,4,6,20,14,11,17,20,13,7,6,7,7,195,15,11,"A","ناجح",null,16,{"$f":"IF(B22=0,\"\",TOPTEN($S$7:$S$36,$B$7:$B$36,16,FALSE))","v":"اسم الطالب 17"},{"$f":"IF(C22=0,\"\",TOPTEN($S$7:$S$36,$B$7:$B$36,16,TRUE))","v":"السادس عشر"}]
[{"$f":"IF(B23<>0,[1]STName!A23,\"\")","v":17},{"$f":"[1]STName!B23","v":"اسم الطالب 17"},9,14,11,12,6,6,11,9,10,19,18,14,7,6,7,7,166,12.76923076923077,16,"B","ناجح",null,17,{"$f":"IF(B23=0,\"\",TOPTEN($S$7:$S$36,$B$7:$B$36,17,FALSE))","v":"اسم الطالب 4"},{"$f":"IF(C23=0,\"\",TOPTEN($S$7:$S$36,$B$7:$B$36,17,TRUE))","v":"السابع عشر"}]
[{"$f":"IF(B24<>0,[1]STName!A24,\"\")","v":18},{"$f":"[1]STName!B24","v":"اسم الطالب 18"},13,20,19,14,7,7,19,17,12,19,20,14,7,6,7,7,208,16,7,"A","ناجح",null,18,{"$f":"IF(B24=0,\"\",TOPTEN($S$7:$S$36,$B$7:$B$36,18,FALSE))","v":"اسم الطالب 11"},{"$f":"IF(C24=0,\"\",TOPTEN($S$7:$S$36,$B$7:$B$36,18,TRUE))","v":"السابع عشر مكرر"}]
[{"$f":"IF(B25<>0,[1]STName!A25,\"\")","v":19},{"$f":"[1]STName!B25","v":"اسم الطالب 19"},14,20,20,14,7,7,20,20,13,20,20,15,7,7,7,7,218,16.76923076923077,2,"A","ناجح",null,19,{"$f":"IF(B25=0,\"\",TOPTEN($S$7:$S$36,$B$7:$B$36,19,FALSE))","v":"اسم الطالب 2"},{"$f":"IF(C25=0,\"\",TOPTEN($S$7:$S$36,$B$7:$B$36,19,TRUE))","v":"التاسع عشر"}]
[{"$f":"IF(B26<>0,[1]STName!A26,\"\")","v":20},{"$f":"[1]STName!B26","v":"اسم الطالب 20"},13,13,18,14,7,6,17,14,12,19,20,15,7,6,7,7,195,15,11,"A","ناجح",null,20,{"$f":"IF(B26=0,\"\",TOPTEN($S$7:$S$36,$B$7:$B$36,20,FALSE))","v":"اسم الطالب 9"},{"$f":"IF(C26=0,\"\",TOPTEN($S$7:$S$36,$B$7:$B$36,20,TRUE))","v":"التاسع عشر مكرر"}]
[{"$f":"IF(B27<>0,[1]STName!A27,\"\")","v":""},{"$f":"[1]STName!B27","v":0},null,null,null,null,null,null,null,null,null,null,null,null,null,null,null,null,"","","","","",null,21,{"$f":"IF(B27=0,\"\",TOPTEN($S$7:$S$36,$B$7:$B$36,21,FALSE))","v":""},{"$f":"IF(C27=0,\"\",TOPTEN($S$7:$S$36,$B$7:$B$36,21,TRUE))","v":""}]
[{"$f":"IF(B28<>0,[1]STName!A28,\"\")","v":""},{"$f":"[1]STName!B28","v":0},null,null,null,null,null,null,null,null,null,null,null,null,null,null,null,null,"","","","","",null,22,{"$f":"IF(B28=0,\"\",TOPTEN($S$7:$S$36,$B$7:$B$36,22,FALSE))","v":""},{"$f":"IF(C28=0,\"\",TOPTEN($S$7:$S$36,$B$7:$B$36,22,TRUE))","v":""}]
[{"$f":"IF(B29<>0,[1]STName!A29,\"\")","v":""},{"$f":"[1]STName!B29","v":0},null,null,null,null,null,null,null,null,null,null,null,null,null,null,null,null,"","","","","",null,23,{"$f":"IF(B29=0,\"\",TOPTEN($S$7:$S$36,$B$7:$B$36,23,FALSE))","v":""},{"$f":"IF(C29=0,\"\",TOPTEN($S$7:$S$36,$B$7:$B$36,23,TRUE))","v":""}]
[{"$f":"IF(B30<>0,[1]STName!A30,\"\")","v":""},{"$f":"[1]STName!B30","v":0},null,null,null,null,null,null,null,null,null,null,null,null,null,null,null,null,"","","","","",null,24,{"$f":"IF(B30=0,\"\",TOPTEN($S$7:$S$36,$B$7:$B$36,24,FALSE))","v":""},{"$f":"IF(C30=0,\"\",TOPTEN($S$7:$S$36,$B$7:$B$36,24,TRUE))","v":""}]
[{"$f":"IF(B31<>0,[1]STName!A31,\"\")","v":""},{"$f":"[1]STName!B31","v":0},null,null,null,null,null,null,null,null,null,null,null,null,null,null,null,null,"","","","","",null,25,{"$f":"IF(B31=0,\"\",TOPTEN($S$7:$S$36,$B$7:$B$36,25,FALSE))","v":""},{"$f":"IF(C31=0,\"\",TOPTEN($S$7:$S$36,$B$7:$B$36,25,TRUE))","v":""}]
[{"$f":"IF(B32<>0,[1]STName!A32,\"\")","v":""},{"$f":"[1]STName!B32","v":0},null,null,null,null,null,null,null,null,null,null,null,null,null,null,null,null,"","","","","",null,26,{"$f":"IF(B32=0,\"\",TOPTEN($S$7:$S$36,$B$7:$B$36,26,FALSE))","v":""},{"$f":"IF(C32=0,\"\",TOPTEN($S$7:$S$36,$B$7:$B$36,26,TRUE))","v":""}]
[{"$f":"IF(B33<>0,[1]STName!A33,\"\")","v":""},{"$f":"[1]STName!B33","v":0},null,null,null,null,null,null,null,null,null,null,null,null,null,null,null,null,"","","","","",null,27,{"$f":"IF(B33=0,\"\",TOPTEN($S$7:$S$36,$B$7:$B$36,27,FALSE))","v":""},{"$f":"IF(C33=0,\"\",TOPTEN($S$7:$S$36,$B$7:$B$36,27,TRUE))","v":""}]
[{"$f":"IF(B34<>0,[1]STName!A34,\"\")","v":""},{"$f":"[1]STName!B34","v":0},null,null,null,null,null,null,null,null,null,null,null,null,null,null,null,null,"","","","","",null,28,{"$f":"IF(B34=0,\"\",TOPTEN($S$7:$S$36,$B$7:$B$36,28,FALSE))","v":""},{"$f":"IF(C34=0,\"\",TOPTEN($S$7:$S$36,$B$7:$B$36,28,TRUE))","v":""}]
[{"$f":"IF(B35<>0,[1]STName!A35,\"\")","v":""},{"$f":"[1]STName!B35","v":0},null,null,null,null,null,null,null,null,null,null,null,null,null,null,null,null,"","","","","",null,29,{"$f":"IF(B35=0,\"\",TOPTEN($S$7:$S$36,$B$7:$B$36,29,FALSE))","v":""},{"$f":"IF(C35=0,\"\",TOPTEN($S$7:$S$36,$B$7:$B$36,29,TRUE))","v":""}]
[{"$f":"IF(B36<>0,[1]STName!A36,\"\")","v":""},{"$f":"[1]STName!B36","v":0},null,null,null,null,null,null,null,null,null,null,null,null,null,null,null,null,"","","","","",null,30,{"$f":"IF(B36=0,\"\",TOPTEN($S$7:$S$36,$B$7:$B$36,30,FALSE))","v":""},{"$f":"IF(C36=0,\"\",TOPTEN($S$7:$S$36,$B$7:$B$36,30,TRUE))","v":""}]
[]
[null,"أعلى علامة",{"$f":"MAX(C7:C36)","v":20},{"$f":"MAX(D7:D36)","v":20},20,15,7,20,20,20,13,20,20,15,7,7,7,7,224,17.23076923076923]
[null,"أدنى علامة",{"$f":"MIN(C7:C36)","v":6},{"$f":"MIN(D7:D36)","v":12},11,7,2,5,2,2,2,5,2,1,6,5,7,7,121,9.3076923076923084]
[null,"عدد الناجحين",{"$f":"COUNTIF(C7:C36,\">=\"&C6/2)","v":14},20,20,19,17,20,16,15,16,18,18,13,20,20,20,20,{"$f":"COUNTIF(S7:S36,\">=\"&S6/2)","v":18},{"$f":"COUNTIF(T7:T36,\">=10\")","v":18}]
[null,"عدد الراسبين",{"$f":"COUNTIF(C7:C37,\"<\"&C6/2)","v":6},0,0,1,3,0,4,5,4,2,2,7,0,0,0,0,{"$f":"COUNTIF(S7:S37,\"<\"&S6/2)","v":2},{"$f":"COUNTIF(T7:T37,\"<10\")","v":2}]

{"sheet":"MidYear","index":2,"n_rows":41,"n_cols":36,"rows_kept":41,"cut":false,"hidden":false,"merged":[[0,0,0,22],[1,2,1,4],[2,2,2,4],[2,5,2,7],[1,16,1,19],[2,16,2,19],[1,20,1,22],[2,20,2,22]]}
[{"$f":"[1]STName!A1","v":"International Lessing School"}]
[null,"الصــــــــــــــــــــف:",{"$f":"[1]STName!N3","v":"Grade 02"},null,null,null,null,null,null,null,null,null,null,null,null,null,"العـام الدراســـي:",null,null,null,{"$f":"[1]STName!B3","v":"2024-2025"}]
[null,"الشــــــــــــــــــــعبة:",{"$f":"[1]STName!J3","v":"A"},null,null,{"$f":"[1]STName!H3","v":"Moon"},null,null,null,null,null,null,null,null,null,null,"عــلامــات شـهر:",null,null,null,"Monthly1"]
[]
["الرقم","اسم الطالب","Reading","Grammar","Dictation","Comp + Conv","Poetry","Handwriting","Science","Mathematics","القراءة","القواعد","الإملاء","التعبير والمحادثة","المحفوظات","الخط","تربية مدنية","Sport","المجموع","المعدل","الترتيب","الفئة","النتيجة",null,null,"ترتيب تصاعدي",null,null,"السعي الأول","نصف السنة","الفصل الأول","الترتيب",null,null,"ترتيب تصاعدي"]
[null,"العلامة القصوى",20,20,20,20,10,10,20,20,20,20,20,20,10,10,10,10,{"$f":"IF(C6<>0,SUM(C6:R6),\"\")","v":260},20,null,null,null,null,null,null,null,null,{"$f":"Monthly1!S6","v":260},{"$f":"S6","v":260},{"$f":"IF((AC6<>\"\")*AND(AD6<>\"\"),AVERAGE(AC6,AD6),\"\")","v":260}]
[{"$f":"IF(B7<>0,[1]STName!A7,\"\")","v":1},{"$f":"[1]STName!B7","v":"اسم الطالب 1"},12,20,20,15,7,6,20,17,12,20,20,15,7,5,7,7,{"$f":"IF(C7<>0,SUM(C7:R7),\"\")","v":210},{"$f":"IF(C7<>0,S7/13,\"\")","v":16.153846153846153},{"$f":"IF(C7<>0,RANK(T7,$T$7:$T$36),\"\")","v":5},{"$f":"IF(C7<>0,IF(T7>=15,\"A\",IF(T7>=12,\"B\",IF(T7>=10,\"C\",IF(T7>=7.5,\"D\",\"E\")))),\"\")","v":"A"},{"$f":"IF(C7<>0,IF(T7>=10,\"ناجح\",\"راسب\"),\"\")","v":"ناجح"},null,1,{"$f":"IF(B7=0,\"\",TOPTEN($S$7:$S$36,$B$7:$B$36,1,FALSE))","v":"اسم الطالب 6"},{"$f":"IF(C7=0,\"\",TOPTEN($S$7:$S$36,$B$7:$B$36,1,TRUE))","v":"الأول"},null,{"$f":"Monthly1!S7","v":172},210,{"$f":"IF((AC7<>\"\")*AND(AD7<>\"\"),AVERAGE(AC7,AD7),\"\")","v":191},{"$f":"IF(B7<>0,RANK(AE7,$AE$7:$AE$36),\"\")","v":12},null,1,{"$f":"IF(B7=0,\"\",TOPTEN($AE$7:$AE$36,$B$7:$B$36,1,FALSE))","v":"اسم الطالب 19"},{"$f":"IF(B7=0,\"\",TOPTEN($AE$7:$AE$36,$B$7:$B$36,1,TRUE))","v":"الأول"}]
[{"$f":"IF(B8<>0,[1]STName!A8,\"\")","v":2},{"$f":"[1]STName!B8","v":"اسم الطالب 2"},8,17,18,13,7,6,15,14,10,15,19,8,7,5,7,7,176,13.538461538461538,{"$f":"IF(C8<>0,RANK(T8,$T$7:$T$36),\"\")","v":12},{"$f":"IF(C8<>0,IF(T8>=15,\"A\",IF(T8>=12,\"B\",IF(T8>=10,\"C\",IF(T8>=7.5,\"D\",\"E\")))),\"\")","v":"B"},{"$f":"IF(C8<>0,IF(T8>=10,\"ناجح\",\"راسب\"),\"\")","v":"ناجح"},null,2,{"$f":"IF(B8=0,\"\",TOPTEN($S$7:$S$36,$B$7:$B$36,2,FALSE))","v":"اسم الطالب 15"},{"$f":"IF(C8=0,\"\",TOPTEN($S$7:$S$36,$B$7:$B$36,2,TRUE))","v":"الثاني"},null,{"$f":"Monthly1!S8","v":121},176,148.5,{"$f":"IF(B8<>0,RANK(AE8,$AE$7:$AE$36),\"\")","v":17},null,2,{"$f":"IF(B8=0,\"\",TOPTEN($AE$7:$AE$36,$B$7:$B$36,2,FALSE))","v":"اسم الطالب 10"},{"$f":"IF(B8=0,\"\",TOPTEN($AE$7:$AE$36,$B$7:$B$36,2,TRUE))","v":"الثاني"}]
[{"$f":"IF(B9<>0,[1]STName!A9,\"\")","v":3},{"$f":"[1]STName!B9","v":"اسم الطالب 3"},12,16,20,15,4,6,20,14,11,17,20,13,7,6,7,7,195,15,9,"A","ناجح",null,3,{"$f":"IF(B9=0,\"\",TOPTEN($S$7:$S$36,$B$7:$B$36,3,FALSE))","v":"اسم الطالب 10"},{"$f":"IF(C9=0,\"\",TOPTEN($S$7:$S$36,$B$7:$B$36,3,TRUE))","v":"الثالث"},null,{"$f":"Monthly1!S9","v":216},195,205.5,6,null,3,{"$f":"IF(B9=0,\"\",TOPTEN($AE$7:$AE$36,$B$7:$B$36,3,FALSE))","v":"اسم الطالب 6"},{"$f":"IF(B9=0,\"\",TOPTEN($AE$7:$AE$36,$B$7:$B$36,3,TRUE))","v":"الثالث"}]
[{"$f":"IF(B10<>0,[1]STName!A10,\"\")","v":4},{"$f":"[1]STName!B10","v":"اسم الطالب 4"},9,14,11,12,6,6,11,9,10,19,18,14,7,6,7,7,166,12.76923076923077,15,"B","ناجح",null,4,{"$f":"IF(B10=0,\"\",TOPTEN($S$7:$S$36,$B$7:$B$36,4,FALSE))","v":"اسم الطالب 19"},{"$f":"IF(C10=0,\"\",TOPTEN($S$7:$S$36,$B$7:$B$36,4,TRUE))","v":"الثالث مكرر"},null,{"$f":"Monthly1!S10","v":130},166,148,18,null,4,{"$f":"IF(B10=0,\"\",TOPTEN($AE$7:$AE$36,$B$7:$B$36,4,FALSE))","v":"اسم الطالب 14"},{"$f":"IF(B10=0,\"\",TOPTEN($AE$7:$AE$36,$B$7:$B$36,4,TRUE))","v":"الرابع"}]
[{"$f":"IF(B11<>0,[1]STName!A11,\"\")","v":5},{"$f":"[1]STName!B11","v":"اسم الطالب 5"},13,20,19,14,7,7,19,17,12,19,20,14,7,6,7,7,208,16,6,"A","ناجح",null,5,{"$f":"IF(B11=0,\"\",TOPTEN($S$7:$S$36,$B$7:$B$36,5,FALSE))","v":"اسم الطالب 1"},{"$f":"IF(C11=0,\"\",TOPTEN($S$7:$S$36,$B$7:$B$36,5,TRUE))","v":"الخامس"},null,{"$f":"Monthly1!S11","v":202},208,205,7,null,5,{"$f":"IF(B11=0,\"\",TOPTEN($AE$7:$AE$36,$B$7:$B$36,5,FALSE))","v":"اسم الطالب 7"},{"$f":"IF(B11=0,\"\",TOPTEN($AE$7:$AE$36,$B$7:$B$36,5,TRUE))","v":"الخامس"}]
[{"$f":"IF(B12<>0,[1]STName!A12,\"\")","v":6},{"$f":"[1]STName!B12","v":"اسم الطالب 6"},14,20,20,14,7,7,20,20,13,20,20,15,7,7,8,7,219,16.846153846153847,1,"A","ناجح",null,6,{"$f":"IF(B12=0,\"\",TOPTEN($S$7:$S$36,$B$7:$B$36,6,FALSE))","v":"اسم الطالب 5"},{"$f":"IF(C12=0,\"\",TOPTEN($S$7:$S$36,$B$7:$B$36,6,TRUE))","v":"السادس"},null,{"$f":"Monthly1!S12","v":208},219,213.5,3,null,6,{"$f":"IF(B12=0,\"\",TOPTEN($AE$7:$AE$36,$B$7:$B$36,6,FALSE))","v":"اسم الطالب 3"},{"$f":"IF(B12=0,\"\",TOPTEN($AE$7:$AE$36,$B$7:$B$36,6,TRUE))","v":"السادس"}]
[{"$f":"IF(B13<>0,[1]STName!A13,\"\")","v":7},{"$f":"[1]STName!B13","v":"اسم الطالب 7"},13,13,18,14,7,6,17,14,12,19,20,15,7,6,7,7,195,15,9,"A","ناجح",null,7,{"$f":"IF(B13=\"\",\"\",TOPTEN($S$7:$S$36,$B$7:$B$36,7,FALSE))","v":"اسم الطالب 14"},{"$f":"IF(C13=\"\",\"\",TOPTEN($S$7:$S$36,$B$7:$B$36,7,TRUE))","v":"السادس مكرر"},null,{"$f":"Monthly1!S13","v":218},195,206.5,5,null,7,{"$f":"IF(B13=0,\"\",TOPTEN($AE$7:$AE$36,$B$7:$B$36,7,FALSE))","v":"اسم الطالب 5"},{"$f":"IF(B13=0,\"\",TOPTEN($AE$7:$AE$36,$B$7:$B$36,7,TRUE))","v":"السابع"}]
[{"$f":"IF(B14<>0,[1]STName!A14,\"\")","v":8},{"$f":"[1]STName!B14","v":"اسم الطالب 8"},8,16,13,13,2,7,14,20,12,19,19,2,7,6,7,7,172,13.23076923076923,13,"B","ناجح",null,8,{"$f":"IF(B14=\"\",0,TOPTEN($S$7:$S$36,$B$7:$B$36,8,FALSE))","v":"اسم الطالب 12"},{"$f":"IF(C14=\"\",0,TOPTEN($S$7:$S$36,$B$7:$B$36,8,TRUE))","v":"الثامن"},null,{"$f":"Monthly1!S14","v":172},172,172,13,null,8,{"$f":"IF(B14=0,\"\",TOPTEN($AE$7:$AE$36,$B$7:$B$36,8,FALSE))","v":"اسم الطالب 12"},{"$f":"IF(B14=0,\"\",TOPTEN($AE$7:$AE$36,$B$7:$B$36,8,TRUE))","v":"الثامن"}]
[{"$f":"IF(B15<>0,[1]STName!A15,\"\")","v":9},{"$f":"[1]STName!B15","v":"اسم الطالب 9"},12,19,19,15,7,7,2,2,2,5,2,1,7,7,7,7,121,9.3076923076923084,19,"D","راسب",null,9,{"$f":"IF(B15=0,\"\",TOPTEN($S$7:$S$36,$B$7:$B$36,9,FALSE))","v":"اسم الطالب 3"},{"$f":"IF(C15=0,\"\",TOPTEN($S$7:$S$36,$B$7:$B$36,9,TRUE))","v":"التاسع"},null,{"$f":"Monthly1!S15","v":121},121,121,20,null,9,{"$f":"IF(B15=0,\"\",TOPTEN($AE$7:$AE$36,$B$7:$B$36,9,FALSE))","v":"اسم الطالب 15"},{"$f":"IF(B15=0,\"\",TOPTEN($AE$7:$AE$36,$B$7:$B$36,9,TRUE))","v":"التاسع"}]
[{"$f":"IF(B16<>0,[1]STName!A16,\"\")","v":10},{"$f":"[1]STName!B16","v":"اسم الطالب 10"},14,20,19,15,7,7,20,20,12,20,20,15,7,6,7,7,216,16.615384615384617,3,"A","ناجح",null,10,{"$f":"IF(B16=0,\"\",TOPTEN($S$7:$S$36,$B$7:$B$36,10,FALSE))","v":"اسم الطالب 7"},{"$f":"IF(C16=0,\"\",TOPTEN($S$7:$S$36,$B$7:$B$36,10,TRUE))","v":"التاسع مكرر"},null,{"$f":"Monthly1!S16","v":216},216,216,2,null,10,{"$f":"IF(B16=0,\"\",TOPTEN($AE$7:$AE$36,$B$7:$B$36,10,FALSE))","v":"اسم الطالب 13"},{"$f":"IF(B16=0,\"\",TOPTEN($AE$7:$AE$36,$B$7:$B$36,10,TRUE))","v":"العاشر"}]
[{"$f":"IF(B17<>0,[1]STName!A17,\"\")","v":11},{"$f":"[1]STName!B17","v":"اسم الطالب 11"},6,12,11,12,5,5,9,8,9,12,10,6,6,5,7,7,130,10,17,"C","ناجح",null,11,{"$f":"IF(B17=0,\"\",TOPTEN($S$7:$S$36,$B$7:$B$36,11,FALSE))","v":"اسم الطالب 16"},{"$f":"IF(C17=0,\"\",TOPTEN($S$7:$S$36,$B$7:$B$36,11,TRUE))","v":"التاسع مكرر"},null,{"$f":"Monthly1!S17","v":130},130,130,19,null,11,{"$f":"IF(B17=0,\"\",TOPTEN($AE$7:$AE$36,$B$7:$B$36,11,FALSE))","v":"اسم الطالب 16"},{"$f":"IF(B17=0,\"\",TOPTEN($AE$7:$AE$36,$B$7:$B$36,11,TRUE))","v":"العاشر مكرر"}]
[{"$f":"IF(B18<>0,[1]STName!A18,\"\")","v":12},{"$f":"[1]STName!B18","v":"اسم الطالب 12"},12,20,16,14,5,6,19,20,13,17,19,15,7,5,7,7,202,15.538461538461538,8,"A","ناجح",null,12,{"$f":"IF(B18=0,\"\",TOPTEN($S$7:$S$36,$B$7:$B$36,12,FALSE))","v":"اسم الطالب 2"},{"$f":"IF(C18=0,\"\",TOPTEN($S$7:$S$36,$B$7:$B$36,12,TRUE))","v":"الثانى عشر"},null,{"$f":"Monthly1!S18","v":202},202,202,8,null,12,{"$f":"IF(B18=0,\"\",TOPTEN($AE$7:$AE$36,$B$7:$B$36,12,FALSE))","v":"اسم الطالب 1"},{"$f":"IF(B18=0,\"\",TOPTEN($AE$7:$AE$36,$B$7:$B$36,12,TRUE))","v":"الثانى عشر"}]
[{"$f":"IF(B19<>0,[1]STName!A19,\"\")","v":13},{"$f":"[1]STName!B19","v":"اسم الطالب 13"},9,14,11,12,6,6,11,9,10,19,18,14,7,6,7,7,166,12.76923076923077,15,"B","ناجح",null,13,{"$f":"IF(B19=0,\"\",TOPTEN($S$7:$S$36,$B$7:$B$36,13,FALSE))","v":"اسم الطالب 8"},{"$f":"IF(C19=0,\"\",TOPTEN($S$7:$S$36,$B$7:$B$36,13,TRUE))","v":"الثالث عشر"},null,{"$f":"Monthly1!S19","v":224},166,195,10,null,13,{"$f":"IF(B19=0,\"\",TOPTEN($AE$7:$AE$36,$B$7:$B$36,13,FALSE))","v":"اسم الطالب 8"},{"$f":"IF(B19=0,\"\",TOPTEN($AE$7:$AE$36,$B$7:$B$36,13,TRUE))","v":"الثالث عشر"}]
[{"$f":"IF(B20<>0,[1]STName!A20,\"\")","v":14},{"$f":"[1]STName!B20","v":"اسم الطالب 14"},13,20,19,14,7,7,19,17,12,19,20,14,7,6,7,7,208,16,6,"A","ناجح",null,14,{"$f":"IF(B20=0,\"\",TOPTEN($S$7:$S$36,$B$7:$B$36,14,FALSE))","v":"اسم الطالب 17"},{"$f":"IF(C20=0,\"\",TOPTEN($S$7:$S$36,$B$7:$B$36,14,TRUE))","v":"الثالث عشر مكرر"},null,{"$f":"Monthly1!S20","v":210},208,209,4,null,14,{"$f":"IF(B20=0,\"\",TOPTEN($AE$7:$AE$36,$B$7:$B$36,14,FALSE))","v":"اسم الطالب 17"},{"$f":"IF(B20=0,\"\",TOPTEN($AE$7:$AE$36,$B$7:$B$36,14,TRUE))","v":"الرايع عشر"}]
[{"$f":"IF(B21<>0,[1]STName!A21,\"\")","v":15},{"$f":"[1]STName!B21","v":"اسم الطالب 15"},14,20,20,14,7,7,20,20,13,20,20,15,7,7,7,7,218,16.76923076923077,2,"A","ناجح",null,15,{"$f":"IF(B21=0,\"\",TOPTEN($S$7:$S$36,$B$7:$B$36,15,FALSE))","v":"اسم الطالب 4"},{"$f":"IF(C21=0,\"\",TOPTEN($S$7:$S$36,$B$7:$B$36,15,TRUE))","v":"الخامس عشر"},null,{"$f":"Monthly1!S21","v":176},218,197,9,null,15,{"$f":"IF(B21=0,\"\",TOPTEN($AE$7:$AE$36,$B$7:$B$36,15,FALSE))","v":"اسم الطالب 18"},{"$f":"IF(B21=0,\"\",TOPTEN($AE$7:$AE$36,$B$7:$B$36,15,TRUE))","v":"الخامس عشر"}]
[{"$f":"IF(B22<>0,[1]STName!A22,\"\")","v":16},{"$f":"[1]STName!B22","v":"اسم الطالب 16"},13,13,18,14,7,6,17,14,12,19,20,15,7,6,7,7,195,15,9,"A","ناجح",null,16,{"$f":"IF(B22=0,\"\",TOPTEN($S$7:$S$36,$B$7:$B$36,16,FALSE))","v":"اسم الطالب 13"},{"$f":"IF(C22=0,\"\",TOPTEN($S$7:$S$36,$B$7:$B$36,16,TRUE))","v":"الخامس عشر مكرر"},null,{"$f":"Monthly1!S22","v":195},195,195,10,null,16,{"$f":"IF(B22=0,\"\",TOPTEN($AE$7:$AE$36,$B$7:$B$36,16,FALSE))","v":"اسم الطالب 20"},{"$f":"IF(B22=0,\"\",TOPTEN($AE$7:$AE$36,$B$7:$B$36,16,TRUE))","v":"السادس عشر"}]
[{"$f":"IF(B23<>0,[1]STName!A23,\"\")","v":17},{"$f":"[1]STName!B23","v":"اسم الطالب 17"},8,16,13,13,2,7,14,20,12,19,19,2,7,6,7,7,172,13.23076923076923,13,"B","ناجح",null,17,{"$f":"IF(B23=0,\"\",TOPTEN($S$7:$S$36,$B$7:$B$36,17,FALSE))","v":"اسم الطالب 11"},{"$f":"IF(C23=0,\"\",TOPTEN($S$7:$S$36,$B$7:$B$36,17,TRUE))","v":"السابع عشر"},null,{"$f":"Monthly1!S23","v":166},172,169,14,null,17,{"$f":"IF(B23=0,\"\",TOPTEN($AE$7:$AE$36,$B$7:$B$36,17,FALSE))","v":"اسم الطالب 2"},{"$f":"IF(B23=0,\"\",TOPTEN($AE$7:$AE$36,$B$7:$B$36,17,TRUE))","v":"السابع عشر"}]
[{"$f":"IF(B24<>0,[1]STName!A24,\"\")","v":18},{"$f":"[1]STName!B24","v":"اسم الطالب 18"},12,19,19,15,5,7,2,2,2,5,2,1,7,7,7,7,119,9.1538461538461533,20,"D","راسب",null,18,{"$f":"IF(B24=0,\"\",TOPTEN($S$7:$S$36,$B$7:$B$36,18,FALSE))","v":"اسم الطالب 20"},{"$f":"IF(C24=0,\"\",TOPTEN($S$7:$S$36,$B$7:$B$36,18,TRUE))","v":"السابع عشر مكرر"},null,{"$f":"Monthly1!S24","v":208},119,163.5,15,null,18,{"$f":"IF(B24=0,\"\",TOPTEN($AE$7:$AE$36,$B$7:$B$36,18,FALSE))","v":"اسم الطالب 4"},{"$f":"IF(B24=0,\"\",TOPTEN($AE$7:$AE$36,$B$7:$B$36,18,TRUE))","v":"الثامن عشر"}]
[{"$f":"IF(B25<>0,[1]STName!A25,\"\")","v":19},{"$f":"[1]STName!B25","v":"اسم الطالب 19"},14,20,19,15,7,7,20,20,12,20,20,15,7,6,7,7,216,16.615384615384617,3,"A","ناجح",null,19,{"$f":"IF(B25=0,\"\",TOPTEN($S$7:$S$36,$B$7:$B$36,19,FALSE))","v":"اسم الطالب 9"},{"$f":"IF(C25=0,\"\",TOPTEN($S$7:$S$36,$B$7:$B$36,19,TRUE))","v":"التاسع عشر"},null,{"$f":"Monthly1!S25","v":218},216,217,1,null,19,{"$f":"IF(B25=0,\"\",TOPTEN($AE$7:$AE$36,$B$7:$B$36,19,FALSE))","v":"اسم الطالب 11"},{"$f":"IF(B25=0,\"\",TOPTEN($AE$7:$AE$36,$B$7:$B$36,19,TRUE))","v":"التاسع عشر"}]
[{"$f":"IF(B26<>0,[1]STName!A26,\"\")","v":20},{"$f":"[1]STName!B26","v":"اسم الطالب 20"},6,12,11,12,5,5,9,8,9,12,10,6,6,5,7,7,130,10,17,"C","ناجح",null,20,{"$f":"IF(B26=0,\"\",TOPTEN($S$7:$S$36,$B$7:$B$36,20,FALSE))","v":"اسم الطالب 18"},{"$f":"IF(C26=0,\"\",TOPTEN($S$7:$S$36,$B$7:$B$36,20,TRUE))","v":"العشرون"},null,{"$f":"Monthly1!S26","v":195},130,162.5,16,null,20,{"$f":"IF(B26=0,\"\",TOPTEN($AE$7:$AE$36,$B$7:$B$36,20,FALSE))","v":"اسم الطالب 9"},{"$f":"IF(B26=0,\"\",TOPTEN($AE$7:$AE$36,$B$7:$B$36,20,TRUE))","v":"العشرون"}]
[{"$f":"IF(B27<>0,[1]STName!A27,\"\")","v":""},{"$f":"[1]STName!B27","v":0},null,null,null,null,null,null,null,null,null,null,null,null,null,null,null,null,"","","","","",null,21,{"$f":"IF(B27=0,\"\",TOPTEN($S$7:$S$36,$B$7:$B$36,21,FALSE))","v":""},{"$f":"IF(C27=0,\"\",TOPTEN($S$7:$S$36,$B$7:$B$36,21,TRUE))","v":""},null,{"$f":"Monthly1!S27","v":""},"","","",null,21,{"$f":"IF(B27=0,\"\",TOPTEN($AE$7:$AE$36,$B$7:$B$36,21,FALSE))","v":""},{"$f":"IF(B27=0,\"\",TOPTEN($AE$7:$AE$36,$B$7:$B$36,21,TRUE))","v":""}]
[{"$f":"IF(B28<>0,[1]STName!A28,\"\")","v":""},{"$f":"[1]STName!B28","v":0},null,null,null,null,null,null,null,null,null,null,null,null,null,null,null,null,"","","","","",null,22,{"$f":"IF(B28=0,\"\",TOPTEN($S$7:$S$36,$B$7:$B$36,22,FALSE))","v":""},{"$f":"IF(C28=0,\"\",TOPTEN($S$7:$S$36,$B$7:$B$36,22,TRUE))","v":""},null,{"$f":"Monthly1!S28","v":""},"","","",null,22,{"$f":"IF(B28=0,\"\",TOPTEN($AE$7:$AE$36,$B$7:$B$36,22,FALSE))","v":""},{"$f":"IF(B28=0,\"\",TOPTEN($AE$7:$AE$36,$B$7:$B$36,22,TRUE))","v":""}]
[{"$f":"IF(B29<>0,[1]STName!A29,\"\")","v":""},{"$f":"[1]STName!B29","v":0},null,null,null,null,null,null,null,null,null,null,null,null,null,null,null,null,"","","","","",null,23,{"$f":"IF(B29=0,\"\",TOPTEN($S$7:$S$36,$B$7:$B$36,23,FALSE))","v":""},{"$f":"IF(C29=0,\"\",TOPTEN($S$7:$S$36,$B$7:$B$36,23,TRUE))","v":""},null,{"$f":"Monthly1!S29","v":""},"","","",null,23,{"$f":"IF(B29=0,\"\",TOPTEN($AE$7:$AE$36,$B$7:$B$36,23,FALSE))","v":""},{"$f":"IF(B29=0,\"\",TOPTEN($AE$7:$AE$36,$B$7:$B$36,23,TRUE))","v":""}]
[{"$f":"IF(B30<>0,[1]STName!A30,\"\")","v":""},{"$f":"[1]STName!B30","v":0},null,null,null,null,null,null,null,null,null,null,null,null,null,null,null,null,"","","","","",null,24,{"$f":"IF(B30=0,\"\",TOPTEN($S$7:$S$36,$B$7:$B$36,24,FALSE))","v":""},{"$f":"IF(C30=0,\"\",TOPTEN($S$7:$S$36,$B$7:$B$36,24,TRUE))","v":""},null,{"$f":"Monthly1!S30","v":""},"","","",null,24,{"$f":"IF(B30=0,\"\",TOPTEN($AE$7:$AE$36,$B$7:$B$36,24,FALSE))","v":""},{"$f":"IF(B30=0,\"\",TOPTEN($AE$7:$AE$36,$B$7:$B$36,24,TRUE))","v":""}]
[{"$f":"IF(B31<>0,[1]STName!A31,\"\")","v":""},{"$f":"[1]STName!B31","v":0},null,null,null,null,null,null,null,null,null,null,null,null,null,null,null,null,"","","","","",null,25,{"$f":"IF(B31=0,\"\",TOPTEN($S$7:$S$36,$B$7:$B$36,25,FALSE))","v":""},{"$f":"IF(C31=0,\"\",TOPTEN($S$7:$S$36,$B$7:$B$36,25,TRUE))","v":""},null,{"$f":"Monthly1!S31","v":""},"","","",null,25,{"$f":"IF(B31=0,\"\",TOPTEN($AE$7:$AE$36,$B$7:$B$36,25,FALSE))","v":""},{"$f":"IF(B31=0,\"\",TOPTEN($AE$7:$AE$36,$B$7:$B$36,25,TRUE))","v":""}]
[{"$f":"IF(B32<>0,[1]STName!A32,\"\")","v":""},{"$f":"[1]STName!B32","v":0},null,null,null,null,null,null,null,null,null,null,null,null,null,null,null,null,"","","","","",null,26,{"$f":"IF(B32=0,\"\",TOPTEN($S$7:$S$36,$B$7:$B$36,26,FALSE))","v":""},{"$f":"IF(C32=0,\"\",TOPTEN($S$7:$S$36,$B$7:$B$36,26,TRUE))","v":""},null,{"$f":"Monthly1!S32","v":""},"","","",null,26,{"$f":"IF(B32=0,\"\",TOPTEN($AE$7:$AE$36,$B$7:$B$36,26,FALSE))","v":""},{"$f":"IF(B32=0,\"\",TOPTEN($AE$7:$AE$36,$B$7:$B$36,26,TRUE))","v":""}]
[{"$f":"IF(B33<>0,[1]STName!A33,\"\")","v":""},{"$f":"[1]STName!B33","v":0},null,null,null,null,null,null,null,null,null,null,null,null,null,null,null,null,"","","","","",null,27,{"$f":"IF(B33=0,\"\",TOPTEN($S$7:$S$36,$B$7:$B$36,27,FALSE))","v":""},{"$f":"IF(C33=0,\"\",TOPTEN($S$7:$S$36,$B$7:$B$36,27,TRUE))","v":""},null,{"$f":"Monthly1!S33","v":""},"","","",null,27,{"$f":"IF(B33=0,\"\",TOPTEN($AE$7:$AE$36,$B$7:$B$36,27,FALSE))","v":""},{"$f":"IF(B33=0,\"\",TOPTEN($AE$7:$AE$36,$B$7:$B$36,27,TRUE))","v":""}]
[{"$f":"IF(B34<>0,[1]STName!A34,\"\")","v":""},{"$f":"[1]STName!B34","v":0},null,null,null,null,null,null,null,null,null,null,null,null,null,null,null,null,"","","","","",null,28,{"$f":"IF(B34=0,\"\",TOPTEN($S$7:$S$36,$B$7:$B$36,28,FALSE))","v":""},{"$f":"IF(C34=0,\"\",TOPTEN($S$7:$S$36,$B$7:$B$36,28,TRUE))","v":""},null,{"$f":"Monthly1!S34","v":""},"","","",null,28,{"$f":"IF(B34=0,\"\",TOPTEN($AE$7:$AE$36,$B$7:$B$36,28,FALSE))","v":""},{"$f":"IF(B34=0,\"\",TOPTEN($AE$7:$AE$36,$B$7:$B$36,28,TRUE))","v":""}]
[{"$f":"IF(B35<>0,[1]STName!A35,\"\")","v":""},{"$f":"[1]STName!B35","v":0},null,null,null,null,null,null,null,null,null,null,null,null,null,null,null,null,"","","","","",null,29,{"$f":"IF(B35=0,\"\",TOPTEN($S$7:$S$36,$B$7:$B$36,29,FALSE))","v":""},{"$f":"IF(C35=0,\"\",TOPTEN($S$7:$S$36,$B$7:$B$36,29,TRUE))","v":""},null,{"$f":"Monthly1!S35","v":""},"","","",null,29,{"$f":"IF(B35=0,\"\",TOPTEN($AE$7:$AE$36,$B$7:$B$36,29,FALSE))","v":""},{"$f":"IF(B35=0,\"\",TOPTEN($AE$7:$AE$36,$B$7:$B$36,29,TRUE))","v":""}]
[{"$f":"IF(B36<>0,[1]STName!A36,\"\")","v":""},{"$f":"[1]STName!B36","v":0},null,null,null,null,null,null,null,null,null,null,null,null,null,null,null,null,"","","","","",null,30,{"$f":"IF(B36=0,\"\",TOPTEN($S$7:$S$36,$B$7:$B$36,30,FALSE))","v":""},{"$f":"IF(C36=0,\"\",TOPTEN($S$7:$S$36,$B$7:$B$36,30,TRUE))","v":""},null,{"$f":"Monthly1!S36","v":""},"","","",null,30,{"$f":"IF(B36=0,\"\",TOPTEN($AE$7:$AE$36,$B$7:$B$36,30,FALSE))","v":""},{"$f":"IF(B36=0,\"\",TOPTEN($AE$7:$AE$36,$B$7:$B$36,30,TRUE))","v":""}]
[]
[null,"أعلى علامة",{"$f":"MAX(C7:C36)","v":14},{"$f":"MAX(D7:D36)","v":20},20,15,7,7,20,20,13,20,20,15,7,7,8,7,219,16.846153846153847]
[null,"أدنى علامة",{"$f":"MIN(C7:C36)","v":6},{"$f":"MIN(D7:D36)","v":12},11,12,2,5,2,2,2,5,2,1,6,5,7,7,119,9.1538461538461533]
[null,"عدد الناجحين",{"$f":"COUNTIF(C7:C36,\">=\"&C6/2)","v":13},20,20,20,17,20,16,14,16,18,18,13,20,20,20,20,{"$f":"COUNTIF(S7:S36,\">=\"&S6/2)","v":18},{"$f":"COUNTIF(T7:T36,\">=10\")","v":18}]
[null,"عدد الراسبين",{"$f":"COUNTIF(C7:C37,\"<\"&C6/2)","v":7},0,0,0,3,0,4,6,4,2,2,7,0,0,0,0,{"$f":"COUNTIF(S7:S37,\"<\"&S6/2)","v":2},{"$f":"COUNTIF(T7:T37,\"<10\")","v":2}]

{"sheet":"Monthly2","index":3,"n_rows":41,"n_cols":27,"rows_kept":41,"cut":false,"hidden":false,"merged":[[0,0,0,22],[1,2,1,4],[2,2,2,4],[2,5,2,7],[1,16,1,19],[2,16,2,19],[1,20,1,22],[2,20,2,22]]}
[{"$f":"[1]STName!A1","v":"International Lessing School"}]
[null,"الصــــــــــــــــــــف:",{"$f":"[1]STName!N3","v":"Grade 02"},null,null,null,null,null,null,null,null,null,null,null,null,null,"العـام الدراســـي:",null,null,null,{"$f":"[1]STName!B3","v":"2024-2025"}]
[null,"الشــــــــــــــــــــعبة:",{"$f":"[1]STName!J3","v":"A"},null,null,{"$f":"[1]STName!H3","v":"Moon"},null,null,null,null,null,null,null,null,null,null,"عــلامــات شـهر:",null,null,null,"Monthly1"]
[]
["الرقم","اسم الطالب","Reading","Grammar","Dictation","Comp + Conv","Poetry","Handwriting","Science","Mathematics","القراءة","القواعد","الإملاء","التعبير والمحادثة","المحفوظات","الخط","تربية مدنية","Sport","المجموع","المعدل","الترتيب","الفئة","النتيجة",null,null,"ترتيب تصاعدي"]
[null,"العلامة القصوى",20,20,20,20,10,10,20,20,20,20,20,20,10,10,10,10,{"$f":"IF(C6<>0,SUM(C6:R6),\"\")","v":260},20]
[{"$f":"IF(B7<>0,[1]STName!A7,\"\")","v":1},{"$f":"[1]STName!B7","v":"اسم الطالب 1"},12,20,20,15,7,6,20,17,12,20,20,15,7,5,7,7,{"$f":"IF(C7<>0,SUM(C7:R7),\"\")","v":210},{"$f":"IF(C7<>0,S7/13,\"\")","v":16.153846153846153},{"$f":"IF(C7<>0,RANK(T7,$T$7:$T$36),\"\")","v":4},{"$f":"IF(C7<>0,IF(T7>=15,\"A\",IF(T7>=12,\"B\",IF(T7>=10,\"C\",IF(T7>=7.5,\"D\",\"E\")))),\"\")","v":"A"},{"$f":"IF(C7<>0,IF(T7>=10,\"ناجح\",\"راسب\"),\"\")","v":"ناجح"},null,1,{"$f":"IF(B7=0,\"\",TOPTEN($S$7:$S$36,$B$7:$B$36,1,FALSE))","v":"اسم الطالب 6"},{"$f":"IF(C7=0,\"\",TOPTEN($S$7:$S$36,$B$7:$B$36,1,TRUE))","v":"الأول"}]
[{"$f":"IF(B8<>0,[1]STName!A8,\"\")","v":2},{"$f":"[1]STName!B8","v":"اسم الطالب 2"},8,17,18,13,7,6,15,14,10,15,19,8,7,5,7,7,176,13.538461538461538,{"$f":"IF(C8<>0,RANK(T8,$T$7:$T$36),\"\")","v":13},{"$f":"IF(C8<>0,IF(T8>=15,\"A\",IF(T8>=12,\"B\",IF(T8>=10,\"C\",IF(T8>=7.5,\"D\",\"E\")))),\"\")","v":"B"},{"$f":"IF(C8<>0,IF(T8>=10,\"ناجح\",\"راسب\"),\"\")","v":"ناجح"},null,2,{"$f":"IF(B8=0,\"\",TOPTEN($S$7:$S$36,$B$7:$B$36,2,FALSE))","v":"اسم الطالب 10"},{"$f":"IF(C8=0,\"\",TOPTEN($S$7:$S$36,$B$7:$B$36,2,TRUE))","v":"الثاني"}]
[{"$f":"IF(B9<>0,[1]STName!A9,\"\")","v":3},{"$f":"[1]STName!B9","v":"اسم الطالب 3"},12,16,20,15,4,6,20,14,11,17,20,13,7,6,7,7,195,15,11,"A","ناجح",null,3,{"$f":"IF(B9=0,\"\",TOPTEN($S$7:$S$36,$B$7:$B$36,3,FALSE))","v":"اسم الطالب 15"},{"$f":"IF(C9=0,\"\",TOPTEN($S$7:$S$36,$B$7:$B$36,3,TRUE))","v":"الثالث"}]
[{"$f":"IF(B10<>0,[1]STName!A10,\"\")","v":4},{"$f":"[1]STName!B10","v":"اسم الطالب 4"},9,14,11,12,6,6,11,9,10,19,18,14,7,6,7,7,166,12.76923076923077,14,"B","ناجح",null,4,{"$f":"IF(B10=0,\"\",TOPTEN($S$7:$S$36,$B$7:$B$36,4,FALSE))","v":"اسم الطالب 1"},{"$f":"IF(C10=0,\"\",TOPTEN($S$7:$S$36,$B$7:$B$36,4,TRUE))","v":"الرابع"}]
[{"$f":"IF(B11<>0,[1]STName!A11,\"\")","v":5},{"$f":"[1]STName!B11","v":"اسم الطالب 5"},13,20,19,14,7,7,19,17,12,19,20,14,7,6,7,7,208,16,6,"A","ناجح",null,5,{"$f":"IF(B11=0,\"\",TOPTEN($S$7:$S$36,$B$7:$B$36,5,FALSE))","v":"اسم الطالب 9"},{"$f":"IF(C11=0,\"\",TOPTEN($S$7:$S$36,$B$7:$B$36,5,TRUE))","v":"الرابع مكرر"}]
[{"$f":"IF(B12<>0,[1]STName!A12,\"\")","v":6},{"$f":"[1]STName!B12","v":"اسم الطالب 6"},14,20,20,14,7,7,20,20,13,20,20,15,7,8,8,7,220,16.923076923076923,1,"A","ناجح",null,6,{"$f":"IF(B12=0,\"\",TOPTEN($S$7:$S$36,$B$7:$B$36,6,FALSE))","v":"اسم الطالب 5"},{"$f":"IF(C12=0,\"\",TOPTEN($S$7:$S$36,$B$7:$B$36,6,TRUE))","v":"السادس"}]
[{"$f":"IF(B13<>0,[1]STName!A13,\"\")","v":7},{"$f":"[1]STName!B13","v":"اسم الطالب 7"},13,13,18,14,7,6,17,14,12,19,20,15,7,6,7,7,195,15,11,"A","ناجح",null,7,{"$f":"IF(B13=\"\",\"\",TOPTEN($S$7:$S$36,$B$7:$B$36,7,FALSE))","v":"اسم الطالب 14"},{"$f":"IF(C13=\"\",\"\",TOPTEN($S$7:$S$36,$B$7:$B$36,7,TRUE))","v":"السادس مكرر"}]
[{"$f":"IF(B14<>0,[1]STName!A14,\"\")","v":8},{"$f":"[1]STName!B14","v":"اسم الطالب 8"},9,14,11,12,6,6,11,9,10,19,18,14,7,6,7,7,166,12.76923076923077,14,"B","ناجح",null,8,{"$f":"IF(B14=\"\",0,TOPTEN($S$7:$S$36,$B$7:$B$36,8,FALSE))","v":"اسم الطالب 19"},{"$f":"IF(C14=\"\",0,TOPTEN($S$7:$S$36,$B$7:$B$36,8,TRUE))","v":"السادس مكرر"}]
[{"$f":"IF(B15<>0,[1]STName!A15,\"\")","v":9},{"$f":"[1]STName!B15","v":"اسم الطالب 9"},13,20,19,14,7,7,19,17,12,19,20,16,7,6,7,7,210,16.153846153846153,4,"A","ناجح",null,9,{"$f":"IF(B15=0,\"\",TOPTEN($S$7:$S$36,$B$7:$B$36,9,FALSE))","v":"اسم الطالب 12"},{"$f":"IF(C15=0,\"\",TOPTEN($S$7:$S$36,$B$7:$B$36,9,TRUE))","v":"التاسع"}]
[{"$f":"IF(B16<>0,[1]STName!A16,\"\")","v":10},{"$f":"[1]STName!B16","v":"اسم الطالب 10"},14,20,20,14,7,7,20,20,13,20,20,15,7,7,8,7,219,16.846153846153847,2,"A","ناجح",null,10,{"$f":"IF(B16=0,\"\",TOPTEN($S$7:$S$36,$B$7:$B$36,10,FALSE))","v":"اسم الطالب 17"},{"$f":"IF(C16=0,\"\",TOPTEN($S$7:$S$36,$B$7:$B$36,10,TRUE))","v":"التاسع مكرر"}]
[{"$f":"IF(B17<>0,[1]STName!A17,\"\")","v":11},{"$f":"[1]STName!B17","v":"اسم الطالب 11"},6,12,11,12,5,5,9,8,9,12,10,6,6,5,7,7,130,10,19,"C","ناجح",null,11,{"$f":"IF(B17=0,\"\",TOPTEN($S$7:$S$36,$B$7:$B$36,11,FALSE))","v":"اسم الطالب 3"},{"$f":"IF(C17=0,\"\",TOPTEN($S$7:$S$36,$B$7:$B$36,11,TRUE))","v":"الحادى عشر"}]
[{"$f":"IF(B18<>0,[1]STName!A18,\"\")","v":12},{"$f":"[1]STName!B18","v":"اسم الطالب 12"},12,20,16,14,5,6,19,20,13,17,19,15,7,5,7,7,202,15.538461538461538,9,"A","ناجح",null,12,{"$f":"IF(B18=0,\"\",TOPTEN($S$7:$S$36,$B$7:$B$36,12,FALSE))","v":"اسم الطالب 7"},{"$f":"IF(C18=0,\"\",TOPTEN($S$7:$S$36,$B$7:$B$36,12,TRUE))","v":"الحادى عشر مكرر"}]
[{"$f":"IF(B19<>0,[1]STName!A19,\"\")","v":13},{"$f":"[1]STName!B19","v":"اسم الطالب 13"},9,14,11,12,6,6,11,9,10,19,18,14,7,6,7,7,166,12.76923076923077,14,"B","ناجح",null,13,{"$f":"IF(B19=0,\"\",TOPTEN($S$7:$S$36,$B$7:$B$36,13,FALSE))","v":"اسم الطالب 2"},{"$f":"IF(C19=0,\"\",TOPTEN($S$7:$S$36,$B$7:$B$36,13,TRUE))","v":"الثالث عشر"}]
[{"$f":"IF(B20<>0,[1]STName!A20,\"\")","v":14},{"$f":"[1]STName!B20","v":"اسم الطالب 14"},13,20,19,14,7,7,19,17,12,19,20,14,7,6,7,7,208,16,6,"A","ناجح",null,14,{"$f":"IF(B20=0,\"\",TOPTEN($S$7:$S$36,$B$7:$B$36,14,FALSE))","v":"اسم الطالب 4"},{"$f":"IF(C20=0,\"\",TOPTEN($S$7:$S$36,$B$7:$B$36,14,TRUE))","v":"الرايع عشر"}]
[{"$f":"IF(B21<>0,[1]STName!A21,\"\")","v":15},{"$f":"[1]STName!B21","v":"اسم الطالب 15"},14,20,20,14,7,7,20,20,13,20,20,15,7,7,7,7,218,16.76923076923077,3,"A","ناجح",null,15,{"$f":"IF(B21=0,\"\",TOPTEN($S$7:$S$36,$B$7:$B$36,15,FALSE))","v":"اسم الطالب 8"},{"$f":"IF(C21=0,\"\",TOPTEN($S$7:$S$36,$B$7:$B$36,15,TRUE))","v":"الرايع عشر مكرر"}]
[{"$f":"IF(B22<>0,[1]STName!A22,\"\")","v":16},{"$f":"[1]STName!B22","v":"اسم الطالب 16"},6,12,11,12,5,5,9,8,9,12,10,6,6,5,7,7,130,10,19,"C","ناجح",null,16,{"$f":"IF(B22=0,\"\",TOPTEN($S$7:$S$36,$B$7:$B$36,16,FALSE))","v":"اسم الطالب 13"},{"$f":"IF(C22=0,\"\",TOPTEN($S$7:$S$36,$B$7:$B$36,16,TRUE))","v":"الرايع عشر مكرر"}]
[{"$f":"IF(B23<>0,[1]STName!A23,\"\")","v":17},{"$f":"[1]STName!B23","v":"اسم الطالب 17"},12,20,16,14,5,6,19,20,13,17,19,15,7,5,7,7,202,15.538461538461538,9,"A","ناجح",null,17,{"$f":"IF(B23=0,\"\",TOPTEN($S$7:$S$36,$B$7:$B$36,17,FALSE))","v":"اسم الطالب 18"},{"$f":"IF(C23=0,\"\",TOPTEN($S$7:$S$36,$B$7:$B$36,17,TRUE))","v":"الرايع عشر مكرر"}]
[{"$f":"IF(B24<>0,[1]STName!A24,\"\")","v":18},{"$f":"[1]STName!B24","v":"اسم الطالب 18"},9,14,11,12,6,6,11,9,10,19,18,14,7,6,7,7,166,12.76923076923077,14,"B","ناجح",null,18,{"$f":"IF(B24=0,\"\",TOPTEN($S$7:$S$36,$B$7:$B$36,18,FALSE))","v":"اسم الطالب 20"},{"$f":"IF(C24=0,\"\",TOPTEN($S$7:$S$36,$B$7:$B$36,18,TRUE))","v":"الثامن عشر"}]
[{"$f":"IF(B25<>0,[1]STName!A25,\"\")","v":19},{"$f":"[1]STName!B25","v":"اسم الطالب 19"},13,20,19,14,7,7,19,17,12,19,20,14,7,6,7,7,208,16,6,"A","ناجح",null,19,{"$f":"IF(B25=0,\"\",TOPTEN($S$7:$S$36,$B$7:$B$36,19,FALSE))","v":"اسم الطالب 11"},{"$f":"IF(C25=0,\"\",TOPTEN($S$7:$S$36,$B$7:$B$36,19,TRUE))","v":"التاسع عشر"}]
[{"$f":"IF(B26<>0,[1]STName!A26,\"\")","v":20},{"$f":"[1]STName!B26","v":"اسم الطالب 20"},6,12,11,12,5,5,9,8,9,12,10,12,6,5,7,7,136,10.461538461538462,18,"C","ناجح",null,20,{"$f":"IF(B26=0,\"\",TOPTEN($S$7:$S$36,$B$7:$B$36,20,FALSE))","v":"اسم الطالب 16"},{"$f":"IF(C26=0,\"\",TOPTEN($S$7:$S$36,$B$7:$B$36,20,TRUE))","v":"التاسع عشر مكرر"}]
[{"$f":"IF(B27<>0,[1]STName!A27,\"\")","v":""},{"$f":"[1]STName!B27","v":0},null,null,null,null,null,null,null,null,null,null,null,null,null,null,null,null,"","","","","",null,21,{"$f":"IF(B27=0,\"\",TOPTEN($S$7:$S$36,$B$7:$B$36,21,FALSE))","v":""},{"$f":"IF(C27=0,\"\",TOPTEN($S$7:$S$36,$B$7:$B$36,21,TRUE))","v":""}]
[{"$f":"IF(B28<>0,[1]STName!A28,\"\")","v":""},{"$f":"[1]STName!B28","v":0},null,null,null,null,null,null,null,null,null,null,null,null,null,null,null,null,"","","","","",null,22,{"$f":"IF(B28=0,\"\",TOPTEN($S$7:$S$36,$B$7:$B$36,22,FALSE))","v":""},{"$f":"IF(C28=0,\"\",TOPTEN($S$7:$S$36,$B$7:$B$36,22,TRUE))","v":""}]
[{"$f":"IF(B29<>0,[1]STName!A29,\"\")","v":""},{"$f":"[1]STName!B29","v":0},null,null,null,null,null,null,null,null,null,null,null,null,null,null,null,null,"","","","","",null,23,{"$f":"IF(B29=0,\"\",TOPTEN($S$7:$S$36,$B$7:$B$36,23,FALSE))","v":""},{"$f":"IF(C29=0,\"\",TOPTEN($S$7:$S$36,$B$7:$B$36,23,TRUE))","v":""}]
[{"$f":"IF(B30<>0,[1]STName!A30,\"\")","v":""},{"$f":"[1]STName!B30","v":0},null,null,null,null,null,null,null,null,null,null,null,null,null,null,null,null,"","","","","",null,24,{"$f":"IF(B30=0,\"\",TOPTEN($S$7:$S$36,$B$7:$B$36,24,FALSE))","v":""},{"$f":"IF(C30=0,\"\",TOPTEN($S$7:$S$36,$B$7:$B$36,24,TRUE))","v":""}]
[{"$f":"IF(B31<>0,[1]STName!A31,\"\")","v":""},{"$f":"[1]STName!B31","v":0},null,null,null,null,null,null,null,null,null,null,null,null,null,null,null,null,"","","","","",null,25,{"$f":"IF(B31=0,\"\",TOPTEN($S$7:$S$36,$B$7:$B$36,25,FALSE))","v":""},{"$f":"IF(C31=0,\"\",TOPTEN($S$7:$S$36,$B$7:$B$36,25,TRUE))","v":""}]
[{"$f":"IF(B32<>0,[1]STName!A32,\"\")","v":""},{"$f":"[1]STName!B32","v":0},null,null,null,null,null,null,null,null,null,null,null,null,null,null,null,null,"","","","","",null,26,{"$f":"IF(B32=0,\"\",TOPTEN($S$7:$S$36,$B$7:$B$36,26,FALSE))","v":""},{"$f":"IF(C32=0,\"\",TOPTEN($S$7:$S$36,$B$7:$B$36,26,TRUE))","v":""}]
[{"$f":"IF(B33<>0,[1]STName!A33,\"\")","v":""},{"$f":"[1]STName!B33","v":0},null,null,null,null,null,null,null,null,null,null,null,null,null,null,null,null,"","","","","",null,27,{"$f":"IF(B33=0,\"\",TOPTEN($S$7:$S$36,$B$7:$B$36,27,FALSE))","v":""},{"$f":"IF(C33=0,\"\",TOPTEN($S$7:$S$36,$B$7:$B$36,27,TRUE))","v":""}]
[{"$f":"IF(B34<>0,[1]STName!A34,\"\")","v":""},{"$f":"[1]STName!B34","v":0},null,null,null,null,null,null,null,null,null,null,null,null,null,null,null,null,"","","","","",null,28,{"$f":"IF(B34=0,\"\",TOPTEN($S$7:$S$36,$B$7:$B$36,28,FALSE))","v":""},{"$f":"IF(C34=0,\"\",TOPTEN($S$7:$S$36,$B$7:$B$36,28,TRUE))","v":""}]
[{"$f":"IF(B35<>0,[1]STName!A35,\"\")","v":""},{"$f":"[1]STName!B35","v":0},null,null,null,null,null,null,null,null,null,null,null,null,null,null,null,null,"","","","","",null,29,{"$f":"IF(B35=0,\"\",TOPTEN($S$7:$S$36,$B$7:$B$36,29,FALSE))","v":""},{"$f":"IF(C35=0,\"\",TOPTEN($S$7:$S$36,$B$7:$B$36,29,TRUE))","v":""}]
[{"$f":"IF(B36<>0,[1]STName!A36,\"\")","v":""},{"$f":"[1]STName!B36","v":0},null,null,null,null,null,null,null,null,null,null,null,null,null,null,null,null,"","","","","",null,30,{"$f":"IF(B36=0,\"\",TOPTEN($S$7:$S$36,$B$7:$B$36,30,FALSE))","v":""},{"$f":"IF(C36=0,\"\",TOPTEN($S$7:$S$36,$B$7:$B$36,30,TRUE))","v":""}]
[]
[null,"أعلى علامة",{"$f":"MAX(C7:C36)","v":14},{"$f":"MAX(D7:D36)","v":20},20,15,7,7,20,20,13,20,20,16,7,8,8,7,220,16.923076923076923]
[null,"أدنى علامة",{"$f":"MIN(C7:C36)","v":6},{"$f":"MIN(D7:D36)","v":12},11,12,4,5,9,8,9,12,10,6,6,5,7,7,130,10]
[null,"عدد الناجحين",{"$f":"COUNTIF(C7:C36,\">=\"&C6/2)","v":12},20,20,20,19,20,17,13,17,20,20,17,20,20,20,20,{"$f":"COUNTIF(S7:S36,\">=\"&S6/2)","v":20},{"$f":"COUNTIF(T7:T36,\">=10\")","v":20}]
[null,"عدد الراسبين",{"$f":"COUNTIF(C7:C37,\"<\"&C6/2)","v":8},0,0,0,1,0,3,7,3,0,0,3,0,0,0,0,{"$f":"COUNTIF(S7:S37,\"<\"&S6/2)","v":0},{"$f":"COUNTIF(T7:T37,\"<10\")","v":0}]

{"sheet":"FinalYear","index":4,"n_rows":41,"n_cols":36,"rows_kept":41,"cut":false,"hidden":false,"merged":[[0,0,0,22],[1,2,1,4],[2,2,2,4],[2,5,2,7],[1,16,1,19],[2,16,2,19],[1,20,1,22],[2,20,2,22]]}
[{"$f":"[1]STName!A1","v":"International Lessing School"}]
[null,"الصــــــــــــــــــــف:",{"$f":"[1]STName!N3","v":"Grade 02"},null,null,null,null,null,null,null,null,null,null,null,null,null,"العـام الدراســـي:",null,null,null,{"$f":"[1]STName!B3","v":"2024-2025"}]
[null,"الشــــــــــــــــــــعبة:",{"$f":"[1]STName!J3","v":"A"},null,null,{"$f":"[1]STName!H3","v":"Moon"},null,null,null,null,null,null,null,null,null,null,"عــلامــات شـهر:",null,null,null,"Monthly1"]
[]
["الرقم","اسم الطالب","Reading","Grammar","Dictation","Comp + Conv","Poetry","Handwriting","Science","Mathematics","القراءة","القواعد","الإملاء","التعبير والمحادثة","المحفوظات","الخط","تربية مدنية","Sport","المجموع","المعدل","الترتيب","الفئة","النتيجة",null,null,"ترتيب تصاعدي",null,null,"السعي الثاني","آخر السنة","الفصل الثاني","الترتيب",null,null,"ترتيب تصاعدي"]
[null,"العلامة القصوى",20,20,20,20,10,10,20,20,20,20,20,20,10,10,10,10,{"$f":"IF(C6<>0,SUM(C6:R6),\"\")","v":260},20,null,null,null,null,null,null,null,null,{"$f":"Monthly2!S6","v":260},{"$f":"S6","v":260},{"$f":"IF((AC6<>\"\")*AND(AD6<>\"\"),AVERAGE(AC6,AD6),\"\")","v":260}]
[{"$f":"IF(B7<>0,[1]STName!A7,\"\")","v":1},{"$f":"[1]STName!B7","v":"اسم الطالب 1"},6,12,11,12,5,5,9,8,9,12,10,6,6,5,7,7,{"$f":"IF(C7<>0,SUM(C7:R7),\"\")","v":130},{"$f":"IF(C7<>0,S7/13,\"\")","v":10},{"$f":"IF(C7<>0,RANK(T7,$T$7:$T$36),\"\")","v":16},{"$f":"IF(C7<>0,IF(T7>=15,\"A\",IF(T7>=12,\"B\",IF(T7>=10,\"C\",IF(T7>=7.5,\"D\",\"E\")))),\"\")","v":"C"},{"$f":"IF(C7<>0,IF(T7>=10,\"ناجح\",\"راسب\"),\"\")","v":"ناجح"},null,1,{"$f":"IF(B7=0,\"\",TOPTEN($S$7:$S$36,$B$7:$B$36,1,FALSE))","v":"اسم الطالب 12"},{"$f":"IF(C7=0,\"\",TOPTEN($S$7:$S$36,$B$7:$B$36,1,TRUE))","v":"الأول"},null,{"$f":"Monthly2!S7","v":210},130,{"$f":"IF((AC7<>\"\")*AND(AD7<>\"\"),AVERAGE(AC7,AD7),\"\")","v":170},{"$f":"IF(B7<>0,RANK(AE7,$AE$7:$AE$36),\"\")","v":14},null,1,{"$f":"IF(B7=0,\"\",TOPTEN($AE$7:$AE$36,$B$7:$B$36,1,FALSE))","v":"اسم الطالب 10"},{"$f":"IF(B7=0,\"\",TOPTEN($AE$7:$AE$36,$B$7:$B$36,1,TRUE))","v":"الأول"}]
[{"$f":"IF(B8<>0,[1]STName!A8,\"\")","v":2},{"$f":"[1]STName!B8","v":"اسم الطالب 2"},12,20,16,14,5,6,19,20,13,17,19,15,7,5,7,7,202,15.538461538461538,{"$f":"IF(C8<>0,RANK(T8,$T$7:$T$36),\"\")","v":6},{"$f":"IF(C8<>0,IF(T8>=15,\"A\",IF(T8>=12,\"B\",IF(T8>=10,\"C\",IF(T8>=7.5,\"D\",\"E\")))),\"\")","v":"A"},{"$f":"IF(C8<>0,IF(T8>=10,\"ناجح\",\"راسب\"),\"\")","v":"ناجح"},null,2,{"$f":"IF(B8=0,\"\",TOPTEN($S$7:$S$36,$B$7:$B$36,2,FALSE))","v":"اسم الطالب 5"},{"$f":"IF(C8=0,\"\",TOPTEN($S$7:$S$36,$B$7:$B$36,2,TRUE))","v":"الثاني"},null,{"$f":"Monthly2!S8","v":176},202,189,{"$f":"IF(B8<>0,RANK(AE8,$AE$7:$AE$36),\"\")","v":9},null,2,{"$f":"IF(B8=0,\"\",TOPTEN($AE$7:$AE$36,$B$7:$B$36,2,FALSE))","v":"اسم الطالب 5"},{"$f":"IF(B8=0,\"\",TOPTEN($AE$7:$AE$36,$B$7:$B$36,2,TRUE))","v":"الثاني"}]
[{"$f":"IF(B9<>0,[1]STName!A9,\"\")","v":3},{"$f":"[1]STName!B9","v":"اسم الطالب 3"},9,14,11,12,6,6,11,9,10,19,18,14,7,6,7,7,166,12.76923076923077,14,"B","ناجح",null,3,{"$f":"IF(B9=0,\"\",TOPTEN($S$7:$S$36,$B$7:$B$36,3,FALSE))","v":"اسم الطالب 19"},{"$f":"IF(C9=0,\"\",TOPTEN($S$7:$S$36,$B$7:$B$36,3,TRUE))","v":"الثاني مكرر"},null,{"$f":"Monthly2!S9","v":195},166,180.5,12,null,3,{"$f":"IF(B9=0,\"\",TOPTEN($AE$7:$AE$36,$B$7:$B$36,3,FALSE))","v":"اسم الطالب 19"},{"$f":"IF(B9=0,\"\",TOPTEN($AE$7:$AE$36,$B$7:$B$36,3,TRUE))","v":"الثاني مكرر"}]
[{"$f":"IF(B10<>0,[1]STName!A10,\"\")","v":4},{"$f":"[1]STName!B10","v":"اسم الطالب 4"},13,20,19,14,7,7,19,17,12,19,20,14,7,6,7,7,208,16,5,"A","ناجح",null,4,{"$f":"IF(B10=0,\"\",TOPTEN($S$7:$S$36,$B$7:$B$36,4,FALSE))","v":"اسم الطالب 10"},{"$f":"IF(C10=0,\"\",TOPTEN($S$7:$S$36,$B$7:$B$36,4,TRUE))","v":"الرابع"},null,{"$f":"Monthly2!S10","v":166},208,187,10,null,4,{"$f":"IF(B10=0,\"\",TOPTEN($AE$7:$AE$36,$B$7:$B$36,4,FALSE))","v":"اسم الطالب 12"},{"$f":"IF(B10=0,\"\",TOPTEN($AE$7:$AE$36,$B$7:$B$36,4,TRUE))","v":"الرابع"}]
[{"$f":"IF(B11<>0,[1]STName!A11,\"\")","v":5},{"$f":"[1]STName!B11","v":"اسم الطالب 5"},14,20,20,14,7,7,20,20,13,20,20,15,7,7,5,7,216,16.615384615384617,2,"A","ناجح",null,5,{"$f":"IF(B11=0,\"\",TOPTEN($S$7:$S$36,$B$7:$B$36,5,FALSE))","v":"اسم الطالب 4"},{"$f":"IF(C11=0,\"\",TOPTEN($S$7:$S$36,$B$7:$B$36,5,TRUE))","v":"الخامس"},null,{"$f":"Monthly2!S11","v":208},216,212,2,null,5,{"$f":"IF(B11=0,\"\",TOPTEN($AE$7:$AE$36,$B$7:$B$36,5,FALSE))","v":"اسم الطالب 6"},{"$f":"IF(B11=0,\"\",TOPTEN($AE$7:$AE$36,$B$7:$B$36,5,TRUE))","v":"الخامس"}]
[{"$f":"IF(B12<>0,[1]STName!A12,\"\")","v":6},{"$f":"[1]STName!B12","v":"اسم الطالب 6"},13,13,18,14,7,6,17,14,12,19,20,15,7,6,8,7,196,15.076923076923077,7,"A","ناجح",null,6,{"$f":"IF(B12=0,\"\",TOPTEN($S$7:$S$36,$B$7:$B$36,6,FALSE))","v":"اسم الطالب 2"},{"$f":"IF(C12=0,\"\",TOPTEN($S$7:$S$36,$B$7:$B$36,6,TRUE))","v":"السادس"},null,{"$f":"Monthly2!S12","v":220},196,208,5,null,6,{"$f":"IF(B12=0,\"\",TOPTEN($AE$7:$AE$36,$B$7:$B$36,6,FALSE))","v":"اسم الطالب 14"},{"$f":"IF(B12=0,\"\",TOPTEN($AE$7:$AE$36,$B$7:$B$36,6,TRUE))","v":"السادس"}]
[{"$f":"IF(B13<>0,[1]STName!A13,\"\")","v":7},{"$f":"[1]STName!B13","v":"اسم الطالب 7"},13,13,18,14,7,6,17,14,12,19,20,15,7,6,6,7,194,14.923076923076923,10,"B","ناجح",null,7,{"$f":"IF(B13=\"\",\"\",TOPTEN($S$7:$S$36,$B$7:$B$36,7,FALSE))","v":"اسم الطالب 6"},{"$f":"IF(C13=\"\",\"\",TOPTEN($S$7:$S$36,$B$7:$B$36,7,TRUE))","v":"السابع"},null,{"$f":"Monthly2!S13","v":195},194,194.5,8,null,7,{"$f":"IF(B13=0,\"\",TOPTEN($AE$7:$AE$36,$B$7:$B$36,7,FALSE))","v":"اسم الطالب 15"},{"$f":"IF(B13=0,\"\",TOPTEN($AE$7:$AE$36,$B$7:$B$36,7,TRUE))","v":"السابع"}]
[{"$f":"IF(B14<>0,[1]STName!A14,\"\")","v":8},{"$f":"[1]STName!B14","v":"اسم الطالب 8"},8,16,13,13,2,7,14,20,12,19,19,2,7,6,7,7,172,13.23076923076923,11,"B","ناجح",null,8,{"$f":"IF(B14=\"\",0,TOPTEN($S$7:$S$36,$B$7:$B$36,8,FALSE))","v":"اسم الطالب 13"},{"$f":"IF(C14=\"\",0,TOPTEN($S$7:$S$36,$B$7:$B$36,8,TRUE))","v":"الثامن"},null,{"$f":"Monthly2!S14","v":166},172,169,15,null,8,{"$f":"IF(B14=0,\"\",TOPTEN($AE$7:$AE$36,$B$7:$B$36,8,FALSE))","v":"اسم الطالب 7"},{"$f":"IF(B14=0,\"\",TOPTEN($AE$7:$AE$36,$B$7:$B$36,8,TRUE))","v":"الثامن"}]
[{"$f":"IF(B15<>0,[1]STName!A15,\"\")","v":9},{"$f":"[1]STName!B15","v":"اسم الطالب 9"},12,19,19,15,7,7,2,2,2,5,2,1,7,7,8,7,122,9.384615384615385,18,"D","راسب",null,9,{"$f":"IF(B15=0,\"\",TOPTEN($S$7:$S$36,$B$7:$B$36,9,FALSE))","v":"اسم الطالب 14"},{"$f":"IF(C15=0,\"\",TOPTEN($S$7:$S$36,$B$7:$B$36,9,TRUE))","v":"الثامن مكرر"},null,{"$f":"Monthly2!S15","v":210},122,166,16,null,9,{"$f":"IF(B15=0,\"\",TOPTEN($AE$7:$AE$36,$B$7:$B$36,9,FALSE))","v":"اسم الطالب 2"},{"$f":"IF(B15=0,\"\",TOPTEN($AE$7:$AE$36,$B$7:$B$36,9,TRUE))","v":"التاسع"}]
[{"$f":"IF(B16<>0,[1]STName!A16,\"\")","v":10},{"$f":"[1]STName!B16","v":"اسم الطالب 10"},14,20,19,15,7,7,20,20,12,20,20,15,7,6,6,7,215,16.53846153846154,4,"A","ناجح",null,10,{"$f":"IF(B16=0,\"\",TOPTEN($S$7:$S$36,$B$7:$B$36,10,FALSE))","v":"اسم الطالب 7"},{"$f":"IF(C16=0,\"\",TOPTEN($S$7:$S$36,$B$7:$B$36,10,TRUE))","v":"العاشر"},null,{"$f":"Monthly2!S16","v":219},215,217,1,null,10,{"$f":"IF(B16=0,\"\",TOPTEN($AE$7:$AE$36,$B$7:$B$36,10,FALSE))","v":"اسم الطالب 4"},{"$f":"IF(B16=0,\"\",TOPTEN($AE$7:$AE$36,$B$7:$B$36,10,TRUE))","v":"العاشر"}]
[{"$f":"IF(B17<>0,[1]STName!A17,\"\")","v":11},{"$f":"[1]STName!B17","v":"اسم الطالب 11"},6,12,11,12,5,5,9,8,9,12,10,6,6,5,8,7,131,10.076923076923077,15,"C","ناجح",null,11,{"$f":"IF(B17=0,\"\",TOPTEN($S$7:$S$36,$B$7:$B$36,11,FALSE))","v":"اسم الطالب 8"},{"$f":"IF(C17=0,\"\",TOPTEN($S$7:$S$36,$B$7:$B$36,11,TRUE))","v":"الحادى عشر"},null,{"$f":"Monthly2!S17","v":130},131,130.5,19,null,11,{"$f":"IF(B17=0,\"\",TOPTEN($AE$7:$AE$36,$B$7:$B$36,11,FALSE))","v":"اسم الطالب 17"},{"$f":"IF(B17=0,\"\",TOPTEN($AE$7:$AE$36,$B$7:$B$36,11,TRUE))","v":"العاشر مكرر"}]
[{"$f":"IF(B18<>0,[1]STName!A18,\"\")","v":12},{"$f":"[1]STName!B18","v":"اسم الطالب 12"},14,20,20,14,7,7,20,20,13,20,20,15,7,7,7,7,218,16.76923076923077,1,"A","ناجح",null,12,{"$f":"IF(B18=0,\"\",TOPTEN($S$7:$S$36,$B$7:$B$36,12,FALSE))","v":"اسم الطالب 15"},{"$f":"IF(C18=0,\"\",TOPTEN($S$7:$S$36,$B$7:$B$36,12,TRUE))","v":"الحادى عشر مكرر"},null,{"$f":"Monthly2!S18","v":202},218,210,4,null,12,{"$f":"IF(B18=0,\"\",TOPTEN($AE$7:$AE$36,$B$7:$B$36,12,FALSE))","v":"اسم الطالب 3"},{"$f":"IF(B18=0,\"\",TOPTEN($AE$7:$AE$36,$B$7:$B$36,12,TRUE))","v":"الثانى عشر"}]
[{"$f":"IF(B19<>0,[1]STName!A19,\"\")","v":13},{"$f":"[1]STName!B19","v":"اسم الطالب 13"},13,13,18,14,7,6,17,14,12,19,20,15,7,6,7,7,195,15,8,"A","ناجح",null,13,{"$f":"IF(B19=0,\"\",TOPTEN($S$7:$S$36,$B$7:$B$36,13,FALSE))","v":"اسم الطالب 17"},{"$f":"IF(C19=0,\"\",TOPTEN($S$7:$S$36,$B$7:$B$36,13,TRUE))","v":"الحادى عشر مكرر"},null,{"$f":"Monthly2!S19","v":166},195,180.5,12,null,13,{"$f":"IF(B19=0,\"\",TOPTEN($AE$7:$AE$36,$B$7:$B$36,13,FALSE))","v":"اسم الطالب 13"},{"$f":"IF(B19=0,\"\",TOPTEN($AE$7:$AE$36,$B$7:$B$36,13,TRUE))","v":"الثانى عشر مكرر"}]
[{"$f":"IF(B20<>0,[1]STName!A20,\"\")","v":14},{"$f":"[1]STName!B20","v":"اسم الطالب 14"},13,13,18,14,7,6,17,14,12,19,20,15,7,6,7,7,195,15,8,"A","ناجح",null,14,{"$f":"IF(B20=0,\"\",TOPTEN($S$7:$S$36,$B$7:$B$36,14,FALSE))","v":"اسم الطالب 3"},{"$f":"IF(C20=0,\"\",TOPTEN($S$7:$S$36,$B$7:$B$36,14,TRUE))","v":"الرايع عشر"},null,{"$f":"Monthly2!S20","v":208},195,201.5,6,null,14,{"$f":"IF(B20=0,\"\",TOPTEN($AE$7:$AE$36,$B$7:$B$36,14,FALSE))","v":"اسم الطالب 1"},{"$f":"IF(B20=0,\"\",TOPTEN($AE$7:$AE$36,$B$7:$B$36,14,TRUE))","v":"الرايع عشر"}]
[{"$f":"IF(B21<>0,[1]STName!A21,\"\")","v":15},{"$f":"[1]STName!B21","v":"اسم الطالب 15"},8,16,13,13,2,7,14,20,12,19,19,2,7,6,7,7,172,13.23076923076923,11,"B","ناجح",null,15,{"$f":"IF(B21=0,\"\",TOPTEN($S$7:$S$36,$B$7:$B$36,15,FALSE))","v":"اسم الطالب 11"},{"$f":"IF(C21=0,\"\",TOPTEN($S$7:$S$36,$B$7:$B$36,15,TRUE))","v":"الخامس عشر"},null,{"$f":"Monthly2!S21","v":218},172,195,7,null,15,{"$f":"IF(B21=0,\"\",TOPTEN($AE$7:$AE$36,$B$7:$B$36,15,FALSE))","v":"اسم الطالب 8"},{"$f":"IF(B21=0,\"\",TOPTEN($AE$7:$AE$36,$B$7:$B$36,15,TRUE))","v":"الخامس عشر"}]
[{"$f":"IF(B22<>0,[1]STName!A22,\"\")","v":16},{"$f":"[1]STName!B22","v":"اسم الطالب 16"},12,19,19,15,7,7,2,2,2,5,2,1,7,7,7,7,121,9.3076923076923084,19,"D","راسب",null,16,{"$f":"IF(B22=0,\"\",TOPTEN($S$7:$S$36,$B$7:$B$36,16,FALSE))","v":"اسم الطالب 1"},{"$f":"IF(C22=0,\"\",TOPTEN($S$7:$S$36,$B$7:$B$36,16,TRUE))","v":"السادس عشر"},null,{"$f":"Monthly2!S22","v":130},121,125.5,20,null,16,{"$f":"IF(B22=0,\"\",TOPTEN($AE$7:$AE$36,$B$7:$B$36,16,FALSE))","v":"اسم الطالب 9"},{"$f":"IF(B22=0,\"\",TOPTEN($AE$7:$AE$36,$B$7:$B$36,16,TRUE))","v":"السادس عشر"}]
[{"$f":"IF(B23<>0,[1]STName!A23,\"\")","v":17},{"$f":"[1]STName!B23","v":"اسم الطالب 17"},8,16,13,13,2,7,14,20,12,19,19,2,7,6,7,7,172,13.23076923076923,11,"B","ناجح",null,17,{"$f":"IF(B23=0,\"\",TOPTEN($S$7:$S$36,$B$7:$B$36,17,FALSE))","v":"اسم الطالب 20"},{"$f":"IF(C23=0,\"\",TOPTEN($S$7:$S$36,$B$7:$B$36,17,TRUE))","v":"السادس عشر مكرر"},null,{"$f":"Monthly2!S23","v":202},172,187,10,null,17,{"$f":"IF(B23=0,\"\",TOPTEN($AE$7:$AE$36,$B$7:$B$36,17,FALSE))","v":"اسم الطالب 18"},{"$f":"IF(B23=0,\"\",TOPTEN($AE$7:$AE$36,$B$7:$B$36,17,TRUE))","v":"السابع عشر"}]
[{"$f":"IF(B24<>0,[1]STName!A24,\"\")","v":18},{"$f":"[1]STName!B24","v":"اسم الطالب 18"},12,19,19,15,5,7,2,2,2,5,2,1,7,7,7,7,119,9.1538461538461533,20,"D","راسب",null,18,{"$f":"IF(B24=0,\"\",TOPTEN($S$7:$S$36,$B$7:$B$36,18,FALSE))","v":"اسم الطالب 9"},{"$f":"IF(C24=0,\"\",TOPTEN($S$7:$S$36,$B$7:$B$36,18,TRUE))","v":"الثامن عشر"},null,{"$f":"Monthly2!S24","v":166},119,142.5,17,null,18,{"$f":"IF(B24=0,\"\",TOPTEN($AE$7:$AE$36,$B$7:$B$36,18,FALSE))","v":"اسم الطالب 20"},{"$f":"IF(B24=0,\"\",TOPTEN($AE$7:$AE$36,$B$7:$B$36,18,TRUE))","v":"الثامن عشر"}]
[{"$f":"IF(B25<>0,[1]STName!A25,\"\")","v":19},{"$f":"[1]STName!B25","v":"اسم الطالب 19"},14,20,19,15,7,7,20,20,12,20,20,15,7,6,7,7,216,16.615384615384617,2,"A","ناجح",null,19,{"$f":"IF(B25=0,\"\",TOPTEN($S$7:$S$36,$B$7:$B$36,19,FALSE))","v":"اسم الطالب 16"},{"$f":"IF(C25=0,\"\",TOPTEN($S$7:$S$36,$B$7:$B$36,19,TRUE))","v":"التاسع عشر"},null,{"$f":"Monthly2!S25","v":208},216,212,2,null,19,{"$f":"IF(B25=0,\"\",TOPTEN($AE$7:$AE$36,$B$7:$B$36,19,FALSE))","v":"اسم الطالب 11"},{"$f":"IF(B25=0,\"\",TOPTEN($AE$7:$AE$36,$B$7:$B$36,19,TRUE))","v":"التاسع عشر"}]
[{"$f":"IF(B26<>0,[1]STName!A26,\"\")","v":20},{"$f":"[1]STName!B26","v":"اسم الطالب 20"},6,12,11,12,5,5,9,8,9,12,10,6,6,5,7,7,130,10,16,"C","ناجح",null,20,{"$f":"IF(B26=0,\"\",TOPTEN($S$7:$S$36,$B$7:$B$36,20,FALSE))","v":"اسم الطالب 18"},{"$f":"IF(C26=0,\"\",TOPTEN($S$7:$S$36,$B$7:$B$36,20,TRUE))","v":"العشرون"},null,{"$f":"Monthly2!S26","v":136},130,133,18,null,20,{"$f":"IF(B26=0,\"\",TOPTEN($AE$7:$AE$36,$B$7:$B$36,20,FALSE))","v":"اسم الطالب 16"},{"$f":"IF(B26=0,\"\",TOPTEN($AE$7:$AE$36,$B$7:$B$36,20,TRUE))","v":"العشرون"}]
[{"$f":"IF(B27<>0,[1]STName!A27,\"\")","v":""},{"$f":"[1]STName!B27","v":0},null,null,null,null,null,null,null,null,null,null,null,null,null,null,null,null,"","","","","",null,21,{"$f":"IF(B27=0,\"\",TOPTEN($S$7:$S$36,$B$7:$B$36,21,FALSE))","v":""},{"$f":"IF(C27=0,\"\",TOPTEN($S$7:$S$36,$B$7:$B$36,21,TRUE))","v":""},null,{"$f":"Monthly2!S27","v":""},"","","",null,21,{"$f":"IF(B27=0,\"\",TOPTEN($AE$7:$AE$36,$B$7:$B$36,21,FALSE))","v":""},{"$f":"IF(B27=0,\"\",TOPTEN($AE$7:$AE$36,$B$7:$B$36,21,TRUE))","v":""}]
[{"$f":"IF(B28<>0,[1]STName!A28,\"\")","v":""},{"$f":"[1]STName!B28","v":0},null,null,null,null,null,null,null,null,null,null,null,null,null,null,null,null,"","","","","",null,22,{"$f":"IF(B28=0,\"\",TOPTEN($S$7:$S$36,$B$7:$B$36,22,FALSE))","v":""},{"$f":"IF(C28=0,\"\",TOPTEN($S$7:$S$36,$B$7:$B$36,22,TRUE))","v":""},null,{"$f":"Monthly2!S28","v":""},"","","",null,22,{"$f":"IF(B28=0,\"\",TOPTEN($AE$7:$AE$36,$B$7:$B$36,22,FALSE))","v":""},{"$f":"IF(B28=0,\"\",TOPTEN($AE$7:$AE$36,$B$7:$B$36,22,TRUE))","v":""}]
[{"$f":"IF(B29<>0,[1]STName!A29,\"\")","v":""},{"$f":"[1]STName!B29","v":0},null,null,null,null,null,null,null,null,null,null,null,null,null,null,null,null,"","","","","",null,23,{"$f":"IF(B29=0,\"\",TOPTEN($S$7:$S$36,$B$7:$B$36,23,FALSE))","v":""},{"$f":"IF(C29=0,\"\",TOPTEN($S$7:$S$36,$B$7:$B$36,23,TRUE))","v":""},null,{"$f":"Monthly2!S29","v":""},"","","",null,23,{"$f":"IF(B29=0,\"\",TOPTEN($AE$7:$AE$36,$B$7:$B$36,23,FALSE))","v":""},{"$f":"IF(B29=0,\"\",TOPTEN($AE$7:$AE$36,$B$7:$B$36,23,TRUE))","v":""}]
[{"$f":"IF(B30<>0,[1]STName!A30,\"\")","v":""},{"$f":"[1]STName!B30","v":0},null,null,null,null,null,null,null,null,null,null,null,null,null,null,null,null,"","","","","",null,24,{"$f":"IF(B30=0,\"\",TOPTEN($S$7:$S$36,$B$7:$B$36,24,FALSE))","v":""},{"$f":"IF(C30=0,\"\",TOPTEN($S$7:$S$36,$B$7:$B$36,24,TRUE))","v":""},null,{"$f":"Monthly2!S30","v":""},"","","",null,24,{"$f":"IF(B30=0,\"\",TOPTEN($AE$7:$AE$36,$B$7:$B$36,24,FALSE))","v":""},{"$f":"IF(B30=0,\"\",TOPTEN($AE$7:$AE$36,$B$7:$B$36,24,TRUE))","v":""}]
[{"$f":"IF(B31<>0,[1]STName!A31,\"\")","v":""},{"$f":"[1]STName!B31","v":0},null,null,null,null,null,null,null,null,null,null,null,null,null,null,null,null,"","","","","",null,25,{"$f":"IF(B31=0,\"\",TOPTEN($S$7:$S$36,$B$7:$B$36,25,FALSE))","v":""},{"$f":"IF(C31=0,\"\",TOPTEN($S$7:$S$36,$B$7:$B$36,25,TRUE))","v":""},null,{"$f":"Monthly2!S31","v":""},"","","",null,25,{"$f":"IF(B31=0,\"\",TOPTEN($AE$7:$AE$36,$B$7:$B$36,25,FALSE))","v":""},{"$f":"IF(B31=0,\"\",TOPTEN($AE$7:$AE$36,$B$7:$B$36,25,TRUE))","v":""}]
[{"$f":"IF(B32<>0,[1]STName!A32,\"\")","v":""},{"$f":"[1]STName!B32","v":0},null,null,null,null,null,null,null,null,null,null,null,null,null,null,null,null,"","","","","",null,26,{"$f":"IF(B32=0,\"\",TOPTEN($S$7:$S$36,$B$7:$B$36,26,FALSE))","v":""},{"$f":"IF(C32=0,\"\",TOPTEN($S$7:$S$36,$B$7:$B$36,26,TRUE))","v":""},null,{"$f":"Monthly2!S32","v":""},"","","",null,26,{"$f":"IF(B32=0,\"\",TOPTEN($AE$7:$AE$36,$B$7:$B$36,26,FALSE))","v":""},{"$f":"IF(B32=0,\"\",TOPTEN($AE$7:$AE$36,$B$7:$B$36,26,TRUE))","v":""}]
[{"$f":"IF(B33<>0,[1]STName!A33,\"\")","v":""},{"$f":"[1]STName!B33","v":0},null,null,null,null,null,null,null,null,null,null,null,null,null,null,null,null,"","","","","",null,27,{"$f":"IF(B33=0,\"\",TOPTEN($S$7:$S$36,$B$7:$B$36,27,FALSE))","v":""},{"$f":"IF(C33=0,\"\",TOPTEN($S$7:$S$36,$B$7:$B$36,27,TRUE))","v":""},null,{"$f":"Monthly2!S33","v":""},"","","",null,27,{"$f":"IF(B33=0,\"\",TOPTEN($AE$7:$AE$36,$B$7:$B$36,27,FALSE))","v":""},{"$f":"IF(B33=0,\"\",TOPTEN($AE$7:$AE$36,$B$7:$B$36,27,TRUE))","v":""}]
[{"$f":"IF(B34<>0,[1]STName!A34,\"\")","v":""},{"$f":"[1]STName!B34","v":0},null,null,null,null,null,null,null,null,null,null,null,null,null,null,null,null,"","","","","",null,28,{"$f":"IF(B34=0,\"\",TOPTEN($S$7:$S$36,$B$7:$B$36,28,FALSE))","v":""},{"$f":"IF(C34=0,\"\",TOPTEN($S$7:$S$36,$B$7:$B$36,28,TRUE))","v":""},null,{"$f":"Monthly2!S34","v":""},"","","",null,28,{"$f":"IF(B34=0,\"\",TOPTEN($AE$7:$AE$36,$B$7:$B$36,28,FALSE))","v":""},{"$f":"IF(B34=0,\"\",TOPTEN($AE$7:$AE$36,$B$7:$B$36,28,TRUE))","v":""}]
[{"$f":"IF(B35<>0,[1]STName!A35,\"\")","v":""},{"$f":"[1]STName!B35","v":0},null,null,null,null,null,null,null,null,null,null,null,null,null,null,null,null,"","","","","",null,29,{"$f":"IF(B35=0,\"\",TOPTEN($S$7:$S$36,$B$7:$B$36,29,FALSE))","v":""},{"$f":"IF(C35=0,\"\",TOPTEN($S$7:$S$36,$B$7:$B$36,29,TRUE))","v":""},null,{"$f":"Monthly2!S35","v":""},"","","",null,29,{"$f":"IF(B35=0,\"\",TOPTEN($AE$7:$AE$36,$B$7:$B$36,29,FALSE))","v":""},{"$f":"IF(B35=0,\"\",TOPTEN($AE$7:$AE$36,$B$7:$B$36,29,TRUE))","v":""}]
[{"$f":"IF(B36<>0,[1]STName!A36,\"\")","v":""},{"$f":"[1]STName!B36","v":0},null,null,null,null,null,null,null,null,null,null,null,null,null,null,null,null,"","","","","",null,30,{"$f":"IF(B36=0,\"\",TOPTEN($S$7:$S$36,$B$7:$B$36,30,FALSE))","v":""},{"$f":"IF(C36=0,\"\",TOPTEN($S$7:$S$36,$B$7:$B$36,30,TRUE))","v":""},null,{"$f":"Monthly2!S36","v":""},"","","",null,30,{"$f":"IF(B36=0,\"\",TOPTEN($AE$7:$AE$36,$B$7:$B$36,30,FALSE))","v":""},{"$f":"IF(B36=0,\"\",TOPTEN($AE$7:$AE$36,$B$7:$B$36,30,TRUE))","v":""}]
[]
[null,"أعلى علامة",{"$f":"MAX(C7:C36)","v":14},{"$f":"MAX(D7:D36)","v":20},20,15,7,7,20,20,13,20,20,15,7,7,8,7,218,16.76923076923077]
[null,"أدنى علامة",{"$f":"MIN(C7:C36)","v":6},{"$f":"MIN(D7:D36)","v":12},11,12,2,5,2,2,2,5,2,1,6,5,5,7,119,9.1538461538461533]
[null,"عدد الناجحين",{"$f":"COUNTIF(C7:C36,\">=\"&C6/2)","v":13},20,20,20,17,20,14,13,14,17,17,11,20,20,20,20,{"$f":"COUNTIF(S7:S36,\">=\"&S6/2)","v":17},{"$f":"COUNTIF(T7:T36,\">=10\")","v":17}]
[null,"عدد الراسبين",{"$f":"COUNTIF(C7:C37,\"<\"&C6/2)","v":7},0,0,0,3,0,6,7,6,3,3,9,0,0,0,0,{"$f":"COUNTIF(S7:S37,\"<\"&S6/2)","v":3},{"$f":"COUNTIF(T7:T37,\"<10\")","v":3}]

{"sheet":"الشهادة","index":5,"n_rows":36,"n_cols":9,"rows_kept":36,"cut":false,"hidden":false,"merged":[[0,7,0,8],[0,5,0,6],[1,7,1,8],[1,5,1,6],[3,0,3,8],[4,0,4,8],[35,0,35,2],[34,0,34,8],[35,6,35,8],[10,6,10,8],[8,1,8,3]]}
[null,null,null,null,null,"بحث برقم الطالب",null,"إجمالي الشهادات"]
[null,null,null,null,null,19,null,{"$f":"COUNTIF(Monthly1!A7:A36,\">0\")","v":20}]
[]
[{"$f":"STName!A1","v":"اسم المدرسة"}]
[{"$f":"STName!A2","v":"Academic Year: 2024-2025"}]
["Class",{"$f":"STName!N3","v":"Grade 01"}]
["Section",{"$f":"STName!J3&\"  \"&STName!H3","v":"A  Moon"}]
["Student Number",{"$f":"LOOKUP(F2,Monthly1!A7:A36,Monthly1!A7:A36)","v":19},"from ",{"$f":"H2","v":20}]
["Student Name",{"$f":"LOOKUP(B8,Monthly1!A7:A36,Monthly1!B7:B36)","v":"اسم الطالب 19"}]
[]
[null,null,null,null,null,null,"   الشويفات/ هاتف: 05/000000"]
["Subject","Max Mark","Monthly1","Mid Year Exam","Semester One Average","Monthly2","Final Exam","Semester Two Average","Total Average"]
["Reading",20,{"$f":"IF($B$8=\"\",\"\",IFERROR(1/(1/INDEX(Monthly1,$B$8,3)),\"\"))","v":14},{"$f":"IF($B$8=\"\",\"\",IFERROR(1/(1/INDEX(MidYear,$B$8,3)),\"\"))","v":14},{"$f":"IF((C13<>\"\")*AND(D13<>\"\"),CEILING(AVERAGE(C13,D13),1),\"\")","v":14},{"$f":"IF($B$8=\"\",\"\",IFERROR(1/(1/INDEX(Monthly2,$B$8,3)),\"\"))","v":13},{"$f":"IF($B$8=\"\",\"\",IFERROR(1/(1/INDEX(FinalYear,$B$8,3)),\"\"))","v":14},{"$f":"IF((F13<>\"\")*AND(G13<>\"\"),CEILING(AVERAGE(F13,G13),1),\"\")","v":14},{"$f":"IF((E13<>\"\")*AND(H13<>\"\"),CEILING(AVERAGE(E13,H13),1),\"\")","v":14}]
["Grammar",20,{"$f":"IF($B$8=\"\",\"\",IFERROR(1/(1/INDEX(Monthly1,$B$8,4)),\"\"))","v":20},{"$f":"IF($B$8=\"\",\"\",IFERROR(1/(1/INDEX(MidYear,$B$8,4)),\"\"))","v":20},20,{"$f":"IF($B$8=\"\",\"\",IFERROR(1/(1/INDEX(Monthly2,$B$8,4)),\"\"))","v":20},{"$f":"IF($B$8=\"\",\"\",IFERROR(1/(1/INDEX(FinalYear,$B$8,4)),\"\"))","v":20},{"$f":"IF((F14<>\"\")*AND(G14<>\"\"),CEILING(AVERAGE(F14,G14),1),\"\")","v":20},20]
["Dictation",20,{"$f":"IF($B$8=\"\",\"\",IFERROR(1/(1/INDEX(Monthly1,$B$8,5)),\"\"))","v":20},{"$f":"IF($B$8=\"\",\"\",IFERROR(1/(1/INDEX(MidYear,$B$8,5)),\"\"))","v":19},20,{"$f":"IF($B$8=\"\",\"\",IFERROR(1/(1/INDEX(Monthly2,$B$8,5)),\"\"))","v":19},{"$f":"IF($B$8=\"\",\"\",IFERROR(1/(1/INDEX(FinalYear,$B$8,5)),\"\"))","v":19},19,20]
["Comp + Conv",20,{"$f":"IF($B$8=\"\",\"\",IFERROR(1/(1/INDEX(Monthly1,$B$8,6)),\"\"))","v":14},{"$f":"IF($B$8=\"\",\"\",IFERROR(1/(1/INDEX(MidYear,$B$8,6)),\"\"))","v":15},15,{"$f":"IF($B$8=\"\",\"\",IFERROR(1/(1/INDEX(Monthly2,$B$8,6)),\"\"))","v":14},{"$f":"IF($B$8=\"\",\"\",IFERROR(1/(1/INDEX(FinalYear,$B$8,6)),\"\"))","v":15},15,15]
["Poetry",10,{"$f":"IF($B$8=\"\",\"\",IFERROR(1/(1/INDEX(Monthly1,$B$8,7)),\"\"))","v":7},{"$f":"IF($B$8=\"\",\"\",IFERROR(1/(1/INDEX(MidYear,$B$8,7)),\"\"))","v":7},7,{"$f":"IF($B$8=\"\",\"\",IFERROR(1/(1/INDEX(Monthly2,$B$8,7)),\"\"))","v":7},{"$f":"IF($B$8=\"\",\"\",IFERROR(1/(1/INDEX(FinalYear,$B$8,7)),\"\"))","v":7},7,7]
["Handwriting",10,{"$f":"IF($B$8=\"\",\"\",IFERROR(1/(1/INDEX(Monthly1,$B$8,8)),\"\"))","v":7},{"$f":"IF($B$8=\"\",\"\",IFERROR(1/(1/INDEX(MidYear,$B$8,8)),\"\"))","v":7},7,{"$f":"IF($B$8=\"\",\"\",IFERROR(1/(1/INDEX(Monthly2,$B$8,8)),\"\"))","v":7},{"$f":"IF($B$8=\"\",\"\",IFERROR(1/(1/INDEX(FinalYear,$B$8,8)),\"\"))","v":7},7,7]
["Science",20,{"$f":"IF($B$8=\"\",\"\",IFERROR(1/(1/INDEX(Monthly1,$B$8,9)),\"\"))","v":20},{"$f":"IF($B$8=\"\",\"\",IFERROR(1/(1/INDEX(MidYear,$B$8,9)),\"\"))","v":20},20,{"$f":"IF($B$8=\"\",\"\",IFERROR(1/(1/INDEX(Monthly2,$B$8,9)),\"\"))","v":19},{"$f":"IF($B$8=\"\",\"\",IFERROR(1/(1/INDEX(FinalYear,$B$8,9)),\"\"))","v":20},20,20]
["Mathematics",20,{"$f":"IF($B$8=\"\",\"\",IFERROR(1/(1/INDEX(Monthly1,$B$8,10)),\"\"))","v":20},{"$f":"IF($B$8=\"\",\"\",IFERROR(1/(1/INDEX(MidYear,$B$8,10)),\"\"))","v":20},20,{"$f":"IF($B$8=\"\",\"\",IFERROR(1/(1/INDEX(Monthly2,$B$8,10)),\"\"))","v":17},{"$f":"IF($B$8=\"\",\"\",IFERROR(1/(1/INDEX(FinalYear,$B$8,10)),\"\"))","v":20},19,20]
["القراءة",20,{"$f":"IF($B$8=\"\",\"\",IFERROR(1/(1/INDEX(Monthly1,$B$8,11)),\"\"))","v":13},{"$f":"IF($B$8=\"\",\"\",IFERROR(1/(1/INDEX(MidYear,$B$8,11)),\"\"))","v":12},13,{"$f":"IF($B$8=\"\",\"\",IFERROR(1/(1/INDEX(Monthly2,$B$8,11)),\"\"))","v":12},{"$f":"IF($B$8=\"\",\"\",IFERROR(1/(1/INDEX(FinalYear,$B$8,11)),\"\"))","v":12},12,13]
["القواعد",20,{"$f":"IF($B$8=\"\",\"\",IFERROR(1/(1/INDEX(Monthly1,$B$8,12)),\"\"))","v":20},{"$f":"IF($B$8=\"\",\"\",IFERROR(1/(1/INDEX(MidYear,$B$8,12)),\"\"))","v":20},20,{"$f":"IF($B$8=\"\",\"\",IFERROR(1/(1/INDEX(Monthly2,$B$8,12)),\"\"))","v":19},{"$f":"IF($B$8=\"\",\"\",IFERROR(1/(1/INDEX(FinalYear,$B$8,12)),\"\"))","v":20},20,20]
["الإملاء",20,{"$f":"IF($B$8=\"\",\"\",IFERROR(1/(1/INDEX(Monthly1,$B$8,13)),\"\"))","v":20},{"$f":"IF($B$8=\"\",\"\",IFERROR(1/(1/INDEX(MidYear,$B$8,13)),\"\"))","v":20},20,{"$f":"IF($B$8=\"\",\"\",IFERROR(1/(1/INDEX(Monthly2,$B$8,13)),\"\"))","v":20},{"$f":"IF($B$8=\"\",\"\",IFERROR(1/(1/INDEX(FinalYear,$B$8,13)),\"\"))","v":20},20,20]
["التعبير والمحادثة",20,{"$f":"IF($B$8=\"\",\"\",IFERROR(1/(1/INDEX(Monthly1,$B$8,14)),\"\"))","v":15},{"$f":"IF($B$8=\"\",\"\",IFERROR(1/(1/INDEX(MidYear,$B$8,14)),\"\"))","v":15},15,{"$f":"IF($B$8=\"\",\"\",IFERROR(1/(1/INDEX(Monthly2,$B$8,14)),\"\"))","v":14},{"$f":"IF($B$8=\"\",\"\",IFERROR(1/(1/INDEX(FinalYear,$B$8,14)),\"\"))","v":15},15,15]
["المحفوظات",10,{"$f":"IF($B$8=\"\",\"\",IFERROR(1/(1/INDEX(Monthly1,$B$8,15)),\"\"))","v":7},{"$f":"IF($B$8=\"\",\"\",IFERROR(1/(1/INDEX(MidYear,$B$8,15)),\"\"))","v":7},7,{"$f":"IF($B$8=\"\",\"\",IFERROR(1/(1/INDEX(Monthly2,$B$8,15)),\"\"))","v":7},{"$f":"IF($B$8=\"\",\"\",IFERROR(1/(1/INDEX(FinalYear,$B$8,15)),\"\"))","v":7},7,7]
["الخط",10,{"$f":"IF($B$8=\"\",\"\",IFERROR(1/(1/INDEX(Monthly1,$B$8,16)),\"\"))","v":7},{"$f":"IF($B$8=\"\",\"\",IFERROR(1/(1/INDEX(MidYear,$B$8,16)),\"\"))","v":6},7,{"$f":"IF($B$8=\"\",\"\",IFERROR(1/(1/INDEX(Monthly2,$B$8,16)),\"\"))","v":6},{"$f":"IF($B$8=\"\",\"\",IFERROR(1/(1/INDEX(FinalYear,$B$8,16)),\"\"))","v":6},6,7]
["تربية مدنية",10,{"$f":"IF($B$8=\"\",\"\",IFERROR(1/(1/INDEX(Monthly1,$B$8,17)),\"\"))","v":7},{"$f":"IF($B$8=\"\",\"\",IFERROR(1/(1/INDEX(MidYear,$B$8,17)),\"\"))","v":7},7,{"$f":"IF($B$8=\"\",\"\",IFERROR(1/(1/INDEX(Monthly2,$B$8,17)),\"\"))","v":7},{"$f":"IF($B$8=\"\",\"\",IFERROR(1/(1/INDEX(FinalYear,$B$8,17)),\"\"))","v":7},7,7]
["Sport",10,{"$f":"IF($B$8=\"\",\"\",IFERROR(1/(1/INDEX(Monthly1,$B$8,18)),\"\"))","v":7},{"$f":"IF($B$8=\"\",\"\",IFERROR(1/(1/INDEX(MidYear,$B$8,18)),\"\"))","v":7},7,{"$f":"IF($B$8=\"\",\"\",IFERROR(1/(1/INDEX(Monthly2,$B$8,18)),\"\"))","v":7},{"$f":"IF($B$8=\"\",\"\",IFERROR(1/(1/INDEX(FinalYear,$B$8,18)),\"\"))","v":7},7,7]
["Total",{"$f":"IF(B13<>\"\",SUM(B13:B28),\"\")","v":260},{"$f":"IF($B$8=\"\",\"\",IFERROR(1/(1/INDEX(Monthly1,$B$8,19)),\"\"))","v":218},{"$f":"IF($B$8=\"\",\"\",IFERROR(1/(1/INDEX(MidYear,$B$8,19)),\"\"))","v":216},{"$f":"IF(E13<>\"\",SUM(E13:E28),\"\")","v":219},{"$f":"IF($B$8=\"\",\"\",IFERROR(1/(1/INDEX(Monthly2,$B$8,19)),\"\"))","v":208},{"$f":"IF($B$8=\"\",\"\",IFERROR(1/(1/INDEX(FinalYear,$B$8,19)),\"\"))","v":216},215,219]
["Average",{"$f":"IF(B29<>\"\",B29/13,\"\")","v":20},{"$f":"IF($B$8=\"\",\"\",IFERROR(1/(1/INDEX(Monthly1,$B$8,20)),\"\"))","v":16.76923076923077},{"$f":"IF($B$8=\"\",\"\",IFERROR(1/(1/INDEX(MidYear,$B$8,20)),\"\"))","v":16.615384615384617},{"$f":"IF(E29<>\"\",E29/13,\"\")","v":16.846153846153847},{"$f":"IF($B$8=\"\",\"\",IFERROR(1/(1/INDEX(Monthly2,$B$8,20)),\"\"))","v":16},{"$f":"IF($B$8=\"\",\"\",IFERROR(1/(1/INDEX(FinalYear,$B$8,20)),\"\"))","v":16.615384615384617},16.53846153846154,16.846153846153847]
["Rank",null,{"$f":"IF($B$8=\"\",\"\",IFERROR(1/(1/INDEX(Monthly1,$B$8,21)),\"\"))","v":2},{"$f":"IF($B$8=\"\",\"\",IFERROR(1/(1/INDEX(MidYear,$B$8,21)),\"\"))","v":3},null,{"$f":"IF($B$8=\"\",\"\",IFERROR(1/(1/INDEX(Monthly2,$B$8,21)),\"\"))","v":6},{"$f":"IF($B$8=\"\",\"\",IFERROR(1/(1/INDEX(FinalYear,$B$8,21)),\"\"))","v":2}]
["Evaluation",null,{"$f":"IF($B$8=\"\",\"\",IF(INDEX(Monthly1,$B$8,22)=0,\"\",INDEX(Monthly1,$B$8,22)))","v":"A"},{"$f":"IF($B$8=\"\",\"\",IF(INDEX(MidYear,$B$8,22)=0,\"\",INDEX(MidYear,$B$8,22)))","v":"A"},{"$f":"IF(E13<>\"\",IF(E30>=15,\"A\",IF(E30>=12,\"B\",IF(E30>=10,\"C\",IF(E30>=7.5,\"D\",\"E\")))),\"\")","v":"A"},{"$f":"IF($B$8=\"\",\"\",IF(INDEX(Monthly2,$B$8,22)=0,\"\",INDEX(Monthly2,$B$8,22)))","v":"A"},{"$f":"IF($B$8=\"\",\"\",IF(INDEX(FinalYear,$B$8,22)=0,\"\",INDEX(FinalYear,$B$8,22)))","v":"A"},"A","A"]
["Result",null,{"$f":"IF($B$8=\"\",\"\",IF(INDEX(Monthly1,$B$8,22)=0,\"\",INDEX(Monthly1,$B$8,23)))","v":"ناجح"},{"$f":"IF($B$8=\"\",\"\",IF(INDEX(MidYear,$B$8,22)=0,\"\",INDEX(MidYear,$B$8,23)))","v":"ناجح"},{"$f":"IF(E13<>\"\",IF(E30>=10,\"ناجح\",\"راسب\"),\"\")","v":"ناجح"},{"$f":"IF($B$8=\"\",\"\",IF(INDEX(Monthly2,$B$8,22)=0,\"\",INDEX(Monthly2,$B$8,23)))","v":"ناجح"},{"$f":"IF($B$8=\"\",\"\",IF(INDEX(FinalYear,$B$8,22)=0,\"\",INDEX(FinalYear,$B$8,23)))","v":"ناجح"},"ناجح","ناجح"]
[]
["(A>15 = جيد جداً)    (B>12 = جيد)    (C>10 = وسط)    (D>7.5 = غير مقبول)    (D<7.5 = ضعيف جداً)  "]
["ختم الإدارة",null,null,null,null,null,"توقيع الأهل"]