{"text_format":"1","workbook":"xlsx","n_sheets":6,"sheets":["STName","Monthly1","MidYear","Monthly2","FinalYear","الشهادة"],"not_rendered":{"charts":0,"images":0,"macros":1,"external_links":1,"defined_names":12,"comments":0,"pivot_tables":0},"unopened":[],"bounds":{"document_bytes":16777216,"sheet_cells":100000,"rows_first":2000,"rows_last":500,"rows_between":2000,"halvings":0,"cell_chars":16384,"cell_head_chars":4096},"cells_cut":0,"cells_raw":0,"read":"whole","date_system":"1900"}

{"sheet":"STName","index":0,"n_rows":36,"n_cols":17,"rows_kept":36,"cut":false,"hidden":false,"merged":[[0,0,0,17],[1,8,1,17],[1,0,1,7],[2,16,2,17],[2,13,2,15],[2,10,2,11],[2,7,2,8]]}
["اسم المدرسة"]
["Academic Year: 2024-2025",null,null,null,null,null,null,null,"Teacher:"]
[null,"2024-2025",null,null,null,null,null,"Moon",null,"A","Section:",null,null,"Grade 01",null,null,"Class:"]
[]
[]
[null,"اسم الطالب / أقصى علامة"]
[1,"اسم الطالب 1"]
[2,"اسم الطالب 2"]
[3,"اسم الطالب 3"]
[4,"اسم الطالب 4"]
[5,"اسم الطالب 5"]
[6,"اسم الطالب 6"]
[7,"اسم الطالب 7"]
[8,"اسم الطالب 8"]
[9,"اسم الطالب 9"]
{"$rows_left_out":22}
{"sheet":"Monthly1","index":1,"n_rows":41,"n_cols":27,"rows_kept":41,"cut":false,"hidden":false,"merged":[[0,0,0,22],[1,2,1,4],[2,2,2,4],[2,5,2,7],[1,16,1,19],[2,16,2,19],[1,20,1,22],[2,20,2,22]]}
[{"$f":"[1]STName!A1","v":"International Lessing School"}]
[null,"الصــــــــــــــــــــف:",{"$f":"[1]STName!N3","v":"Grade 02"},null,null,null,null,null,null,null,null,null,null,null,null,null,"العـام الدراســـي:",null,null,null,{"$f":"[1]STName!B3","v":"2024-2025"}]
[null,"الشــــــــــــــــــــعبة:",{"$f":"[1]STName!J3","v":"A"},null,null,{"$f":"[1]STName!H3","v":"Moon"},null,null,null,null,null,null,null,null,null,null,"عــلامــات شـهر:",null,null,null,"Monthly1"]
[]
["الرقم","اسم الطالب","Reading","Grammar","Dictation","Comp + Conv","Poetry","Handwriting","Science","Mathematics","القراءة","القواعد","الإملاء","التعبير والمحادثة","المحفوظات","الخط","تربية مدنية","Sport","المجموع","المعدل","الترتيب","الفئة","النتيجة",null,null,"ترتيب تصاعدي"]
[null,"العلامة القصوى",20,20,20,20,10,10,20,20,20,20,20,20,10,10,10,10,{"$f":"IF(C6<>0,SUM(C6:R6),\"\")","v":260},20]
[{"$f":"IF(B7<>0,[1]STName!A7,\"\")","v":1},{"$f":"[1]STName!B7","v":"اسم الطالب 1"},8,16,13,13,2,7,14,20,12,19,19,2,7,6,7,7,{"$f":"IF(C7<>0,SUM(C7:R7),\"\")","v":172},{"$f":"IF(C7<>0,S7/13,\"\")","v":13.23076923076923},{"$f":"IF(C7<>0,RANK(T7,$T$7:$T$36),\"\")","v":14},{"$f":"IF(C7<>0,IF(T7>=15,\"A\",IF(T7>=12,\"B\",IF(T7>=10,\"C\",IF(T7>=7.5,\"D\",\"E\")))),\"\")","v":"B"},{"$f":"IF(C7<>0,IF(T7>=10,\"ناجح\",\"راسب\"),\"\")","v":"ناجح"},null,1,{"$f":"IF(B7=0,\"\",TOPTEN($S$7:$S$36,$B$7:$B$36,1,FALSE))","v":"اسم الطالب 13"},{"$f":"IF(C7=0,\"\",TOPTEN($S$7:$S$36,$B$7:$B$36,1,TRUE))","v":"الأول"}]
[{"$f":"IF(B8<>0,[1]STName!A8,\"\")","v":2},{"$f":"[1]STName!B8","v":"اسم الطالب 2"},12,19,19,15,7,7,2,2,2,5,2,1,7,7,7,7,121,9.3076923076923084,{"$f":"IF(C8<>0,RANK(T8,$T$7:$T$36),\"\")","v":19},{"$f":"IF(C8<>0,IF(T8>=15,\"A\",IF(T8>=12,\"B\",IF(T8>=10,\"C\",IF(T8>=7.5,\"D\",\"E\")))),\"\")","v":"D"},{"$f":"IF(C8<>0,IF(T8>=10,\"ناجح\",\"راسب\"),\"\")","v":"راسب"},null,2,{"$f":"IF(B8=0,\"\",TOPTEN($S$7:$S$36,$B$7:$B$36,2,FALSE))","v":"اسم الطالب 7"},{"$f":"IF(C8=0,\"\",TOPTEN($S$7:$S$36,$B$7:$B$36,2,TRUE))","v":"الثاني"}]
[{"$f":"IF(B9<>0,[1]STName!A9,\"\")","v":3},{"$f":"[1]STName!B9","v":"اسم الطالب 3"},14,20,19,15,7,7,20,20,12,20,20,15,7,6,7,7,216,16.615384615384617,4,"A","ناجح",null,3,{"$f":"IF(B9=0,\"\",TOPTEN($S$7:$S$36,$B$7:$B$36,3,FALSE))","v":"اسم الطالب 19"},{"$f":"IF(C9=0,\"\",TOPTEN($S$7:$S$36,$B$7:$B$36,3,TRUE))","v":"الثاني مكرر"}]
[{"$f":"IF(B10<>0,[1]STName!A10,\"\")","v":4},{"$f":"[1]STName!B10","v":"اسم الطالب 4"},6,12,11,12,5,5,9,8,9,12,10,6,6,5,7,7,130,10,17,"C","ناجح",null,4,{"$f":"IF(B10=0,\"\",TOPTEN($S$7:$S$36,$B$7:$B$36,4,FALSE))","v":"اسم الطالب 3"},{"$f":"IF(C10=0,\"\",TOPTEN($S$7:$S$36,$B$7:$B$36,4,TRUE))","v":"الرابع"}]
[{"$f":"IF(B11<>0,[1]STName!A11,\"\")","v":5},{"$f":"[1]STName!B11","v":"اسم الطالب 5"},12,20,16,14,5,6,19,20,13,17,19,15,7,5,7,7,202,15.538461538461538,9,"A","ناجح",null,5,{"$f":"IF(B11=0,\"\",TOPTEN($S$7:$S$36,$B$7:$B$36,5,FALSE))","v":"اسم الطالب 10"},{"$f":"IF(C11=0,\"\",TOPTEN($S$7:$S$36,$B$7:$B$36,5,TRUE))","v":"الرابع مكرر"}]
[{"$f":"IF(B12<>0,[1]STName!A12,\"\")","v":6},{"$f":"[1]STName!B12","v":"اسم الطالب 6"},13,20,19,14,7,7,19,17,12,19,20,14,7,6,7,7,208,16,7,"A","ناجح",null,6,{"$f":"IF(B12=0,\"\",TOPTEN($S$7:$S$36,$B$7:$B$36,6,FALSE))","v":"اسم الطالب 14"},{"$f":"IF(C12=0,\"\",TOPTEN($S$7:$S$36,$B$7:$B$36,6,TRUE))","v":"السادس"}]
[{"$f":"IF(B13<>0,[1]STName!A13,\"\")","v":7},{"$f":"[1]STName!B13","v":"اسم الطالب 7"},14,20,20,14,7,7,20,20,13,20,20,15,7,7,7,7,218,16.76923076923077,2,"A","ناجح",null,7,{"$f":"IF(B13=\"\",\"\",TOPTEN($S$7:$S$36,$B$7:$B$36,7,FALSE))","v":"اسم الطالب 6"},{"$f":"IF(C13=\"\",\"\",TOPTEN($S$7:$S$36,$B$7:$B$36,7,TRUE))","v":"السابع"}]
[{"$f":"IF(B14<>0,[1]STName!A14,\"\")","v":8},{"$f":"[1]STName!B14","v":"اسم الطالب 8"},8,16,13,13,2,7,14,20,12,19,19,2,7,6,7,7,172,13.23076923076923,14,"B","ناجح",null,8,{"$f":"IF(B14=\"\",0,TOPTEN($S$7:$S$36,$B$7:$B$36,8,FALSE))","v":"اسم الطالب 18"},{"$f":"IF(C14=\"\",0,TOPTEN($S$7:$S$36,$B$7:$B$36,8,TRUE))","v":"السابع مكرر"}]
[{"$f":"IF(B15<>0,[1]STName!A15,\"\")","v":9},{"$f":"[1]STName!B15","v":"اسم الطالب 9"},12,19,19,15,7,7,2,2,2,5,2,1,7,7,7,7,121,9.3076923076923084,19,"D","راسب",null,9,{"$f":"IF(B15=0,\"\",TOPTEN($S$7:$S$36,$B$7:$B$36,9,FALSE))","v":"اسم الطالب 5"},{"$f":"IF(C15=0,\"\",TOPTEN($S$7:$S$36,$B$7:$B$36,9,TRUE))","v":"التاسع"}]
{"$rows_left_out":27}
{"sheet":"MidYear","index":2,"n_rows":41,"n_cols":36,"rows_kept":41,"cut":false,"hidden":false,"merged":[[0,0,0,22],[1,2,1,4],[2,2,2,4],[2,5,2,7],[1,16,1,19],[2,16,2,19],[1,20,1,22],[2,20,2,22]]}
[{"$f":"[1]STName!A1","v":"International Lessing School"}]
[null,"الصــــــــــــــــــــف:",{"$f":"[1]STName!N3","v":"Grade 02"},null,null,null,null,null,null,null,null,null,null,null,null,null,"العـام الدراســـي:",null,null,null,{"$f":"[1]STName!B3","v":"2024-2025"}]
[null,"الشــــــــــــــــــــعبة:",{"$f":"[1]STName!J3","v":"A"},null,null,{"$f":"[1]STName!H3","v":"Moon"},null,null,null,null,null,null,null,null,null,null,"عــلامــات شـهر:",null,null,null,"Monthly1"]
[]
["الرقم","اسم الطالب","Reading","Grammar","Dictation","Comp + Conv","Poetry","Handwriting","Science","Mathematics","القراءة","القواعد","الإملاء","التعبير والمحادثة","المحفوظات","الخط","تربية مدنية","Sport","المجموع","المعدل","الترتيب","الفئة","النتيجة",null,null,"ترتيب تصاعدي",null,null,"السعي الأول","نصف السنة","الفصل الأول","الترتيب",null,null,"ترتيب تصاعدي"]
[null,"العلامة القصوى",20,20,20,20,10,10,20,20,20,20,20,20,10,10,10,10,{"$f":"IF(C6<>0,SUM(C6:R6),\"\")","v":260},20,null,null,null,null,null,null,null,null,{"$f":"Monthly1!S6","v":260},{"$f":"S6","v":260},{"$f":"IF((AC6<>\"\")*AND(AD6<>\"\"),AVERAGE(AC6,AD6),\"\")","v":260}]
[{"$f":"IF(B7<>0,[1]STName!A7,\"\")","v":1},{"$f":"[1]STName!B7","v":"اسم الطالب 1"},12,20,20,15,7,6,20,17,12,20,20,15,7,5,7,7,{"$f":"IF(C7<>0,SUM(C7:R7),\"\")","v":210},{"$f":"IF(C7<>0,S7/13,\"\")","v":16.153846153846153},{"$f":"IF(C7<>0,RANK(T7,$T$7:$T$36),\"\")","v":5},{"$f":"IF(C7<>0,IF(T7>=15,\"A\",IF(T7>=12,\"B\",IF(T7>=10,\"C\",IF(T7>=7.5,\"D\",\"E\")))),\"\")","v":"A"},{"$f":"IF(C7<>0,IF(T7>=10,\"ناجح\",\"راسب\"),\"\")","v":"ناجح"},null,1,{"$f":"IF(B7=0,\"\",TOPTEN($S$7:$S$36,$B$7:$B$36,1,FALSE))","v":"اسم الطالب 6"},{"$f":"IF(C7=0,\"\",TOPTEN($S$7:$S$36,$B$7:$B$36,1,TRUE))","v":"الأول"},null,{"$f":"Monthly1!S7","v":172},210,{"$f":"IF((AC7<>\"\")*AND(AD7<>\"\"),AVERAGE(AC7,AD7),\"\")","v":191},{"$f":"IF(B7<>0,RANK(AE7,$AE$7:$AE$36),\"\")","v":12},null,1,{"$f":"IF(B7=0,\"\",TOPTEN($AE$7:$AE$36,$B$7:$B$36,1,FALSE))","v":"اسم الطالب 19"},{"$f":"IF(B7=0,\"\",TOPTEN($AE$7:$AE$36,$B$7:$B$36,1,TRUE))","v":"الأول"}]
[{"$f":"IF(B8<>0,[1]STName!A8,\"\")","v":2},{"$f":"[1]STName!B8","v":"اسم الطالب 2"},8,17,18,13,7,6,15,14,10,15,19,8,7,5,7,7,176,13.538461538461538,{"$f":"IF(C8<>0,RANK(T8,$T$7:$T$36),\"\")","v":12},{"$f":"IF(C8<>0,IF(T8>=15,\"A\",IF(T8>=12,\"B\",IF(T8>=10,\"C\",IF(T8>=7.5,\"D\",\"E\")))),\"\")","v":"B"},{"$f":"IF(C8<>0,IF(T8>=10,\"ناجح\",\"راسب\"),\"\")","v":"ناجح"},null,2,{"$f":"IF(B8=0,\"\",TOPTEN($S$7:$S$36,$B$7:$B$36,2,FALSE))","v":"اسم الطالب 15"},{"$f":"IF(C8=0,\"\",TOPTEN($S$7:$S$36,$B$7:$B$36,2,TRUE))","v":"الثاني"},null,{"$f":"Monthly1!S8","v":121},176,148.5,{"$f":"IF(B8<>0,RANK(AE8,$AE$7:$AE$36),\"\")","v":17},null,2,{"$f":"IF(B8=0,\"\",TOPTEN($AE$7:$AE$36,$B$7:$B$36,2,FALSE))","v":"اسم الطالب 10"},{"$f":"IF(B8=0,\"\",TOPTEN($AE$7:$AE$36,$B$7:$B$36,2,TRUE))","v":"الثاني"}]
[{"$f":"IF(B9<>0,[1]STName!A9,\"\")","v":3},{"$f":"[1]STName!B9","v":"اسم الطالب 3"},12,16,20,15,4,6,20,14,11,17,20,13,7,6,7,7,195,15,9,"A","ناجح",null,3,{"$f":"IF(B9=0,\"\",TOPTEN($S$7:$S$36,$B$7:$B$36,3,FALSE))","v":"اسم الطالب 10"},{"$f":"IF(C9=0,\"\",TOPTEN($S$7:$S$36,$B$7:$B$36,3,TRUE))","v":"الثالث"},null,{"$f":"Monthly1!S9","v":216},195,205.5,6,null,3,{"$f":"IF(B9=0,\"\",TOPTEN($AE$7:$AE$36,$B$7:$B$36,3,FALSE))","v":"اسم الطالب 6"},{"$f":"IF(B9=0,\"\",TOPTEN($AE$7:$AE$36,$B$7:$B$36,3,TRUE))","v":"الثالث"}]
[{"$f":"IF(B10<>0,[1]STName!A10,\"\")","v":4},{"$f":"[1]STName!B10","v":"اسم الطالب 4"},9,14,11,12,6,6,11,9,10,19,18,14,7,6,7,7,166,12.76923076923077,15,"B","ناجح",null,4,{"$f":"IF(B10=0,\"\",TOPTEN($S$7:$S$36,$B$7:$B$36,4,FALSE))","v":"اسم الطالب 19"},{"$f":"IF(C10=0,\"\",TOPTEN($S$7:$S$36,$B$7:$B$36,4,TRUE))","v":"الثالث مكرر"},null,{"$f":"Monthly1!S10","v":130},166,148,18,null,4,{"$f":"IF(B10=0,\"\",TOPTEN($AE$7:$AE$36,$B$7:$B$36,4,FALSE))","v":"اسم الطالب 14"},{"$f":"IF(B10=0,\"\",TOPTEN($AE$7:$AE$36,$B$7:$B$36,4,TRUE))","v":"الرابع"}]
[{"$f":"IF(B11<>0,[1]STName!A11,\"\")","v":5},{"$f":"[1]STName!B11","v":"اسم الطالب 5"},13,20,19,14,7,7,19,17,12,19,20,14,7,6,7,7,208,16,6,"A","ناجح",null,5,{"$f":"IF(B11=0,\"\",TOPTEN($S$7:$S$36,$B$7:$B$36,5,FALSE))","v":"اسم الطالب 1"},{"$f":"IF(C11=0,\"\",TOPTEN($S$7:$S$36,$B$7:$B$36,5,TRUE))","v":"الخامس"},null,{"$f":"Monthly1!S11","v":202},208,205,7,null,5,{"$f":"IF(B11=0,\"\",TOPTEN($AE$7:$AE$36,$B$7:$B$36,5,FALSE))","v":"اسم الطالب 7"},{"$f":"IF(B11=0,\"\",TOPTEN($AE$7:$AE$36,$B$7:$B$36,5,TRUE))","v":"الخامس"}]
[{"$f":"IF(B12<>0,[1]STName!A12,\"\")","v":6},{"$f":"[1]STName!B12","v":"اسم الطالب 6"},14,20,20,14,7,7,20,20,13,20,20,15,7,7,8,7,219,16.846153846153847,1,"A","ناجح",null,6,{"$f":"IF(B12=0,\"\",TOPTEN($S$7:$S$36,$B$7:$B$36,6,FALSE))","v":"اسم الطالب 5"},{"$f":"IF(C12=0,\"\",TOPTEN($S$7:$S$36,$B$7:$B$36,6,TRUE))","v":"السادس"},null,{"$f":"Monthly1!S12","v":208},219,213.5,3,null,6,{"$f":"IF(B12=0,\"\",TOPTEN($AE$7:$AE$36,$B$7:$B$36,6,FALSE))","v":"اسم الطالب 3"},{"$f":"IF(B12=0,\"\",TOPTEN($AE$7:$AE$36,$B$7:$B$36,6,TRUE))","v":"السادس"}]
[{"$f":"IF(B13<>0,[1]STName!A13,\"\")","v":7},{"$f":"[1]STName!B13","v":"اسم الطالب 7"},13,13,18,14,7,6,17,14,12,19,20,15,7,6,7,7,195,15,9,"A","ناجح",null,7,{"$f":"IF(B13=\"\",\"\",TOPTEN($S$7:$S$36,$B$7:$B$36,7,FALSE))","v":"اسم الطالب 14"},{"$f":"IF(C13=\"\",\"\",TOPTEN($S$7:$S$36,$B$7:$B$36,7,TRUE))","v":"السادس مكرر"},null,{"$f":"Monthly1!S13","v":218},195,206.5,5,null,7,{"$f":"IF(B13=0,\"\",TOPTEN($AE$7:$AE$36,$B$7:$B$36,7,FALSE))","v":"اسم الطالب 5"},{"$f":"IF(B13=0,\"\",TOPTEN($AE$7:$AE$36,$B$7:$B$36,7,TRUE))","v":"السابع"}]
[{"$f":"IF(B14<>0,[1]STName!A14,\"\")","v":8},{"$f":"[1]STName!B14","v":"اسم الطالب 8"},8,16,13,13,2,7,14,20,12,19,19,2,7,6,7,7,172,13.23076923076923,13,"B","ناجح",null,8,{"$f":"IF(B14=\"\",0,TOPTEN($S$7:$S$36,$B$7:$B$36,8,FALSE))","v":"اسم الطالب 12"},{"$f":"IF(C14=\"\",0,TOPTEN($S$7:$S$36,$B$7:$B$36,8,TRUE))","v":"الثامن"},null,{"$f":"Monthly1!S14","v":172},172,172,13,null,8,{"$f":"IF(B14=0,\"\",TOPTEN($AE$7:$AE$36,$B$7:$B$36,8,FALSE))","v":"اسم الطالب 12"},{"$f":"IF(B14=0,\"\",TOPTEN($AE$7:$AE$36,$B$7:$B$36,8,TRUE))","v":"الثامن"}]
[{"$f":"IF(B15<>0,[1]STName!A15,\"\")","v":9},{"$f":"[1]STName!B15","v":"اسم الطالب 9"},12,19,19,15,7,7,2,2,2,5,2,1,7,7,7,7,121,9.3076923076923084,19,"D","راسب",null,9,{"$f":"IF(B15=0,\"\",TOPTEN($S$7:$S$36,$B$7:$B$36,9,FALSE))","v":"اسم الطالب 3"},{"$f":"IF(C15=0,\"\",TOPTEN($S$7:$S$36,$B$7:$B$36,9,TRUE))","v":"التاسع"},null,{"$f":"Monthly1!S15","v":121},121,121,20,null,9,{"$f":"IF(B15=0,\"\",TOPTEN($AE$7:$AE$36,$B$7:$B$36,9,FALSE))","v":"اسم الطالب 15"},{"$f":"IF(B15=0,\"\",TOPTEN($AE$7:$AE$36,$B$7:$B$36,9,TRUE))","v":"التاسع"}]
{"$rows_left_out":27}
{"sheet":"Monthly2","index":3,"n_rows":41,"n_cols":27,"rows_kept":41,"cut":false,"hidden":false,"merged":[[0,0,0,22],[1,2,1,4],[2,2,2,4],[2,5,2,7],[1,16,1,19],[2,16,2,19],[1,20,1,22],[2,20,2,22]]}
[{"$f":"[1]STName!A1","v":"International Lessing School"}]
[null,"الصــــــــــــــــــــف:",{"$f":"[1]STName!N3","v":"Grade 02"},null,null,null,null,null,null,null,null,null,null,null,null,null,"العـام الدراســـي:",null,null,null,{"$f":"[1]STName!B3","v":"2024-2025"}]
[null,"الشــــــــــــــــــــعبة:",{"$f":"[1]STName!J3","v":"A"},null,null,{"$f":"[1]STName!H3","v":"Moon"},null,null,null,null,null,null,null,null,null,null,"عــلامــات شـهر:",null,null,null,"Monthly1"]
[]
["الرقم","اسم الطالب","Reading","Grammar","Dictation","Comp + Conv","Poetry","Handwriting","Science","Mathematics","القراءة","القواعد","الإملاء","التعبير والمحادثة","المحفوظات","الخط","تربية مدنية","Sport","المجموع","المعدل","الترتيب","الفئة","النتيجة",null,null,"ترتيب تصاعدي"]
[null,"العلامة القصوى",20,20,20,20,10,10,20,20,20,20,20,20,10,10,10,10,{"$f":"IF(C6<>0,SUM(C6:R6),\"\")","v":260},20]
[{"$f":"IF(B7<>0,[1]STName!A7,\"\")","v":1},{"$f":"[1]STName!B7","v":"اسم الطالب 1"},12,20,20,15,7,6,20,17,12,20,20,15,7,5,7,7,{"$f":"IF(C7<>0,SUM(C7:R7),\"\")","v":210},{"$f":"IF(C7<>0,S7/13,\"\")","v":16.153846153846153},{"$f":"IF(C7<>0,RANK(T7,$T$7:$T$36),\"\")","v":4},{"$f":"IF(C7<>0,IF(T7>=15,\"A\",IF(T7>=12,\"B\",IF(T7>=10,\"C\",IF(T7>=7.5,\"D\",\"E\")))),\"\")","v":"A"},{"$f":"IF(C7<>0,IF(T7>=10,\"ناجح\",\"راسب\"),\"\")","v":"ناجح"},null,1,{"$f":"IF(B7=0,\"\",TOPTEN($S$7:$S$36,$B$7:$B$36,1,FALSE))","v":"اسم الطالب 6"},{"$f":"IF(C7=0,\"\",TOPTEN($S$7:$S$36,$B$7:$B$36,1,TRUE))","v":"الأول"}]
[{"$f":"IF(B8<>0,[1]STName!A8,\"\")","v":2},{"$f":"[1]STName!B8","v":"اسم الطالب 2"},8,17,18,13,7,6,15,14,10,15,19,8,7,5,7,7,176,13.538461538461538,{"$f":"IF(C8<>0,RANK(T8,$T$7:$T$36),\"\")","v":13},{"$f":"IF(C8<>0,IF(T8>=15,\"A\",IF(T8>=12,\"B\",IF(T8>=10,\"C\",IF(T8>=7.5,\"D\",\"E\")))),\"\")","v":"B"},{"$f":"IF(C8<>0,IF(T8>=10,\"ناجح\",\"راسب\"),\"\")","v":"ناجح"},null,2,{"$f":"IF(B8=0,\"\",TOPTEN($S$7:$S$36,$B$7:$B$36,2,FALSE))","v":"اسم الطالب 10"},{"$f":"IF(C8=0,\"\",TOPTEN($S$7:$S$36,$B$7:$B$36,2,TRUE))","v":"الثاني"}]
[{"$f":"IF(B9<>0,[1]STName!A9,\"\")","v":3},{"$f":"[1]STName!B9","v":"اسم الطالب 3"},12,16,20,15,4,6,20,14,11,17,20,13,7,6,7,7,195,15,11,"A","ناجح",null,3,{"$f":"IF(B9=0,\"\",TOPTEN($S$7:$S$36,$B$7:$B$36,3,FALSE))","v":"اسم الطالب 15"},{"$f":"IF(C9=0,\"\",TOPTEN($S$7:$S$36,$B$7:$B$36,3,TRUE))","v":"الثالث"}]
[{"$f":"IF(B10<>0,[1]STName!A10,\"\")","v":4},{"$f":"[1]STName!B10","v":"اسم الطالب 4"},9,14,11,12,6,6,11,9,10,19,18,14,7,6,7,7,166,12.76923076923077,14,"B","ناجح",null,4,{"$f":"IF(B10=0,\"\",TOPTEN($S$7:$S$36,$B$7:$B$36,4,FALSE))","v":"اسم الطالب 1"},{"$f":"IF(C10=0,\"\",TOPTEN($S$7:$S$36,$B$7:$B$36,4,TRUE))","v":"الرابع"}]
[{"$f":"IF(B11<>0,[1]STName!A11,\"\")","v":5},{"$f":"[1]STName!B11","v":"اسم الطالب 5"},13,20,19,14,7,7,19,17,12,19,20,14,7,6,7,7,208,16,6,"A","ناجح",null,5,{"$f":"IF(B11=0,\"\",TOPTEN($S$7:$S$36,$B$7:$B$36,5,FALSE))","v":"اسم الطالب 9"},{"$f":"IF(C11=0,\"\",TOPTEN($S$7:$S$36,$B$7:$B$36,5,TRUE))","v":"الرابع مكرر"}]
[{"$f":"IF(B12<>0,[1]STName!A12,\"\")","v":6},{"$f":"[1]STName!B12","v":"اسم الطالب 6"},14,20,20,14,7,7,20,20,13,20,20,15,7,8,8,7,220,16.923076923076923,1,"A","ناجح",null,6,{"$f":"IF(B12=0,\"\",TOPTEN($S$7:$S$36,$B$7:$B$36,6,FALSE))","v":"اسم الطالب 5"},{"$f":"IF(C12=0,\"\",TOPTEN($S$7:$S$36,$B$7:$B$36,6,TRUE))","v":"السادس"}]
[{"$f":"IF(B13<>0,[1]STName!A13,\"\")","v":7},{"$f":"[1]STName!B13","v":"اسم الطالب 7"},13,13,18,14,7,6,17,14,12,19,20,15,7,6,7,7,195,15,11,"A","ناجح",null,7,{"$f":"IF(B13=\"\",\"\",TOPTEN($S$7:$S$36,$B$7:$B$36,7,FALSE))","v":"اسم الطالب 14"},{"$f":"IF(C13=\"\",\"\",TOPTEN($S$7:$S$36,$B$7:$B$36,7,TRUE))","v":"السادس مكرر"}]
[{"$f":"IF(B14<>0,[1]STName!A14,\"\")","v":8},{"$f":"[1]STName!B14","v":"اسم الطالب 8"},9,14,11,12,6,6,11,9,10,19,18,14,7,6,7,7,166,12.76923076923077,14,"B","ناجح",null,8,{"$f":"IF(B14=\"\",0,TOPTEN($S$7:$S$36,$B$7:$B$36,8,FALSE))","v":"اسم الطالب 19"},{"$f":"IF(C14=\"\",0,TOPTEN($S$7:$S$36,$B$7:$B$36,8,TRUE))","v":"السادس مكرر"}]
[{"$f":"IF(B15<>0,[1]STName!A15,\"\")","v":9},{"$f":"[1]STName!B15","v":"اسم الطالب 9"},13,20,19,14,7,7,19,17,12,19,20,16,7,6,7,7,210,16.153846153846153,4,"A","ناجح",null,9,{"$f":"IF(B15=0,\"\",TOPTEN($S$7:$S$36,$B$7:$B$36,9,FALSE))","v":"اسم الطالب 12"},{"$f":"IF(C15=0,\"\",TOPTEN($S$7:$S$36,$B$7:$B$36,9,TRUE))","v":"التاسع"}]
{"$rows_left_out":27}
{"sheet":"FinalYear","index":4,"n_rows":41,"n_cols":36,"rows_kept":41,"cut":false,"hidden":false,"merged":[[0,0,0,22],[1,2,1,4],[2,2,2,4],[2,5,2,7],[1,16,1,19],[2,16,2,19],[1,20,1,22],[2,20,2,22]]}
[{"$f":"[1]STName!A1","v":"International Lessing School"}]
[null,"الصــــــــــــــــــــف:",{"$f":"[1]STName!N3","v":"Grade 02"},null,null,null,null,null,null,null,null,null,null,null,null,null,"العـام الدراســـي:",null,null,null,{"$f":"[1]STName!B3","v":"2024-2025"}]
[null,"الشــــــــــــــــــــعبة:",{"$f":"[1]STName!J3","v":"A"},null,null,{"$f":"[1]STName!H3","v":"Moon"},null,null,null,null,null,null,null,null,null,null,"عــلامــات شـهر:",null,null,null,"Monthly1"]
[]
["الرقم","اسم الطالب","Reading","Grammar","Dictation","Comp + Conv","Poetry","Handwriting","Science","Mathematics","القراءة","القواعد","الإملاء","التعبير والمحادثة","المحفوظات","الخط","تربية مدنية","Sport","المجموع","المعدل","الترتيب","الفئة","النتيجة",null,null,"ترتيب تصاعدي",null,null,"السعي الثاني","آخر السنة","الفصل الثاني","الترتيب",null,null,"ترتيب تصاعدي"]
[null,"العلامة القصوى",20,20,20,20,10,10,20,20,20,20,20,20,10,10,10,10,{"$f":"IF(C6<>0,SUM(C6:R6),\"\")","v":260},20,null,null,null,null,null,null,null,null,{"$f":"Monthly2!S6","v":260},{"$f":"S6","v":260},{"$f":"IF((AC6<>\"\")*AND(AD6<>\"\"),AVERAGE(AC6,AD6),\"\")","v":260}]
[{"$f":"IF(B7<>0,[1]STName!A7,\"\")","v":1},{"$f":"[1]STName!B7","v":"اسم الطالب 1"},6,12,11,12,5,5,9,8,9,12,10,6,6,5,7,7,{"$f":"IF(C7<>0,SUM(C7:R7),\"\")","v":130},{"$f":"IF(C7<>0,S7/13,\"\")","v":10},{"$f":"IF(C7<>0,RANK(T7,$T$7:$T$36),\"\")","v":16},{"$f":"IF(C7<>0,IF(T7>=15,\"A\",IF(T7>=12,\"B\",IF(T7>=10,\"C\",IF(T7>=7.5,\"D\",\"E\")))),\"\")","v":"C"},{"$f":"IF(C7<>0,IF(T7>=10,\"ناجح\",\"راسب\"),\"\")","v":"ناجح"},null,1,{"$f":"IF(B7=0,\"\",TOPTEN($S$7:$S$36,$B$7:$B$36,1,FALSE))","v":"اسم الطالب 12"},{"$f":"IF(C7=0,\"\",TOPTEN($S$7:$S$36,$B$7:$B$36,1,TRUE))","v":"الأول"},null,{"$f":"Monthly2!S7","v":210},130,{"$f":"IF((AC7<>\"\")*AND(AD7<>\"\"),AVERAGE(AC7,AD7),\"\")","v":170},{"$f":"IF(B7<>0,RANK(AE7,$AE$7:$AE$36),\"\")","v":14},null,1,{"$f":"IF(B7=0,\"\",TOPTEN($AE$7:$AE$36,$B$7:$B$36,1,FALSE))","v":"اسم الطالب 10"},{"$f":"IF(B7=0,\"\",TOPTEN($AE$7:$AE$36,$B$7:$B$36,1,TRUE))","v":"الأول"}]
[{"$f":"IF(B8<>0,[1]STName!A8,\"\")","v":2},{"$f":"[1]STName!B8","v":"اسم الطالب 2"},12,20,16,14,5,6,19,20,13,17,19,15,7,5,7,7,202,15.538461538461538,{"$f":"IF(C8<>0,RANK(T8,$T$7:$T$36),\"\")","v":6},{"$f":"IF(C8<>0,IF(T8>=15,\"A\",IF(T8>=12,\"B\",IF(T8>=10,\"C\",IF(T8>=7.5,\"D\",\"E\")))),\"\")","v":"A"},{"$f":"IF(C8<>0,IF(T8>=10,\"ناجح\",\"راسب\"),\"\")","v":"ناجح"},null,2,{"$f":"IF(B8=0,\"\",TOPTEN($S$7:$S$36,$B$7:$B$36,2,FALSE))","v":"اسم الطالب 5"},{"$f":"IF(C8=0,\"\",TOPTEN($S$7:$S$36,$B$7:$B$36,2,TRUE))","v":"الثاني"},null,{"$f":"Monthly2!S8","v":176},202,189,{"$f":"IF(B8<>0,RANK(AE8,$AE$7:$AE$36),\"\")","v":9},null,2,{"$f":"IF(B8=0,\"\",TOPTEN($AE$7:$AE$36,$B$7:$B$36,2,FALSE))","v":"اسم الطالب 5"},{"$f":"IF(B8=0,\"\",TOPTEN($AE$7:$AE$36,$B$7:$B$36,2,TRUE))","v":"الثاني"}]
[{"$f":"IF(B9<>0,[1]STName!A9,\"\")","v":3},{"$f":"[1]STName!B9","v":"اسم الطالب 3"},9,14,11,12,6,6,11,9,10,19,18,14,7,6,7,7,166,12.76923076923077,14,"B","ناجح",null,3,{"$f":"IF(B9=0,\"\",TOPTEN($S$7:$S$36,$B$7:$B$36,3,FALSE))","v":"اسم الطالب 19"},{"$f":"IF(C9=0,\"\",TOPTEN($S$7:$S$36,$B$7:$B$36,3,TRUE))","v":"الثاني مكرر"},null,{"$f":"Monthly2!S9","v":195},166,180.5,12,null,3,{"$f":"IF(B9=0,\"\",TOPTEN($AE$7:$AE$36,$B$7:$B$36,3,FALSE))","v":"اسم الطالب 19"},{"$f":"IF(B9=0,\"\",TOPTEN($AE$7:$AE$36,$B$7:$B$36,3,TRUE))","v":"الثاني مكرر"}]
[{"$f":"IF(B10<>0,[1]STName!A10,\"\")","v":4},{"$f":"[1]STName!B10","v":"اسم الطالب 4"},13,20,19,14,7,7,19,17,12,19,20,14,7,6,7,7,208,16,5,"A","ناجح",null,4,{"$f":"IF(B10=0,\"\",TOPTEN($S$7:$S$36,$B$7:$B$36,4,FALSE))","v":"اسم الطالب 10"},{"$f":"IF(C10=0,\"\",TOPTEN($S$7:$S$36,$B$7:$B$36,4,TRUE))","v":"الرابع"},null,{"$f":"Monthly2!S10","v":166},208,187,10,null,4,{"$f":"IF(B10=0,\"\",TOPTEN($AE$7:$AE$36,$B$7:$B$36,4,FALSE))","v":"اسم الطالب 12"},{"$f":"IF(B10=0,\"\",TOPTEN($AE$7:$AE$36,$B$7:$B$36,4,TRUE))","v":"الرابع"}]
[{"$f":"IF(B11<>0,[1]STName!A11,\"\")","v":5},{"$f":"[1]STName!B11","v":"اسم الطالب 5"},14,20,20,14,7,7,20,20,13,20,20,15,7,7,5,7,216,16.615384615384617,2,"A","ناجح",null,5,{"$f":"IF(B11=0,\"\",TOPTEN($S$7:$S$36,$B$7:$B$36,5,FALSE))","v":"اسم الطالب 4"},{"$f":"IF(C11=0,\"\",TOPTEN($S$7:$S$36,$B$7:$B$36,5,TRUE))","v":"الخامس"},null,{"$f":"Monthly2!S11","v":208},216,212,2,null,5,{"$f":"IF(B11=0,\"\",TOPTEN($AE$7:$AE$36,$B$7:$B$36,5,FALSE))","v":"اسم الطالب 6"},{"$f":"IF(B11=0,\"\",TOPTEN($AE$7:$AE$36,$B$7:$B$36,5,TRUE))","v":"الخامس"}]
[{"$f":"IF(B12<>0,[1]STName!A12,\"\")","v":6},{"$f":"[1]STName!B12","v":"اسم الطالب 6"},13,13,18,14,7,6,17,14,12,19,20,15,7,6,8,7,196,15.076923076923077,7,"A","ناجح",null,6,{"$f":"IF(B12=0,\"\",TOPTEN($S$7:$S$36,$B$7:$B$36,6,FALSE))","v":"اسم الطالب 2"},{"$f":"IF(C12=0,\"\",TOPTEN($S$7:$S$36,$B$7:$B$36,6,TRUE))","v":"السادس"},null,{"$f":"Monthly2!S12","v":220},196,208,5,null,6,{"$f":"IF(B12=0,\"\",TOPTEN($AE$7:$AE$36,$B$7:$B$36,6,FALSE))","v":"اسم الطالب 14"},{"$f":"IF(B12=0,\"\",TOPTEN($AE$7:$AE$36,$B$7:$B$36,6,TRUE))","v":"السادس"}]
[{"$f":"IF(B13<>0,[1]STName!A13,\"\")","v":7},{"$f":"[1]STName!B13","v":"اسم الطالب 7"},13,13,18,14,7,6,17,14,12,19,20,15,7,6,6,7,194,14.923076923076923,10,"B","ناجح",null,7,{"$f":"IF(B13=\"\",\"\",TOPTEN($S$7:$S$36,$B$7:$B$36,7,FALSE))","v":"اسم الطالب 6"},{"$f":"IF(C13=\"\",\"\",TOPTEN($S$7:$S$36,$B$7:$B$36,7,TRUE))","v":"السابع"},null,{"$f":"Monthly2!S13","v":195},194,194.5,8,null,7,{"$f":"IF(B13=0,\"\",TOPTEN($AE$7:$AE$36,$B$7:$B$36,7,FALSE))","v":"اسم الطالب 15"},{"$f":"IF(B13=0,\"\",TOPTEN($AE$7:$AE$36,$B$7:$B$36,7,TRUE))","v":"السابع"}]
[{"$f":"IF(B14<>0,[1]STName!A14,\"\")","v":8},{"$f":"[1]STName!B14","v":"اسم الطالب 8"},8,16,13,13,2,7,14,20,12,19,19,2,7,6,7,7,172,13.23076923076923,11,"B","ناجح",null,8,{"$f":"IF(B14=\"\",0,TOPTEN($S$7:$S$36,$B$7:$B$36,8,FALSE))","v":"اسم الطالب 13"},{"$f":"IF(C14=\"\",0,TOPTEN($S$7:$S$36,$B$7:$B$36,8,TRUE))","v":"الثامن"},null,{"$f":"Monthly2!S14","v":166},172,169,15,null,8,{"$f":"IF(B14=0,\"\",TOPTEN($AE$7:$AE$36,$B$7:$B$36,8,FALSE))","v":"اسم الطالب 7"},{"$f":"IF(B14=0,\"\",TOPTEN($AE$7:$AE$36,$B$7:$B$36,8,TRUE))","v":"الثامن"}]
[{"$f":"IF(B15<>0,[1]STName!A15,\"\")","v":9},{"$f":"[1]STName!B15","v":"اسم الطالب 9"},12,19,19,15,7,7,2,2,2,5,2,1,7,7,8,7,122,9.384615384615385,18,"D","راسب",null,9,{"$f":"IF(B15=0,\"\",TOPTEN($S$7:$S$36,$B$7:$B$36,9,FALSE))","v":"اسم الطالب 14"},{"$f":"IF(C15=0,\"\",TOPTEN($S$7:$S$36,$B$7:$B$36,9,TRUE))","v":"الثامن مكرر"},null,{"$f":"Monthly2!S15","v":210},122,166,16,null,9,{"$f":"IF(B15=0,\"\",TOPTEN($AE$7:$AE$36,$B$7:$B$36,9,FALSE))","v":"اسم الطالب 2"},{"$f":"IF(B15=0,\"\",TOPTEN($AE$7:$AE$36,$B$7:$B$36,9,TRUE))","v":"التاسع"}]
{"$rows_left_out":27}
{"sheet":"الشهادة","index":5,"n_rows":36,"n_cols":9,"rows_kept":36,"cut":false,"hidden":false,"merged":[[0,7,0,8],[0,5,0,6],[1,7,1,8],[1,5,1,6],[3,0,3,8],[4,0,4,8],[35,0,35,2],[34,0,34,8],[35,6,35,8],[10,6,10,8],[8,1,8,3]]}
[null,null,null,null,null,"بحث برقم الطالب",null,"إجمالي الشهادات"]
[null,null,null,null,null,19,null,{"$f":"COUNTIF(Monthly1!A7:A36,\">0\")","v":20}]
[]
[{"$f":"STName!A1","v":"اسم المدرسة"}]
[{"$f":"STName!A2","v":"Academic Year: 2024-2025"}]
["Class",{"$f":"STName!N3","v":"Grade 01"}]
["Section",{"$f":"STName!J3&\"  \"&STName!H3","v":"A  Moon"}]
["Student Number",{"$f":"LOOKUP(F2,Monthly1!A7:A36,Monthly1!A7:A36)","v":19},"from ",{"$f":"H2","v":20}]
["Student Name",{"$f":"LOOKUP(B8,Monthly1!A7:A36,Monthly1!B7:B36)","v":"اسم الطالب 19"}]
[]
[null,null,null,null,null,null,"   الشويفات/ هاتف: 05/000000"]
["Subject","Max Mark","Monthly1","Mid Year Exam","Semester One Average","Monthly2","Final Exam","Semester Two Average","Total Average"]
["Reading",20,{"$f":"IF($B$8=\"\",\"\",IFERROR(1/(1/INDEX(Monthly1,$B$8,3)),\"\"))","v":14},{"$f":"IF($B$8=\"\",\"\",IFERROR(1/(1/INDEX(MidYear,$B$8,3)),\"\"))","v":14},{"$f":"IF((C13<>\"\")*AND(D13<>\"\"),CEILING(AVERAGE(C13,D13),1),\"\")","v":14},{"$f":"IF($B$8=\"\",\"\",IFERROR(1/(1/INDEX(Monthly2,$B$8,3)),\"\"))","v":13},{"$f":"IF($B$8=\"\",\"\",IFERROR(1/(1/INDEX(FinalYear,$B$8,3)),\"\"))","v":14},{"$f":"IF((F13<>\"\")*AND(G13<>\"\"),CEILING(AVERAGE(F13,G13),1),\"\")","v":14},{"$f":"IF((E13<>\"\")*AND(H13<>\"\"),CEILING(AVERAGE(E13,H13),1),\"\")","v":14}]
["Grammar",20,{"$f":"IF($B$8=\"\",\"\",IFERROR(1/(1/INDEX(Monthly1,$B$8,4)),\"\"))","v":20},{"$f":"IF($B$8=\"\",\"\",IFERROR(1/(1/INDEX(MidYear,$B$8,4)),\"\"))","v":20},20,{"$f":"IF($B$8=\"\",\"\",IFERROR(1/(1/INDEX(Monthly2,$B$8,4)),\"\"))","v":20},{"$f":"IF($B$8=\"\",\"\",IFERROR(1/(1/INDEX(FinalYear,$B$8,4)),\"\"))","v":20},{"$f":"IF((F14<>\"\")*AND(G14<>\"\"),CEILING(AVERAGE(F14,G14),1),\"\")","v":20},20]
["Dictation",20,{"$f":"IF($B$8=\"\",\"\",IFERROR(1/(1/INDEX(Monthly1,$B$8,5)),\"\"))","v":20},{"$f":"IF($B$8=\"\",\"\",IFERROR(1/(1/INDEX(MidYear,$B$8,5)),\"\"))","v":19},20,{"$f":"IF($B$8=\"\",\"\",IFERROR(1/(1/INDEX(Monthly2,$B$8,5)),\"\"))","v":19},{"$f":"IF($B$8=\"\",\"\",IFERROR(1/(1/INDEX(FinalYear,$B$8,5)),\"\"))","v":19},19,20]
{"$rows_left_out":21}