{"text_format":"1","workbook":"xlsx","n_sheets":6,"sheets":["STName","Monthly1","MidYear","Monthly2","FinalYear","الشهادة"],"not_rendered":{"charts":0,"images":1,"macros":1,"external_links":0,"defined_names":7,"comments":0,"pivot_tables":0},"unopened":[],"bounds":{"document_bytes":16777216,"sheet_cells":100000,"rows_first":2000,"rows_last":500,"rows_between":2000,"halvings":0,"cell_chars":16384,"cell_head_chars":4096},"cells_cut":0,"cells_raw":0,"read":"whole","date_system":"1900"}

{"sheet":"STName","index":0,"n_rows":36,"n_cols":17,"rows_kept":36,"cut":false,"hidden":false,"merged":[[0,0,0,17],[1,8,1,17],[1,0,1,7],[2,16,2,17],[2,10,2,11],[2,12,2,15],[2,8,2,9]]}
["International Lessing School"]
["Academic Year: 2024-2025",null,null,null,null,null,null,null,"Teacher:"]
[null,null,null,null,null,null,null,null,"24-25",null,"year",null,{"$f":"B6","v":"Grade 01 A Moon"},null,null,null,"Class:"]
[]
[null,null,"Reading","Dictation","Comp + Conv","Handwriting","Poetry","Science","Mathematics","القراءة","الإملاء","التعبير والمحادثة","المحفوظات","الخط","Sport","Art"]
[null,"Grade 01 A Moon",20,20,20,10,10,20,20,20,20,20,10,10,10,10]
[1,"امير سامر عبيد"]
[2,"إسماعيل محمد غيث"]
[3,"إلين كرم الحلاق"]
[4,"إيلاف رشاد مشيك"]
[5,"ألين قاسم دريس"]
[6,"جنى حسن فقيه"]
[7,"جنى نور سليم"]
[8,"حسين علي حميه"]
[9,"حنين علي العرب"]
[10,"رهف ايهاب رضا"]
[11,"روان عباس شميس"]
[12,"زين العابدين محمد رباح"]
[13,"زينب محمد فارس"]
[14,"علي الأكبر علي دره"]
[15,"علي حسين سليم"]
[16,"علي رضا يوسف المولى"]
[17,"علي هادي المقداد"]
[18,"فاطمه علاء العساف"]
[19,"لين عباس زعيتر"]
[20,"محمد ايلي دبوس"]
[21,"محمد علي فؤاد زعيتر"]
[22,"ميريام زين العابدين زغيب"]
[23,"نور محمد غيث"]
[24,"يوسف رشاد سلوم"]
[25]
[26]
[27]
[28]
[29]
[30]

{"sheet":"Monthly1","index":1,"n_rows":41,"n_cols":26,"rows_kept":41,"cut":false,"hidden":false,"merged":[[2,24,2,25],[0,0,0,22],[1,2,1,4],[2,2,2,4],[2,5,2,7],[2,16,2,19],[2,20,2,22],[1,16,1,22]]}
[{"$f":"STName!A1","v":"International Lessing School"}]
[null,"الصــــــــــــــــــــف:",{"$f":"STName!M3","v":"Grade 01 A Moon"},null,null,null,null,null,null,null,null,null,null,null,null,null,{"$f":"STName!A2","v":"Academic Year: 2024-2025"}]
[null,null,null,null,null,null,null,null,null,null,null,null,null,null,null,null,"عــلامــات شـهر:",null,null,null,"Monthly1",null,null,null,"الأوائل في الشهري الأول"]
[]
["الرقم","اسم الطالب",{"$f":"STName!C5","v":"Reading"},{"$f":"STName!D5","v":"Dictation"},{"$f":"STName!E5","v":"Comp + Conv"},{"$f":"STName!F5","v":"Handwriting"},{"$f":"STName!G5","v":"Poetry"},{"$f":"STName!H5","v":"Science"},{"$f":"STName!I5","v":"Mathematics"},{"$f":"STName!J5","v":"القراءة"},{"$f":"STName!K5","v":"الإملاء"},{"$f":"STName!L5","v":"التعبير والمحادثة"},{"$f":"STName!M5","v":"المحفوظات"},{"$f":"STName!N5","v":"الخط"},{"$f":"STName!O5","v":"Sport"},{"$f":"STName!P5","v":"Art"},{"$f":"STName!Q5","v":0},{"$f":"STName!R5","v":0},"المجموع","المعدل","الترتيب","الفئة","النتيجة",null,"ترتيب تصاعدي"]
[null,"العلامة القصوى",{"$f":"STName!C6","v":20},{"$f":"STName!D6","v":20},{"$f":"STName!E6","v":20},{"$f":"STName!F6","v":10},{"$f":"STName!G6","v":10},{"$f":"STName!H6","v":20},{"$f":"STName!I6","v":20},{"$f":"STName!J6","v":20},{"$f":"STName!K6","v":20},{"$f":"STName!L6","v":20},{"$f":"STName!M6","v":10},{"$f":"STName!N6","v":10},{"$f":"STName!O6","v":10},{"$f":"STName!P6","v":10},{"$f":"STName!Q6","v":0},{"$f":"STName!R6","v":0},{"$f":"IF(C6<>0,SUM(C6:R6),\"\")","v":220},20]
[{"$f":"IF(B7<>0,STName!A7,\"\")","v":1},{"$f":"STName!B7","v":"امير سامر عبيد"},8,16,13,13,2,7,14,20,12,19,19,2,7,6,null,null,{"$f":"IF(C7<>0,SUM(C7:R7),\"\")","v":158},{"$f":"IF(C7<>0,S7*$T$6/$S$6,\"\")","v":14.363636363636363},{"$f":"IF(C7<>0,RANK(T7,$T$7:$T$36),\"\")","v":18},{"$f":"IF(C7<>0,IF(T7>=15,\"A\",IF(T7>=12,\"B\",IF(T7>=10,\"C\",IF(T7>=7.5,\"D\",\"E\")))),\"\")","v":"B"},{"$f":"IF(C7<>0,IF(T7>=10,\"ناجح\",\"راسب\"),\"\")","v":"ناجح"},null,{"$f":"IF(B7=0,\"\",TOPTEN($S$7:$S$36,$B$7:$B$36,1,FALSE))","v":"زينب محمد فارس"},{"$f":"IF(C7=0,\"\",TOPTEN($S$7:$S$36,$B$7:$B$36,1,TRUE))","v":"الأول"}]
[{"$f":"IF(B8<>0,STName!A8,\"\")","v":2},{"$f":"STName!B8","v":"إسماعيل محمد غيث"},12,19,19,15,7,7,2,2,2,5,2,1,7,7,null,null,107,{"$f":"IF(C8<>0,S8*$T$6/$S$6,\"\")","v":9.7272727272727266},{"$f":"IF(C8<>0,RANK(T8,$T$7:$T$36),\"\")","v":24},{"$f":"IF(C8<>0,IF(T8>=15,\"A\",IF(T8>=12,\"B\",IF(T8>=10,\"C\",IF(T8>=7.5,\"D\",\"E\")))),\"\")","v":"D"},{"$f":"IF(C8<>0,IF(T8>=10,\"ناجح\",\"راسب\"),\"\")","v":"راسب"},null,{"$f":"IF(B8=0,\"\",TOPTEN($S$7:$S$36,$B$7:$B$36,2,FALSE))","v":"محمد علي فؤاد زعيتر"},{"$f":"IF(C8=0,\"\",TOPTEN($S$7:$S$36,$B$7:$B$36,2,TRUE))","v":"الثاني"}]
[{"$f":"IF(B9<>0,STName!A9,\"\")","v":3},{"$f":"STName!B9","v":"إلين كرم الحلاق"},14,20,19,15,7,7,20,20,12,20,20,15,7,6,null,null,202,18.363636363636363,4,"A","ناجح",null,{"$f":"IF(B9=0,\"\",TOPTEN($S$7:$S$36,$B$7:$B$36,3,FALSE))","v":"لين عباس زعيتر"},{"$f":"IF(C9=0,\"\",TOPTEN($S$7:$S$36,$B$7:$B$36,3,TRUE))","v":"الثالث"}]
[{"$f":"IF(B10<>0,STName!A10,\"\")","v":4},{"$f":"STName!B10","v":"إيلاف رشاد مشيك"},6,12,11,12,5,5,9,8,9,12,10,6,6,5,null,null,116,10.545454545454545,22,"C","ناجح",null,{"$f":"IF(B10=0,\"\",TOPTEN($S$7:$S$36,$B$7:$B$36,4,FALSE))","v":"إلين كرم الحلاق"},{"$f":"IF(C10=0,\"\",TOPTEN($S$7:$S$36,$B$7:$B$36,4,TRUE))","v":"الرابع"}]
[{"$f":"IF(B11<>0,STName!A11,\"\")","v":5},{"$f":"STName!B11","v":"ألين قاسم دريس"},12,20,16,14,5,6,19,20,13,17,19,15,7,5,null,null,188,17.09090909090909,11,"A","ناجح",null,{"$f":"IF(B11=0,\"\",TOPTEN($S$7:$S$36,$B$7:$B$36,5,FALSE))","v":"رهف ايهاب رضا"},{"$f":"IF(C11=0,\"\",TOPTEN($S$7:$S$36,$B$7:$B$36,5,TRUE))","v":"الرابع"}]
[{"$f":"IF(B12<>0,STName!A12,\"\")","v":6},{"$f":"STName!B12","v":"جنى حسن فقيه"},13,20,19,14,7,7,19,17,12,19,20,14,7,6,null,null,194,17.636363636363637,8,"A","ناجح",null,{"$f":"IF(B12=0,\"\",TOPTEN($S$7:$S$36,$B$7:$B$36,6,FALSE))","v":"جنى نور سليم"},{"$f":"IF(C12=0,\"\",TOPTEN($S$7:$S$36,$B$7:$B$36,6,TRUE))","v":"السادس"}]
[{"$f":"IF(B13<>0,STName!A13,\"\")","v":7},{"$f":"STName!B13","v":"جنى نور سليم"},14,20,20,14,7,7,20,20,13,20,20,11,7,7,null,null,200,18.181818181818183,6,"A","ناجح",null,{"$f":"IF(B13=\"\",\"\",TOPTEN($S$7:$S$36,$B$7:$B$36,7,FALSE))","v":"ميريام زين العابدين زغيب"},{"$f":"IF(C13=\"\",\"\",TOPTEN($S$7:$S$36,$B$7:$B$36,7,TRUE))","v":"السابع"}]
[{"$f":"IF(B14<>0,STName!A14,\"\")","v":8},{"$f":"STName!B14","v":"حسين علي حميه"},8,16,13,13,2,7,14,20,12,19,19,2,7,6,null,null,158,14.363636363636363,18,"B","ناجح",null,{"$f":"IF(B14=\"\",0,TOPTEN($S$7:$S$36,$B$7:$B$36,8,FALSE))","v":"جنى حسن فقيه"},{"$f":"IF(C14=\"\",0,TOPTEN($S$7:$S$36,$B$7:$B$36,8,TRUE))","v":"الثامن"}]
[{"$f":"IF(B15<>0,STName!A15,\"\")","v":9},{"$f":"STName!B15","v":"حنين علي العرب"},12,19,19,15,7,7,2,2,2,5,2,15,7,7,null,null,121,11,21,"C","ناجح",null,{"$f":"IF(B15=0,\"\",TOPTEN($S$7:$S$36,$B$7:$B$36,9,FALSE))","v":"فاطمه علاء العساف"},{"$f":"IF(C15=0,\"\",TOPTEN($S$7:$S$36,$B$7:$B$36,9,TRUE))","v":"الثامن"}]
[{"$f":"IF(B16<>0,STName!A16,\"\")","v":10},{"$f":"STName!B16","v":"رهف ايهاب رضا"},14,20,19,15,7,7,20,20,12,20,20,15,7,6,null,null,202,18.363636363636363,4,"A","ناجح",null,{"$f":"IF(B16=0,\"\",TOPTEN($S$7:$S$36,$B$7:$B$36,10,FALSE))","v":"علي الأكبر علي دره"},{"$f":"IF(C16=0,\"\",TOPTEN($S$7:$S$36,$B$7:$B$36,10,TRUE))","v":"العاشر"}]
[{"$f":"IF(B17<>0,STName!A17,\"\")","v":11},{"$f":"STName!B17","v":"روان عباس شميس"},6,12,11,12,5,5,9,8,9,12,10,6,6,5,null,null,116,10.545454545454545,22,"C","ناجح",null,{"$f":"IF(B17=0,\"\",TOPTEN($S$7:$S$36,$B$7:$B$36,11,FALSE))","v":"ألين قاسم دريس"},{"$f":"IF(C17=0,\"\",TOPTEN($S$7:$S$36,$B$7:$B$36,11,TRUE))","v":"الحادى عشر"}]
[{"$f":"IF(B18<>0,STName!A18,\"\")","v":12},{"$f":"STName!B18","v":"زين العابدين محمد رباح"},12,20,16,14,5,6,19,20,13,17,19,15,7,5,null,null,188,17.09090909090909,11,"A","ناجح",null,{"$f":"IF(B18=0,\"\",TOPTEN($S$7:$S$36,$B$7:$B$36,12,FALSE))","v":"زين العابدين محمد رباح"},{"$f":"IF(C18=0,\"\",TOPTEN($S$7:$S$36,$B$7:$B$36,12,TRUE))","v":"الحادى عشر"}]
[{"$f":"IF(B19<>0,STName!A19,\"\")","v":13},{"$f":"STName!B19","v":"زينب محمد فارس"},20,20,14,7,7,20,20,20,13,20,20,15,7,7,null,null,210,19.09090909090909,1,"A","ناجح",null,{"$f":"IF(B19=0,\"\",TOPTEN($S$7:$S$36,$B$7:$B$36,13,FALSE))","v":"يوسف رشاد سلوم"},{"$f":"IF(C19=0,\"\",TOPTEN($S$7:$S$36,$B$7:$B$36,13,TRUE))","v":"الثالث عشر"}]
[{"$f":"IF(B20<>0,STName!A20,\"\")","v":14},{"$f":"STName!B20","v":"علي الأكبر علي دره"},12,20,20,15,7,6,20,10,12,20,20,15,7,5,null,null,189,17.181818181818183,10,"A","ناجح",null,{"$f":"IF(B20=0,\"\",TOPTEN($S$7:$S$36,$B$7:$B$36,14,FALSE))","v":"علي رضا يوسف المولى"},{"$f":"IF(C20=0,\"\",TOPTEN($S$7:$S$36,$B$7:$B$36,14,TRUE))","v":"الرايع عشر"}]
[{"$f":"IF(B21<>0,STName!A21,\"\")","v":15},{"$f":"STName!B21","v":"علي حسين سليم"},8,17,18,13,7,6,15,14,10,15,19,8,7,5,null,null,162,14.727272727272727,17,"B","ناجح",null,{"$f":"IF(B21=0,\"\",TOPTEN($S$7:$S$36,$B$7:$B$36,15,FALSE))","v":"محمد ايلي دبوس"},{"$f":"IF(C21=0,\"\",TOPTEN($S$7:$S$36,$B$7:$B$36,15,TRUE))","v":"الرايع عشر"}]
[{"$f":"IF(B22<>0,STName!A22,\"\")","v":16},{"$f":"STName!B22","v":"علي رضا يوسف المولى"},12,16,20,15,4,6,20,14,11,17,20,13,7,6,null,null,181,16.454545454545453,14,"A","ناجح",null,{"$f":"IF(B22=0,\"\",TOPTEN($S$7:$S$36,$B$7:$B$36,16,FALSE))","v":"نور محمد غيث"},{"$f":"IF(C22=0,\"\",TOPTEN($S$7:$S$36,$B$7:$B$36,16,TRUE))","v":"السادس عشر"}]
[{"$f":"IF(B23<>0,STName!A23,\"\")","v":17},{"$f":"STName!B23","v":"علي هادي المقداد"},9,14,11,12,6,6,11,9,10,19,18,14,7,6,null,null,152,13.818181818181818,20,"B","ناجح",null,{"$f":"IF(B23=0,\"\",TOPTEN($S$7:$S$36,$B$7:$B$36,17,FALSE))","v":"علي حسين سليم"},{"$f":"IF(C23=0,\"\",TOPTEN($S$7:$S$36,$B$7:$B$36,17,TRUE))","v":"السابع عشر"}]
[{"$f":"IF(B24<>0,STName!A24,\"\")","v":18},{"$f":"STName!B24","v":"فاطمه علاء العساف"},13,20,19,14,7,7,19,17,12,19,20,14,7,6,null,null,194,17.636363636363637,8,"A","ناجح",null,{"$f":"IF(B24=0,\"\",TOPTEN($S$7:$S$36,$B$7:$B$36,18,FALSE))","v":"امير سامر عبيد"},{"$f":"IF(C24=0,\"\",TOPTEN($S$7:$S$36,$B$7:$B$36,18,TRUE))","v":"الثامن عشر"}]
[{"$f":"IF(B25<>0,STName!A25,\"\")","v":19},{"$f":"STName!B25","v":"لين عباس زعيتر"},14,20,20,14,7,7,20,20,13,20,20,15,7,7,null,null,204,18.545454545454547,3,"A","ناجح",null,{"$f":"IF(B25=0,\"\",TOPTEN($S$7:$S$36,$B$7:$B$36,19,FALSE))","v":"حسين علي حميه"},{"$f":"IF(C25=0,\"\",TOPTEN($S$7:$S$36,$B$7:$B$36,19,TRUE))","v":"الثامن عشر"}]
[{"$f":"IF(B26<>0,STName!A26,\"\")","v":20},{"$f":"STName!B26","v":"محمد ايلي دبوس"},13,13,18,14,7,6,17,14,12,19,20,15,7,6,null,null,181,16.454545454545453,14,"A","ناجح",null,{"$f":"IF(B26=0,\"\",TOPTEN($S$7:$S$36,$B$7:$B$36,20,FALSE))","v":"علي هادي المقداد"},{"$f":"IF(C26=0,\"\",TOPTEN($S$7:$S$36,$B$7:$B$36,20,TRUE))","v":"العشرون"}]
[{"$f":"IF(B27<>0,STName!A27,\"\")","v":21},{"$f":"STName!B27","v":"محمد علي فؤاد زعيتر"},20,20,14,7,7,20,20,20,13,20,18,14,7,6,null,null,206,18.727272727272727,2,"A","ناجح",null,{"$f":"IF(B27=0,\"\",TOPTEN($S$7:$S$36,$B$7:$B$36,21,FALSE))","v":"حنين علي العرب"},{"$f":"IF(C27=0,\"\",TOPTEN($S$7:$S$36,$B$7:$B$36,21,TRUE))","v":"الواحد والعشرون"}]
[{"$f":"IF(B28<>0,STName!A28,\"\")","v":22},{"$f":"STName!B28","v":"ميريام زين العابدين زغيب"},12,20,20,15,7,6,20,17,12,20,20,14,7,6,null,null,196,17.818181818181817,7,"A","ناجح",null,{"$f":"IF(B28=0,\"\",TOPTEN($S$7:$S$36,$B$7:$B$36,22,FALSE))","v":"إيلاف رشاد مشيك"},{"$f":"IF(C28=0,\"\",TOPTEN($S$7:$S$36,$B$7:$B$36,22,TRUE))","v":"الثانى والعشرون"}]
[{"$f":"IF(B29<>0,STName!A29,\"\")","v":23},{"$f":"STName!B29","v":"نور محمد غيث"},8,17,18,13,7,6,15,14,10,15,20,15,7,7,null,null,172,15.636363636363637,16,"A","ناجح",null,{"$f":"IF(B29=0,\"\",TOPTEN($S$7:$S$36,$B$7:$B$36,23,FALSE))","v":"روان عباس شميس"},{"$f":"IF(C29=0,\"\",TOPTEN($S$7:$S$36,$B$7:$B$36,23,TRUE))","v":"الثانى والعشرون"}]
[{"$f":"IF(B30<>0,STName!A30,\"\")","v":24},{"$f":"STName!B30","v":"يوسف رشاد سلوم"},12,16,20,15,4,6,20,14,11,17,20,15,7,6,null,null,183,16.636363636363637,13,"A","ناجح",null,{"$f":"IF(B30=0,\"\",TOPTEN($S$7:$S$36,$B$7:$B$36,24,FALSE))","v":"إسماعيل محمد غيث"},{"$f":"IF(C30=0,\"\",TOPTEN($S$7:$S$36,$B$7:$B$36,24,TRUE))","v":"الرابع والعشرون"}]
[{"$f":"IF(B31<>0,STName!A31,\"\")","v":""},{"$f":"STName!B31","v":0},null,null,null,null,null,null,null,null,null,null,null,null,null,null,null,null,"","","","","",null,{"$f":"IF(B31=0,\"\",TOPTEN($S$7:$S$36,$B$7:$B$36,25,FALSE))","v":""},{"$f":"IF(C31=0,\"\",TOPTEN($S$7:$S$36,$B$7:$B$36,25,TRUE))","v":""}]
[{"$f":"IF(B32<>0,STName!A32,\"\")","v":""},{"$f":"STName!B32","v":0},null,null,null,null,null,null,null,null,null,null,null,null,null,null,null,null,"","","","","",null,{"$f":"IF(B32=0,\"\",TOPTEN($S$7:$S$36,$B$7:$B$36,26,FALSE))","v":""},{"$f":"IF(C32=0,\"\",TOPTEN($S$7:$S$36,$B$7:$B$36,26,TRUE))","v":""}]
[{"$f":"IF(B33<>0,STName!A33,\"\")","v":""},{"$f":"STName!B33","v":0},null,null,null,null,null,null,null,null,null,null,null,null,null,null,null,null,"","","","","",null,{"$f":"IF(B33=0,\"\",TOPTEN($S$7:$S$36,$B$7:$B$36,27,FALSE))","v":""},{"$f":"IF(C33=0,\"\",TOPTEN($S$7:$S$36,$B$7:$B$36,27,TRUE))","v":""}]
[{"$f":"IF(B34<>0,STName!A34,\"\")","v":""},{"$f":"STName!B34","v":0},null,null,null,null,null,null,null,null,null,null,null,null,null,null,null,null,"","","","","",null,{"$f":"IF(B34=0,\"\",TOPTEN($S$7:$S$36,$B$7:$B$36,28,FALSE))","v":""},{"$f":"IF(C34=0,\"\",TOPTEN($S$7:$S$36,$B$7:$B$36,28,TRUE))","v":""}]
[{"$f":"IF(B35<>0,STName!A35,\"\")","v":""},{"$f":"STName!B35","v":0},null,null,null,null,null,null,null,null,null,null,null,null,null,null,null,null,"","","","","",null,{"$f":"IF(B35=0,\"\",TOPTEN($S$7:$S$36,$B$7:$B$36,29,FALSE))","v":""},{"$f":"IF(C35=0,\"\",TOPTEN($S$7:$S$36,$B$7:$B$36,29,TRUE))","v":""}]
[{"$f":"IF(B36<>0,STName!A36,\"\")","v":""},{"$f":"STName!B36","v":0},null,null,null,null,null,null,null,null,null,null,null,null,null,null,null,null,"","","","","",null,{"$f":"IF(B36=0,\"\",TOPTEN($S$7:$S$36,$B$7:$B$36,30,FALSE))","v":""},{"$f":"IF(C36=0,\"\",TOPTEN($S$7:$S$36,$B$7:$B$36,30,TRUE))","v":""}]
[]
[null,"أعلى علامة",{"$f":"MAX(C7:C36)","v":20},{"$f":"MAX(D7:D36)","v":20},20,15,7,20,20,20,13,20,20,15,7,7,0,0,210,19.09090909090909]
[null,"أدنى علامة",{"$f":"MIN(C7:C36)","v":6},{"$f":"MIN(D7:D36)","v":12},11,7,2,5,2,2,2,5,2,1,6,5,0,0,107,9.7272727272727266]
[null,"عدد الناجحين",{"$f":"COUNTIF(C7:C36,\">=\"&C6/2)","v":17},24,24,24,20,2,20,19,20,22,22,21,24,24,0,0,{"$f":"COUNTIF(S7:S36,\">=\"&S6/2)","v":23},{"$f":"COUNTIF(T7:T36,\">=10\")","v":23}]
[null,"عدد الراسبين",{"$f":"COUNTIF(C7:C37,\"<\"&C6/2)","v":7},0,0,0,4,22,4,5,4,2,2,3,0,0,0,0,{"$f":"COUNTIF(S7:S37,\"<\"&S6/2)","v":1},{"$f":"COUNTIF(T7:T37,\"<10\")","v":1}]

{"sheet":"MidYear","index":2,"n_rows":41,"n_cols":35,"rows_kept":41,"cut":false,"hidden":false,"merged":[[2,24,2,25],[2,27,2,34],[0,0,0,22],[1,2,1,4],[2,2,2,4],[2,5,2,7],[2,16,2,19],[2,20,2,22],[1,16,1,22]]}
[{"$f":"STName!A1","v":"International Lessing School"}]
[null,"الصــــــــــــــــــــف:",{"$f":"STName!M3","v":"Grade 01 A Moon"},null,null,null,null,null,null,null,null,null,null,null,null,null,{"$f":"STName!A2","v":"Academic Year: 2024-2025"}]
[null,null,null,null,null,null,null,null,null,null,null,null,null,null,null,null,"عــلامــات شـهر:",null,null,null,"MidYear",null,null,null,"الأوائل في امتحان نصف السنة",null,null,"معدل الفصل الأول والاوائل في الفصل الأول"]
[]
["الرقم","اسم الطالب",{"$f":"STName!C5","v":"Reading"},{"$f":"STName!D5","v":"Dictation"},{"$f":"STName!E5","v":"Comp + Conv"},{"$f":"STName!F5","v":"Handwriting"},{"$f":"STName!G5","v":"Poetry"},{"$f":"STName!H5","v":"Science"},{"$f":"STName!I5","v":"Mathematics"},{"$f":"STName!J5","v":"القراءة"},{"$f":"STName!K5","v":"الإملاء"},{"$f":"STName!L5","v":"التعبير والمحادثة"},{"$f":"STName!M5","v":"المحفوظات"},{"$f":"STName!N5","v":"الخط"},{"$f":"STName!O5","v":"Sport"},{"$f":"STName!P5","v":"Art"},{"$f":"STName!Q5","v":0},{"$f":"STName!R5","v":0},"المجموع","المعدل","الترتيب","الفئة","النتيجة",null,"ترتيب تصاعدي","الأوائل",null,"اسم الطالب","سعي اول","نصفي","معدل فصل اول","ترتيب الفصل الأول",null,"ترتيب تصاعدي","الأوائل"]
[null,"العلامة القصوى",{"$f":"STName!C6","v":20},{"$f":"STName!D6","v":20},{"$f":"STName!E6","v":20},{"$f":"STName!F6","v":10},{"$f":"STName!G6","v":10},{"$f":"STName!H6","v":20},{"$f":"STName!I6","v":20},{"$f":"STName!J6","v":20},{"$f":"STName!K6","v":20},{"$f":"STName!L6","v":20},{"$f":"STName!M6","v":10},{"$f":"STName!N6","v":10},{"$f":"STName!O6","v":10},{"$f":"STName!P6","v":10},{"$f":"STName!Q6","v":0},{"$f":"STName!R6","v":0},{"$f":"IF(C6<>0,SUM(C6:R6),\"\")","v":220},20,null,null,null,null,null,null,null,null,{"$f":"Monthly1!S6","v":220},{"$f":"S6","v":220},{"$f":"IF((AC6<>\"\")*AND(AD6<>\"\"),AVERAGE(AC6,AD6),\"\")","v":220}]
[{"$f":"IF(B7<>0,STName!A7,\"\")","v":1},{"$f":"STName!B7","v":"امير سامر عبيد"},8,16,13,13,2,7,14,20,12,19,19,2,7,6,null,null,{"$f":"IF(C7<>0,SUM(C7:R7),\"\")","v":158},{"$f":"IF(C7<>0,S7*$T$6/$S$6,\"\")","v":14.363636363636363},{"$f":"IF(C7<>0,RANK(T7,$T$7:$T$36),\"\")","v":16},{"$f":"IF(C7<>0,IF(T7>=15,\"A\",IF(T7>=12,\"B\",IF(T7>=10,\"C\",IF(T7>=7.5,\"D\",\"E\")))),\"\")","v":"B"},{"$f":"IF(C7<>0,IF(T7>=10,\"ناجح\",\"راسب\"),\"\")","v":"ناجح"},null,{"$f":"IF(B7=0,\"\",TOPTEN($S$7:$S$36,$B$7:$B$36,1,FALSE))","v":"زينب محمد فارس"},{"$f":"IF(C7=0,\"\",TOPTEN($S$7:$S$36,$B$7:$B$36,1,TRUE))","v":"الأول"},null,{"$f":"B7","v":"امير سامر عبيد"},{"$f":"Monthly1!S7","v":158},{"$f":"S7","v":158},{"$f":"IF((AC7<>\"\")*AND(AD7<>\"\"),AVERAGE(AC7,AD7),\"\")","v":158},{"$f":"IF(C7<>0,RANK(AE7,$AE$7:$AE$36),\"\")","v":17},null,{"$f":"IF(C7=0,\"\",TOPTEN($AE$7:$AE$36,$B$7:$B$36,1,FALSE))","v":"زينب محمد فارس"},{"$f":"IF(C7=0,\"\",TOPTEN($AE$7:$AE$36,$B$7:$B$36,1,TRUE))","v":"الأول"}]
[{"$f":"IF(B8<>0,STName!A8,\"\")","v":2},{"$f":"STName!B8","v":"إسماعيل محمد غيث"},12,19,19,15,7,7,2,2,2,5,2,11,7,7,null,null,117,{"$f":"IF(C8<>0,S8*$T$6/$S$6,\"\")","v":10.636363636363637},{"$f":"IF(C8<>0,RANK(T8,$T$7:$T$36),\"\")","v":21},{"$f":"IF(C8<>0,IF(T8>=15,\"A\",IF(T8>=12,\"B\",IF(T8>=10,\"C\",IF(T8>=7.5,\"D\",\"E\")))),\"\")","v":"C"},{"$f":"IF(C8<>0,IF(T8>=10,\"ناجح\",\"راسب\"),\"\")","v":"ناجح"},null,{"$f":"IF(B8=0,\"\",TOPTEN($S$7:$S$36,$B$7:$B$36,2,FALSE))","v":"لين عباس زعيتر"},{"$f":"IF(C8=0,\"\",TOPTEN($S$7:$S$36,$B$7:$B$36,2,TRUE))","v":"الثاني"},null,"إسماعيل محمد غيث",{"$f":"Monthly1!S8","v":107},117,112,24,null,{"$f":"IF(C8=0,\"\",TOPTEN($AE$7:$AE$36,$B$7:$B$36,2,FALSE))","v":"لين عباس زعيتر"},{"$f":"IF(C8=0,\"\",TOPTEN($AE$7:$AE$36,$B$7:$B$36,2,TRUE))","v":"الثاني"}]
[{"$f":"IF(B9<>0,STName!A9,\"\")","v":3},{"$f":"STName!B9","v":"إلين كرم الحلاق"},14,20,19,15,7,7,20,20,12,20,20,15,7,6,null,null,202,18.363636363636363,4,"A","ناجح",null,{"$f":"IF(B9=0,\"\",TOPTEN($S$7:$S$36,$B$7:$B$36,3,FALSE))","v":"نور محمد غيث"},{"$f":"IF(C9=0,\"\",TOPTEN($S$7:$S$36,$B$7:$B$36,3,TRUE))","v":"الثاني"},null,"إلين كرم الحلاق",{"$f":"Monthly1!S9","v":202},202,202,3,null,{"$f":"IF(C9=0,\"\",TOPTEN($AE$7:$AE$36,$B$7:$B$36,3,FALSE))","v":"إلين كرم الحلاق"},{"$f":"IF(C9=0,\"\",TOPTEN($AE$7:$AE$36,$B$7:$B$36,3,TRUE))","v":"الثالث"}]
[{"$f":"IF(B10<>0,STName!A10,\"\")","v":4},{"$f":"STName!B10","v":"إيلاف رشاد مشيك"},6,12,11,12,5,5,9,8,9,12,10,6,6,4,null,null,115,10.454545454545455,23,"C","ناجح",null,{"$f":"IF(B10=0,\"\",TOPTEN($S$7:$S$36,$B$7:$B$36,4,FALSE))","v":"إلين كرم الحلاق"},{"$f":"IF(C10=0,\"\",TOPTEN($S$7:$S$36,$B$7:$B$36,4,TRUE))","v":"الرابع"},null,"إيلاف رشاد مشيك",{"$f":"Monthly1!S10","v":116},115,115.5,22,null,{"$f":"IF(C10=0,\"\",TOPTEN($AE$7:$AE$36,$B$7:$B$36,4,FALSE))","v":"رهف ايهاب رضا"},{"$f":"IF(C10=0,\"\",TOPTEN($AE$7:$AE$36,$B$7:$B$36,4,TRUE))","v":"الثالث"}]
[{"$f":"IF(B11<>0,STName!A11,\"\")","v":5},{"$f":"STName!B11","v":"ألين قاسم دريس"},12,20,16,14,5,6,19,20,13,17,19,15,7,5,null,null,188,17.09090909090909,10,"A","ناجح",null,{"$f":"IF(B11=0,\"\",TOPTEN($S$7:$S$36,$B$7:$B$36,5,FALSE))","v":"رهف ايهاب رضا"},{"$f":"IF(C11=0,\"\",TOPTEN($S$7:$S$36,$B$7:$B$36,5,TRUE))","v":"الرابع"},null,"ألين قاسم دريس",{"$f":"Monthly1!S11","v":188},188,188,9,null,{"$f":"IF(C11=0,\"\",TOPTEN($AE$7:$AE$36,$B$7:$B$36,5,FALSE))","v":"جنى نور سليم"},{"$f":"IF(C11=0,\"\",TOPTEN($AE$7:$AE$36,$B$7:$B$36,5,TRUE))","v":"الخامس"}]
[{"$f":"IF(B12<>0,STName!A12,\"\")","v":6},{"$f":"STName!B12","v":"جنى حسن فقيه"},13,20,19,14,7,7,19,17,12,19,20,14,5,6,null,null,192,17.454545454545453,8,"A","ناجح",null,{"$f":"IF(B12=0,\"\",TOPTEN($S$7:$S$36,$B$7:$B$36,6,FALSE))","v":"جنى نور سليم"},{"$f":"IF(C12=0,\"\",TOPTEN($S$7:$S$36,$B$7:$B$36,6,TRUE))","v":"السادس"},null,"جنى حسن فقيه",{"$f":"Monthly1!S12","v":194},192,193,7,null,{"$f":"IF(C12=0,\"\",TOPTEN($AE$7:$AE$36,$B$7:$B$36,6,FALSE))","v":"ميريام زين العابدين زغيب"},{"$f":"IF(C12=0,\"\",TOPTEN($AE$7:$AE$36,$B$7:$B$36,6,TRUE))","v":"السادس"}]
[{"$f":"IF(B13<>0,STName!A13,\"\")","v":7},{"$f":"STName!B13","v":"جنى نور سليم"},14,20,20,14,7,7,20,20,13,20,10,15,7,7,null,null,194,17.636363636363637,6,"A","ناجح",null,{"$f":"IF(B13=\"\",\"\",TOPTEN($S$7:$S$36,$B$7:$B$36,7,FALSE))","v":"ميريام زين العابدين زغيب"},{"$f":"IF(C13=\"\",\"\",TOPTEN($S$7:$S$36,$B$7:$B$36,7,TRUE))","v":"السادس"},null,"جنى نور سليم",{"$f":"Monthly1!S13","v":200},194,197,5,null,{"$f":"IF(C13=0,\"\",TOPTEN($AE$7:$AE$36,$B$7:$B$36,7,FALSE))","v":"جنى حسن فقيه"},{"$f":"IF(C13=\"\",\"\",TOPTEN($AE$7:$AE$36,$B$7:$B$36,7,TRUE))","v":"السابع"}]
[{"$f":"IF(B14<>0,STName!A14,\"\")","v":8},{"$f":"STName!B14","v":"حسين علي حميه"},8,16,13,13,2,7,14,20,12,19,19,2,7,6,null,null,158,14.363636363636363,16,"B","ناجح",null,{"$f":"IF(B14=\"\",0,TOPTEN($S$7:$S$36,$B$7:$B$36,8,FALSE))","v":"جنى حسن فقيه"},{"$f":"IF(C14=\"\",0,TOPTEN($S$7:$S$36,$B$7:$B$36,8,TRUE))","v":"الثامن"},null,"حسين علي حميه",{"$f":"Monthly1!S14","v":158},158,158,17,null,{"$f":"IF(C14=0,\"\",TOPTEN($AE$7:$AE$36,$B$7:$B$36,8,FALSE))","v":"فاطمه علاء العساف"},{"$f":"IF(C14=\"\",0,TOPTEN($AE$7:$AE$36,$B$7:$B$36,8,TRUE))","v":"الثامن"}]
[{"$f":"IF(B15<>0,STName!A15,\"\")","v":9},{"$f":"STName!B15","v":"حنين علي العرب"},12,19,19,15,7,7,2,2,2,5,2,3,7,7,null,null,109,9.9090909090909083,24,"D","راسب",null,{"$f":"IF(B15=0,\"\",TOPTEN($S$7:$S$36,$B$7:$B$36,9,FALSE))","v":"فاطمه علاء العساف"},{"$f":"IF(C15=0,\"\",TOPTEN($S$7:$S$36,$B$7:$B$36,9,TRUE))","v":"التاسع"},null,"حنين علي العرب",{"$f":"Monthly1!S15","v":121},109,115,23,null,{"$f":"IF(C15=0,\"\",TOPTEN($AE$7:$AE$36,$B$7:$B$36,9,FALSE))","v":"ألين قاسم دريس"},{"$f":"IF(C15=0,\"\",TOPTEN($AE$7:$AE$36,$B$7:$B$36,9,TRUE))","v":"التاسع"}]
[{"$f":"IF(B16<>0,STName!A16,\"\")","v":10},{"$f":"STName!B16","v":"رهف ايهاب رضا"},14,20,19,15,7,7,20,20,12,20,20,15,7,6,null,null,202,18.363636363636363,4,"A","ناجح",null,{"$f":"IF(B16=0,\"\",TOPTEN($S$7:$S$36,$B$7:$B$36,10,FALSE))","v":"ألين قاسم دريس"},{"$f":"IF(C16=0,\"\",TOPTEN($S$7:$S$36,$B$7:$B$36,10,TRUE))","v":"العاشر"},null,"رهف ايهاب رضا",{"$f":"Monthly1!S16","v":202},202,202,3,null,{"$f":"IF(C16=0,\"\",TOPTEN($AE$7:$AE$36,$B$7:$B$36,10,FALSE))","v":"زين العابدين محمد رباح"},{"$f":"IF(C16=0,\"\",TOPTEN($AE$7:$AE$36,$B$7:$B$36,10,TRUE))","v":"التاسع"}]
[{"$f":"IF(B17<>0,STName!A17,\"\")","v":11},{"$f":"STName!B17","v":"روان عباس شميس"},6,12,11,12,5,5,9,8,9,12,10,6,6,5,null,null,116,10.545454545454545,22,"C","ناجح",null,{"$f":"IF(B17=0,\"\",TOPTEN($S$7:$S$36,$B$7:$B$36,11,FALSE))","v":"زين العابدين محمد رباح"},{"$f":"IF(C17=0,\"\",TOPTEN($S$7:$S$36,$B$7:$B$36,11,TRUE))","v":"العاشر"},null,"روان عباس شميس",{"$f":"Monthly1!S17","v":116},116,116,21,null,{"$f":"IF(C17=0,\"\",TOPTEN($AE$7:$AE$36,$B$7:$B$36,11,FALSE))","v":"نور محمد غيث"},{"$f":"IF(C17=0,\"\",TOPTEN($AE$7:$AE$36,$B$7:$B$36,11,TRUE))","v":"التاسع"}]
[{"$f":"IF(B18<>0,STName!A18,\"\")","v":12},{"$f":"STName!B18","v":"زين العابدين محمد رباح"},12,20,16,14,5,6,19,20,13,17,19,15,7,5,null,null,188,17.09090909090909,10,"A","ناجح",null,{"$f":"IF(B18=0,\"\",TOPTEN($S$7:$S$36,$B$7:$B$36,12,FALSE))","v":"علي الأكبر علي دره"},{"$f":"IF(C18=0,\"\",TOPTEN($S$7:$S$36,$B$7:$B$36,12,TRUE))","v":"الثانى عشر"},null,"زين العابدين محمد رباح",{"$f":"Monthly1!S18","v":188},188,188,9,null,{"$f":"IF(C18=0,\"\",TOPTEN($AE$7:$AE$36,$B$7:$B$36,12,FALSE))","v":"علي الأكبر علي دره"},{"$f":"IF(C18=0,\"\",TOPTEN($AE$7:$AE$36,$B$7:$B$36,12,TRUE))","v":"الثانى عشر"}]
[{"$f":"IF(B19<>0,STName!A19,\"\")","v":13},{"$f":"STName!B19","v":"زينب محمد فارس"},20,20,14,7,7,20,20,20,13,20,20,15,7,7,null,null,210,19.09090909090909,1,"A","ناجح",null,{"$f":"IF(B19=0,\"\",TOPTEN($S$7:$S$36,$B$7:$B$36,13,FALSE))","v":"محمد ايلي دبوس"},{"$f":"IF(C19=0,\"\",TOPTEN($S$7:$S$36,$B$7:$B$36,13,TRUE))","v":"الثانى عشر"},null,"زينب محمد فارس",{"$f":"Monthly1!S19","v":210},210,210,1,null,{"$f":"IF(C19=0,\"\",TOPTEN($AE$7:$AE$36,$B$7:$B$36,13,FALSE))","v":"يوسف رشاد سلوم"},{"$f":"IF(C19=0,\"\",TOPTEN($AE$7:$AE$36,$B$7:$B$36,13,TRUE))","v":"الثالث عشر"}]
[{"$f":"IF(B20<>0,STName!A20,\"\")","v":14},{"$f":"STName!B20","v":"علي الأكبر علي دره"},12,20,20,15,7,6,20,17,12,20,5,15,7,5,null,null,181,16.454545454545453,12,"A","ناجح",null,{"$f":"IF(B20=0,\"\",TOPTEN($S$7:$S$36,$B$7:$B$36,14,FALSE))","v":"يوسف رشاد سلوم"},{"$f":"IF(C20=0,\"\",TOPTEN($S$7:$S$36,$B$7:$B$36,14,TRUE))","v":"الثانى عشر"},null,"علي الأكبر علي دره",{"$f":"Monthly1!S20","v":189},181,185,12,null,{"$f":"IF(C20=0,\"\",TOPTEN($AE$7:$AE$36,$B$7:$B$36,14,FALSE))","v":"محمد ايلي دبوس"},{"$f":"IF(C20=0,\"\",TOPTEN($AE$7:$AE$36,$B$7:$B$36,14,TRUE))","v":"الرايع عشر"}]
[{"$f":"IF(B21<>0,STName!A21,\"\")","v":15},{"$f":"STName!B21","v":"علي حسين سليم"},8,17,18,13,7,6,15,14,10,15,1,8,7,5,null,null,144,13.090909090909092,20,"B","ناجح",null,{"$f":"IF(B21=0,\"\",TOPTEN($S$7:$S$36,$B$7:$B$36,15,FALSE))","v":"علي رضا يوسف المولى"},{"$f":"IF(C21=0,\"\",TOPTEN($S$7:$S$36,$B$7:$B$36,15,TRUE))","v":"الخامس عشر"},null,"علي حسين سليم",{"$f":"Monthly1!S21","v":162},144,153,19,null,{"$f":"IF(C21=0,\"\",TOPTEN($AE$7:$AE$36,$B$7:$B$36,15,FALSE))","v":"محمد علي فؤاد زعيتر"},{"$f":"IF(C21=0,\"\",TOPTEN($AE$7:$AE$36,$B$7:$B$36,15,TRUE))","v":"الخامس عشر"}]
[{"$f":"IF(B22<>0,STName!A22,\"\")","v":16},{"$f":"STName!B22","v":"علي رضا يوسف المولى"},12,16,20,15,4,6,20,14,11,17,3,13,7,6,null,null,164,14.909090909090908,15,"B","ناجح",null,{"$f":"IF(B22=0,\"\",TOPTEN($S$7:$S$36,$B$7:$B$36,16,FALSE))","v":"امير سامر عبيد"},{"$f":"IF(C22=0,\"\",TOPTEN($S$7:$S$36,$B$7:$B$36,16,TRUE))","v":"السادس عشر"},null,"علي رضا يوسف المولى",{"$f":"Monthly1!S22","v":181},164,172.5,16,null,{"$f":"IF(C22=0,\"\",TOPTEN($AE$7:$AE$36,$B$7:$B$36,16,FALSE))","v":"علي رضا يوسف المولى"},{"$f":"IF(C22=0,\"\",TOPTEN($AE$7:$AE$36,$B$7:$B$36,16,TRUE))","v":"السادس عشر"}]
[{"$f":"IF(B23<>0,STName!A23,\"\")","v":17},{"$f":"STName!B23","v":"علي هادي المقداد"},9,14,11,12,6,6,11,9,10,19,18,14,7,6,null,null,152,13.818181818181818,19,"B","ناجح",null,{"$f":"IF(B23=0,\"\",TOPTEN($S$7:$S$36,$B$7:$B$36,17,FALSE))","v":"حسين علي حميه"},{"$f":"IF(C23=0,\"\",TOPTEN($S$7:$S$36,$B$7:$B$36,17,TRUE))","v":"السادس عشر"},null,"علي هادي المقداد",{"$f":"Monthly1!S23","v":152},152,152,20,null,{"$f":"IF(C23=0,\"\",TOPTEN($AE$7:$AE$36,$B$7:$B$36,17,FALSE))","v":"امير سامر عبيد"},{"$f":"IF(C23=0,\"\",TOPTEN($AE$7:$AE$36,$B$7:$B$36,17,TRUE))","v":"السابع عشر"}]
[{"$f":"IF(B24<>0,STName!A24,\"\")","v":18},{"$f":"STName!B24","v":"فاطمه علاء العساف"},13,20,19,14,7,7,19,17,12,19,20,14,7,3,null,null,191,17.363636363636363,9,"A","ناجح",null,{"$f":"IF(B24=0,\"\",TOPTEN($S$7:$S$36,$B$7:$B$36,18,FALSE))","v":"محمد علي فؤاد زعيتر"},{"$f":"IF(C24=0,\"\",TOPTEN($S$7:$S$36,$B$7:$B$36,18,TRUE))","v":"الثامن عشر"},null,"فاطمه علاء العساف",{"$f":"Monthly1!S24","v":194},191,192.5,8,null,{"$f":"IF(C24=0,\"\",TOPTEN($AE$7:$AE$36,$B$7:$B$36,18,FALSE))","v":"حسين علي حميه"},{"$f":"IF(C24=0,\"\",TOPTEN($AE$7:$AE$36,$B$7:$B$36,18,TRUE))","v":"السابع عشر"}]
[{"$f":"IF(B25<>0,STName!A25,\"\")","v":19},{"$f":"STName!B25","v":"لين عباس زعيتر"},14,20,20,14,7,7,20,20,13,20,20,15,7,7,null,null,204,18.545454545454547,2,"A","ناجح",null,{"$f":"IF(B25=0,\"\",TOPTEN($S$7:$S$36,$B$7:$B$36,19,FALSE))","v":"علي هادي المقداد"},{"$f":"IF(C25=0,\"\",TOPTEN($S$7:$S$36,$B$7:$B$36,19,TRUE))","v":"التاسع عشر"},null,"لين عباس زعيتر",{"$f":"Monthly1!S25","v":204},204,204,2,null,{"$f":"IF(C25=0,\"\",TOPTEN($AE$7:$AE$36,$B$7:$B$36,19,FALSE))","v":"علي حسين سليم"},{"$f":"IF(C25=0,\"\",TOPTEN($AE$7:$AE$36,$B$7:$B$36,19,TRUE))","v":"التاسع عشر"}]
[{"$f":"IF(B26<>0,STName!A26,\"\")","v":20},{"$f":"STName!B26","v":"محمد ايلي دبوس"},13,13,18,14,7,6,17,14,12,19,20,15,7,6,null,null,181,16.454545454545453,12,"A","ناجح",null,{"$f":"IF(B26=0,\"\",TOPTEN($S$7:$S$36,$B$7:$B$36,20,FALSE))","v":"علي حسين سليم"},{"$f":"IF(C26=0,\"\",TOPTEN($S$7:$S$36,$B$7:$B$36,20,TRUE))","v":"العشرون"},null,"محمد ايلي دبوس",{"$f":"Monthly1!S26","v":181},181,181,14,null,{"$f":"IF(C26=0,\"\",TOPTEN($AE$7:$AE$36,$B$7:$B$36,20,FALSE))","v":"علي هادي المقداد"},{"$f":"IF(C26=0,\"\",TOPTEN($AE$7:$AE$36,$B$7:$B$36,20,TRUE))","v":"العشرون"}]
[{"$f":"IF(B27<>0,STName!A27,\"\")","v":21},{"$f":"STName!B27","v":"محمد علي فؤاد زعيتر"},9,14,11,12,6,6,11,9,10,19,18,14,7,9,null,null,155,14.090909090909092,18,"B","ناجح",null,{"$f":"IF(B27=0,\"\",TOPTEN($S$7:$S$36,$B$7:$B$36,21,FALSE))","v":"إسماعيل محمد غيث"},{"$f":"IF(C27=0,\"\",TOPTEN($S$7:$S$36,$B$7:$B$36,21,TRUE))","v":"الواحد والعشرون"},null,"محمد علي فؤاد زعيتر",{"$f":"Monthly1!S27","v":206},155,180.5,15,null,{"$f":"IF(C27=0,\"\",TOPTEN($AE$7:$AE$36,$B$7:$B$36,21,FALSE))","v":"روان عباس شميس"},{"$f":"IF(C27=0,\"\",TOPTEN($AE$7:$AE$36,$B$7:$B$36,21,TRUE))","v":"الواحد والعشرون"}]
[{"$f":"IF(B28<>0,STName!A28,\"\")","v":22},{"$f":"STName!B28","v":"ميريام زين العابدين زغيب"},13,20,19,14,7,7,19,17,12,19,20,14,7,6,null,null,194,17.636363636363637,6,"A","ناجح",null,{"$f":"IF(B28=0,\"\",TOPTEN($S$7:$S$36,$B$7:$B$36,22,FALSE))","v":"روان عباس شميس"},{"$f":"IF(C28=0,\"\",TOPTEN($S$7:$S$36,$B$7:$B$36,22,TRUE))","v":"الثانى والعشرون"},null,"ميريام زين العابدين زغيب",{"$f":"Monthly1!S28","v":196},194,195,6,null,{"$f":"IF(C28=0,\"\",TOPTEN($AE$7:$AE$36,$B$7:$B$36,22,FALSE))","v":"إيلاف رشاد مشيك"},{"$f":"IF(C28=0,\"\",TOPTEN($AE$7:$AE$36,$B$7:$B$36,22,TRUE))","v":"الثانى والعشرون"}]
[{"$f":"IF(B29<>0,STName!A29,\"\")","v":23},{"$f":"STName!B29","v":"نور محمد غيث"},14,20,20,14,7,7,20,20,13,20,20,15,7,7,null,null,204,18.545454545454547,2,"A","ناجح",null,{"$f":"IF(B29=0,\"\",TOPTEN($S$7:$S$36,$B$7:$B$36,23,FALSE))","v":"إيلاف رشاد مشيك"},{"$f":"IF(C29=0,\"\",TOPTEN($S$7:$S$36,$B$7:$B$36,23,TRUE))","v":"الثالث والعشرون"},null,"نور محمد غيث",{"$f":"Monthly1!S29","v":172},204,188,9,null,{"$f":"IF(C29=0,\"\",TOPTEN($AE$7:$AE$36,$B$7:$B$36,23,FALSE))","v":"حنين علي العرب"},{"$f":"IF(C29=0,\"\",TOPTEN($AE$7:$AE$36,$B$7:$B$36,23,TRUE))","v":"الثالث والعشرون"}]
[{"$f":"IF(B30<>0,STName!A30,\"\")","v":24},{"$f":"STName!B30","v":"يوسف رشاد سلوم"},13,13,18,14,7,6,17,14,12,19,20,15,7,6,null,null,181,16.454545454545453,12,"A","ناجح",null,{"$f":"IF(B30=0,\"\",TOPTEN($S$7:$S$36,$B$7:$B$36,24,FALSE))","v":"حنين علي العرب"},{"$f":"IF(C30=0,\"\",TOPTEN($S$7:$S$36,$B$7:$B$36,24,TRUE))","v":"الرابع والعشرون"},null,"يوسف رشاد سلوم",{"$f":"Monthly1!S30","v":183},181,182,13,null,{"$f":"IF(C30=0,\"\",TOPTEN($AE$7:$AE$36,$B$7:$B$36,24,FALSE))","v":"إسماعيل محمد غيث"},{"$f":"IF(C30=0,\"\",TOPTEN($AE$7:$AE$36,$B$7:$B$36,24,TRUE))","v":"الرابع والعشرون"}]
[{"$f":"IF(B31<>0,STName!A31,\"\")","v":""},{"$f":"STName!B31","v":0},null,null,null,null,null,null,null,null,null,null,null,null,null,null,null,null,"","","","","",null,{"$f":"IF(B31=0,\"\",TOPTEN($S$7:$S$36,$B$7:$B$36,25,FALSE))","v":""},{"$f":"IF(C31=0,\"\",TOPTEN($S$7:$S$36,$B$7:$B$36,25,TRUE))","v":""},null,0,{"$f":"Monthly1!S31","v":""},"","","",null,{"$f":"IF(C31=0,\"\",TOPTEN($AE$7:$AE$36,$B$7:$B$36,25,FALSE))","v":""},{"$f":"IF(C31=0,\"\",TOPTEN($AE$7:$AE$36,$B$7:$B$36,25,TRUE))","v":""}]
[{"$f":"IF(B32<>0,STName!A32,\"\")","v":""},{"$f":"STName!B32","v":0},null,null,null,null,null,null,null,null,null,null,null,null,null,null,null,null,"","","","","",null,{"$f":"IF(B32=0,\"\",TOPTEN($S$7:$S$36,$B$7:$B$36,26,FALSE))","v":""},{"$f":"IF(C32=0,\"\",TOPTEN($S$7:$S$36,$B$7:$B$36,26,TRUE))","v":""},null,0,{"$f":"Monthly1!S32","v":""},"","","",null,{"$f":"IF(C32=0,\"\",TOPTEN($AE$7:$AE$36,$B$7:$B$36,26,FALSE))","v":""},{"$f":"IF(C32=0,\"\",TOPTEN($AE$7:$AE$36,$B$7:$B$36,26,TRUE))","v":""}]
[{"$f":"IF(B33<>0,STName!A33,\"\")","v":""},{"$f":"STName!B33","v":0},null,null,null,null,null,null,null,null,null,null,null,null,null,null,null,null,"","","","","",null,{"$f":"IF(B33=0,\"\",TOPTEN($S$7:$S$36,$B$7:$B$36,27,FALSE))","v":""},{"$f":"IF(C33=0,\"\",TOPTEN($S$7:$S$36,$B$7:$B$36,27,TRUE))","v":""},null,0,{"$f":"Monthly1!S33","v":""},"","","",null,{"$f":"IF(C33=0,\"\",TOPTEN($AE$7:$AE$36,$B$7:$B$36,27,FALSE))","v":""},{"$f":"IF(C33=0,\"\",TOPTEN($AE$7:$AE$36,$B$7:$B$36,27,TRUE))","v":""}]
[{"$f":"IF(B34<>0,STName!A34,\"\")","v":""},{"$f":"STName!B34","v":0},null,null,null,null,null,null,null,null,null,null,null,null,null,null,null,null,"","","","","",null,{"$f":"IF(B34=0,\"\",TOPTEN($S$7:$S$36,$B$7:$B$36,28,FALSE))","v":""},{"$f":"IF(C34=0,\"\",TOPTEN($S$7:$S$36,$B$7:$B$36,28,TRUE))","v":""},null,0,{"$f":"Monthly1!S34","v":""},"","","",null,{"$f":"IF(C34=0,\"\",TOPTEN($AE$7:$AE$36,$B$7:$B$36,28,FALSE))","v":""},{"$f":"IF(C34=0,\"\",TOPTEN($AE$7:$AE$36,$B$7:$B$36,28,TRUE))","v":""}]
[{"$f":"IF(B35<>0,STName!A35,\"\")","v":""},{"$f":"STName!B35","v":0},null,null,null,null,null,null,null,null,null,null,null,null,null,null,null,null,"","","","","",null,{"$f":"IF(B35=0,\"\",TOPTEN($S$7:$S$36,$B$7:$B$36,29,FALSE))","v":""},{"$f":"IF(C35=0,\"\",TOPTEN($S$7:$S$36,$B$7:$B$36,29,TRUE))","v":""},null,0,{"$f":"Monthly1!S35","v":""},"","","",null,{"$f":"IF(C35=0,\"\",TOPTEN($AE$7:$AE$36,$B$7:$B$36,29,FALSE))","v":""},{"$f":"IF(C35=0,\"\",TOPTEN($AE$7:$AE$36,$B$7:$B$36,29,TRUE))","v":""}]
[{"$f":"IF(B36<>0,STName!A36,\"\")","v":""},{"$f":"STName!B36","v":0},null,null,null,null,null,null,null,null,null,null,null,null,null,null,null,null,"","","","","",null,{"$f":"IF(B36=0,\"\",TOPTEN($S$7:$S$36,$B$7:$B$36,30,FALSE))","v":""},{"$f":"IF(C36=0,\"\",TOPTEN($S$7:$S$36,$B$7:$B$36,30,TRUE))","v":""},null,0,{"$f":"Monthly1!S36","v":""},"","","",null,{"$f":"IF(C36=0,\"\",TOPTEN($AE$7:$AE$36,$B$7:$B$36,30,FALSE))","v":""},{"$f":"IF(C36=0,\"\",TOPTEN($AE$7:$AE$36,$B$7:$B$36,30,TRUE))","v":""}]
[]
[null,"أعلى علامة",{"$f":"MAX(C7:C36)","v":20},{"$f":"MAX(D7:D36)","v":20},20,15,7,20,20,20,13,20,20,15,7,9,0,0,210,19.09090909090909]
[null,"أدنى علامة",{"$f":"MIN(C7:C36)","v":6},{"$f":"MIN(D7:D36)","v":12},11,7,2,5,2,2,2,5,1,2,5,3,0,0,109,9.9090909090909083]
[null,"عدد الناجحين",{"$f":"COUNTIF(C7:C36,\">=\"&C6/2)","v":17},24,24,24,21,1,20,18,20,22,20,21,24,22,0,0,{"$f":"COUNTIF(S7:S36,\">=\"&S6/2)","v":23},{"$f":"COUNTIF(T7:T36,\">=10\")","v":23}]
[null,"عدد الراسبين",{"$f":"COUNTIF(C7:C37,\"<\"&C6/2)","v":7},0,0,0,3,23,4,6,4,2,4,3,0,2,0,0,{"$f":"COUNTIF(S7:S37,\"<\"&S6/2)","v":1},{"$f":"COUNTIF(T7:T37,\"<10\")","v":1}]

{"sheet":"Monthly2","index":3,"n_rows":41,"n_cols":26,"rows_kept":41,"cut":false,"hidden":false,"merged":[[2,24,2,25],[0,0,0,22],[1,2,1,4],[2,2,2,4],[2,5,2,7],[2,16,2,19],[2,20,2,22],[1,16,1,22]]}
[{"$f":"STName!A1","v":"International Lessing School"}]
[null,"الصــــــــــــــــــــف:",{"$f":"STName!M3","v":"Grade 01 A Moon"},null,null,null,null,null,null,null,null,null,null,null,null,null,{"$f":"STName!A2","v":"Academic Year: 2024-2025"}]
[null,null,null,null,null,null,null,null,null,null,null,null,null,null,null,null,"عــلامــات شـهر:",null,null,null,"Monthly2",null,null,null,"الأوائل في الشهري الثاني"]
[]
["الرقم","اسم الطالب",{"$f":"STName!C5","v":"Reading"},{"$f":"STName!D5","v":"Dictation"},{"$f":"STName!E5","v":"Comp + Conv"},{"$f":"STName!F5","v":"Handwriting"},{"$f":"STName!G5","v":"Poetry"},{"$f":"STName!H5","v":"Science"},{"$f":"STName!I5","v":"Mathematics"},{"$f":"STName!J5","v":"القراءة"},{"$f":"STName!K5","v":"الإملاء"},{"$f":"STName!L5","v":"التعبير والمحادثة"},{"$f":"STName!M5","v":"المحفوظات"},{"$f":"STName!N5","v":"الخط"},{"$f":"STName!O5","v":"Sport"},{"$f":"STName!P5","v":"Art"},{"$f":"STName!Q5","v":0},{"$f":"STName!R5","v":0},"المجموع","المعدل","الترتيب","الفئة","النتيجة",null,"ترتيب تصاعدي","الأوائل"]
[null,"العلامة القصوى",{"$f":"STName!C6","v":20},{"$f":"STName!D6","v":20},{"$f":"STName!E6","v":20},{"$f":"STName!F6","v":10},{"$f":"STName!G6","v":10},{"$f":"STName!H6","v":20},{"$f":"STName!I6","v":20},{"$f":"STName!J6","v":20},{"$f":"STName!K6","v":20},{"$f":"STName!L6","v":20},{"$f":"STName!M6","v":10},{"$f":"STName!N6","v":10},{"$f":"STName!O6","v":10},{"$f":"STName!P6","v":10},{"$f":"STName!Q6","v":0},{"$f":"STName!R6","v":0},{"$f":"IF(C6<>0,SUM(C6:R6),\"\")","v":220},20]
[{"$f":"IF(B7<>0,STName!A7,\"\")","v":1},{"$f":"STName!B7","v":"امير سامر عبيد"},8,16,13,13,2,7,14,20,12,19,19,2,7,6,null,null,{"$f":"IF(C7<>0,SUM(C7:R7),\"\")","v":158},{"$f":"IF(C7<>0,S7*$T$6/$S$6,\"\")","v":14.363636363636363},{"$f":"IF(C7<>0,RANK(T7,$T$7:$T$36),\"\")","v":16},{"$f":"IF(C7<>0,IF(T7>=15,\"A\",IF(T7>=12,\"B\",IF(T7>=10,\"C\",IF(T7>=7.5,\"D\",\"E\")))),\"\")","v":"B"},{"$f":"IF(C7<>0,IF(T7>=10,\"ناجح\",\"راسب\"),\"\")","v":"ناجح"},null,{"$f":"IF(B7=0,\"\",TOPTEN($S$7:$S$36,$B$7:$B$36,1,FALSE))","v":"زينب محمد فارس"},{"$f":"IF(C7=0,\"\",TOPTEN($S$7:$S$36,$B$7:$B$36,1,TRUE))","v":"الأول"}]
[{"$f":"IF(B8<>0,STName!A8,\"\")","v":2},{"$f":"STName!B8","v":"إسماعيل محمد غيث"},12,19,19,15,7,7,2,2,2,5,2,1,7,6,null,null,106,{"$f":"IF(C8<>0,S8*$T$6/$S$6,\"\")","v":9.6363636363636367},{"$f":"IF(C8<>0,RANK(T8,$T$7:$T$36),\"\")","v":24},{"$f":"IF(C8<>0,IF(T8>=15,\"A\",IF(T8>=12,\"B\",IF(T8>=10,\"C\",IF(T8>=7.5,\"D\",\"E\")))),\"\")","v":"D"},{"$f":"IF(C8<>0,IF(T8>=10,\"ناجح\",\"راسب\"),\"\")","v":"راسب"},null,{"$f":"IF(B8=0,\"\",TOPTEN($S$7:$S$36,$B$7:$B$36,2,FALSE))","v":"جنى نور سليم"},{"$f":"IF(C8=0,\"\",TOPTEN($S$7:$S$36,$B$7:$B$36,2,TRUE))","v":"الثاني"}]
[{"$f":"IF(B9<>0,STName!A9,\"\")","v":3},{"$f":"STName!B9","v":"إلين كرم الحلاق"},14,20,19,15,7,7,20,20,12,20,20,15,7,6,null,null,202,18.363636363636363,4,"A","ناجح",null,{"$f":"IF(B9=0,\"\",TOPTEN($S$7:$S$36,$B$7:$B$36,3,FALSE))","v":"لين عباس زعيتر"},{"$f":"IF(C9=0,\"\",TOPTEN($S$7:$S$36,$B$7:$B$36,3,TRUE))","v":"الثاني"}]
[{"$f":"IF(B10<>0,STName!A10,\"\")","v":4},{"$f":"STName!B10","v":"إيلاف رشاد مشيك"},6,12,11,12,5,5,9,8,9,12,10,6,6,6,null,null,117,10.636363636363637,21,"C","ناجح",null,{"$f":"IF(B10=0,\"\",TOPTEN($S$7:$S$36,$B$7:$B$36,4,FALSE))","v":"إلين كرم الحلاق"},{"$f":"IF(C10=0,\"\",TOPTEN($S$7:$S$36,$B$7:$B$36,4,TRUE))","v":"الرابع"}]
[{"$f":"IF(B11<>0,STName!A11,\"\")","v":5},{"$f":"STName!B11","v":"ألين قاسم دريس"},12,20,16,14,5,6,19,20,13,17,19,15,7,5,null,null,188,17.09090909090909,10,"A","ناجح",null,{"$f":"IF(B11=0,\"\",TOPTEN($S$7:$S$36,$B$7:$B$36,5,FALSE))","v":"رهف ايهاب رضا"},{"$f":"IF(C11=0,\"\",TOPTEN($S$7:$S$36,$B$7:$B$36,5,TRUE))","v":"الرابع"}]
[{"$f":"IF(B12<>0,STName!A12,\"\")","v":6},{"$f":"STName!B12","v":"جنى حسن فقيه"},13,20,19,4,7,7,12,8,8,19,20,14,7,6,null,null,164,14.909090909090908,14,"B","ناجح",null,{"$f":"IF(B12=0,\"\",TOPTEN($S$7:$S$36,$B$7:$B$36,6,FALSE))","v":"ميريام زين العابدين زغيب"},{"$f":"IF(C12=0,\"\",TOPTEN($S$7:$S$36,$B$7:$B$36,6,TRUE))","v":"السادس"}]
[{"$f":"IF(B13<>0,STName!A13,\"\")","v":7},{"$f":"STName!B13","v":"جنى نور سليم"},14,20,20,14,7,7,20,20,13,20,20,15,7,7,null,null,204,18.545454545454547,2,"A","ناجح",null,{"$f":"IF(B13=\"\",\"\",TOPTEN($S$7:$S$36,$B$7:$B$36,7,FALSE))","v":"علي الأكبر علي دره"},{"$f":"IF(C13=\"\",\"\",TOPTEN($S$7:$S$36,$B$7:$B$36,7,TRUE))","v":"السابع"}]
[{"$f":"IF(B14<>0,STName!A14,\"\")","v":8},{"$f":"STName!B14","v":"حسين علي حميه"},8,16,13,13,2,7,14,20,12,19,19,2,7,6,null,null,158,14.363636363636363,16,"B","ناجح",null,{"$f":"IF(B14=\"\",0,TOPTEN($S$7:$S$36,$B$7:$B$36,8,FALSE))","v":"فاطمه علاء العساف"},{"$f":"IF(C14=\"\",0,TOPTEN($S$7:$S$36,$B$7:$B$36,8,TRUE))","v":"الثامن"}]
[{"$f":"IF(B15<>0,STName!A15,\"\")","v":9},{"$f":"STName!B15","v":"حنين علي العرب"},12,19,19,15,7,7,2,2,2,5,2,1,7,7,null,null,107,9.7272727272727266,23,"D","راسب",null,{"$f":"IF(B15=0,\"\",TOPTEN($S$7:$S$36,$B$7:$B$36,9,FALSE))","v":"يوسف رشاد سلوم"},{"$f":"IF(C15=0,\"\",TOPTEN($S$7:$S$36,$B$7:$B$36,9,TRUE))","v":"التاسع"}]
[{"$f":"IF(B16<>0,STName!A16,\"\")","v":10},{"$f":"STName!B16","v":"رهف ايهاب رضا"},14,20,19,15,7,7,20,20,12,20,20,15,7,6,null,null,202,18.363636363636363,4,"A","ناجح",null,{"$f":"IF(B16=0,\"\",TOPTEN($S$7:$S$36,$B$7:$B$36,10,FALSE))","v":"ألين قاسم دريس"},{"$f":"IF(C16=0,\"\",TOPTEN($S$7:$S$36,$B$7:$B$36,10,TRUE))","v":"العاشر"}]
[{"$f":"IF(B17<>0,STName!A17,\"\")","v":11},{"$f":"STName!B17","v":"روان عباس شميس"},6,12,11,12,5,5,9,8,9,12,10,6,6,5,null,null,116,10.545454545454545,22,"C","ناجح",null,{"$f":"IF(B17=0,\"\",TOPTEN($S$7:$S$36,$B$7:$B$36,11,FALSE))","v":"زين العابدين محمد رباح"},{"$f":"IF(C17=0,\"\",TOPTEN($S$7:$S$36,$B$7:$B$36,11,TRUE))","v":"العاشر"}]
[{"$f":"IF(B18<>0,STName!A18,\"\")","v":12},{"$f":"STName!B18","v":"زين العابدين محمد رباح"},12,20,16,14,5,6,19,20,13,17,19,15,7,5,null,null,188,17.09090909090909,10,"A","ناجح",null,{"$f":"IF(B18=0,\"\",TOPTEN($S$7:$S$36,$B$7:$B$36,12,FALSE))","v":"علي رضا يوسف المولى"},{"$f":"IF(C18=0,\"\",TOPTEN($S$7:$S$36,$B$7:$B$36,12,TRUE))","v":"الثانى عشر"}]
[{"$f":"IF(B19<>0,STName!A19,\"\")","v":13},{"$f":"STName!B19","v":"زينب محمد فارس"},20,20,14,7,7,20,20,20,13,20,20,15,7,7,null,null,210,19.09090909090909,1,"A","ناجح",null,{"$f":"IF(B19=0,\"\",TOPTEN($S$7:$S$36,$B$7:$B$36,13,FALSE))","v":"محمد ايلي دبوس"},{"$f":"IF(C19=0,\"\",TOPTEN($S$7:$S$36,$B$7:$B$36,13,TRUE))","v":"الثانى عشر"}]
[{"$f":"IF(B20<>0,STName!A20,\"\")","v":14},{"$f":"STName!B20","v":"علي الأكبر علي دره"},12,20,20,15,7,6,20,17,12,20,20,15,7,5,null,null,196,17.818181818181817,7,"A","ناجح",null,{"$f":"IF(B20=0,\"\",TOPTEN($S$7:$S$36,$B$7:$B$36,14,FALSE))","v":"جنى حسن فقيه"},{"$f":"IF(C20=0,\"\",TOPTEN($S$7:$S$36,$B$7:$B$36,14,TRUE))","v":"الرايع عشر"}]
[{"$f":"IF(B21<>0,STName!A21,\"\")","v":15},{"$f":"STName!B21","v":"علي حسين سليم"},8,17,18,13,7,6,15,14,10,15,19,8,7,5,null,null,162,14.727272727272727,15,"B","ناجح",null,{"$f":"IF(B21=0,\"\",TOPTEN($S$7:$S$36,$B$7:$B$36,15,FALSE))","v":"علي حسين سليم"},{"$f":"IF(C21=0,\"\",TOPTEN($S$7:$S$36,$B$7:$B$36,15,TRUE))","v":"الخامس عشر"}]
[{"$f":"IF(B22<>0,STName!A22,\"\")","v":16},{"$f":"STName!B22","v":"علي رضا يوسف المولى"},12,16,20,15,4,6,20,14,11,17,20,13,7,6,null,null,181,16.454545454545453,12,"A","ناجح",null,{"$f":"IF(B22=0,\"\",TOPTEN($S$7:$S$36,$B$7:$B$36,16,FALSE))","v":"امير سامر عبيد"},{"$f":"IF(C22=0,\"\",TOPTEN($S$7:$S$36,$B$7:$B$36,16,TRUE))","v":"السادس عشر"}]
[{"$f":"IF(B23<>0,STName!A23,\"\")","v":17},{"$f":"STName!B23","v":"علي هادي المقداد"},9,14,11,12,6,6,11,9,10,19,18,14,7,6,null,null,152,13.818181818181818,18,"B","ناجح",null,{"$f":"IF(B23=0,\"\",TOPTEN($S$7:$S$36,$B$7:$B$36,17,FALSE))","v":"حسين علي حميه"},{"$f":"IF(C23=0,\"\",TOPTEN($S$7:$S$36,$B$7:$B$36,17,TRUE))","v":"السادس عشر"}]
[{"$f":"IF(B24<>0,STName!A24,\"\")","v":18},{"$f":"STName!B24","v":"فاطمه علاء العساف"},13,20,19,14,7,7,19,17,12,19,20,14,7,6,null,null,194,17.636363636363637,8,"A","ناجح",null,{"$f":"IF(B24=0,\"\",TOPTEN($S$7:$S$36,$B$7:$B$36,18,FALSE))","v":"علي هادي المقداد"},{"$f":"IF(C24=0,\"\",TOPTEN($S$7:$S$36,$B$7:$B$36,18,TRUE))","v":"الثامن عشر"}]
[{"$f":"IF(B25<>0,STName!A25,\"\")","v":19},{"$f":"STName!B25","v":"لين عباس زعيتر"},14,20,20,14,7,7,20,20,13,20,20,15,7,7,null,null,204,18.545454545454547,2,"A","ناجح",null,{"$f":"IF(B25=0,\"\",TOPTEN($S$7:$S$36,$B$7:$B$36,19,FALSE))","v":"محمد علي فؤاد زعيتر"},{"$f":"IF(C25=0,\"\",TOPTEN($S$7:$S$36,$B$7:$B$36,19,TRUE))","v":"التاسع عشر"}]
[{"$f":"IF(B26<>0,STName!A26,\"\")","v":20},{"$f":"STName!B26","v":"محمد ايلي دبوس"},13,13,18,14,7,6,17,14,12,19,20,15,7,6,null,null,181,16.454545454545453,12,"A","ناجح",null,{"$f":"IF(B26=0,\"\",TOPTEN($S$7:$S$36,$B$7:$B$36,20,FALSE))","v":"نور محمد غيث"},{"$f":"IF(C26=0,\"\",TOPTEN($S$7:$S$36,$B$7:$B$36,20,TRUE))","v":"العشرون"}]
[{"$f":"IF(B27<>0,STName!A27,\"\")","v":21},{"$f":"STName!B27","v":"محمد علي فؤاد زعيتر"},12,19,19,15,7,7,2,2,2,19,18,14,7,6,null,null,149,13.545454545454545,19,"B","ناجح",null,{"$f":"IF(B27=0,\"\",TOPTEN($S$7:$S$36,$B$7:$B$36,21,FALSE))","v":"إيلاف رشاد مشيك"},{"$f":"IF(C27=0,\"\",TOPTEN($S$7:$S$36,$B$7:$B$36,21,TRUE))","v":"الواحد والعشرون"}]
[{"$f":"IF(B28<>0,STName!A28,\"\")","v":22},{"$f":"STName!B28","v":"ميريام زين العابدين زغيب"},14,20,19,15,7,7,20,20,12,19,20,14,7,6,null,null,200,18.181818181818183,6,"A","ناجح",null,{"$f":"IF(B28=0,\"\",TOPTEN($S$7:$S$36,$B$7:$B$36,22,FALSE))","v":"روان عباس شميس"},{"$f":"IF(C28=0,\"\",TOPTEN($S$7:$S$36,$B$7:$B$36,22,TRUE))","v":"الثانى والعشرون"}]
[{"$f":"IF(B29<>0,STName!A29,\"\")","v":23},{"$f":"STName!B29","v":"نور محمد غيث"},6,12,11,12,5,5,9,8,9,20,20,15,7,7,null,null,146,13.272727272727273,20,"B","ناجح",null,{"$f":"IF(B29=0,\"\",TOPTEN($S$7:$S$36,$B$7:$B$36,23,FALSE))","v":"حنين علي العرب"},{"$f":"IF(C29=0,\"\",TOPTEN($S$7:$S$36,$B$7:$B$36,23,TRUE))","v":"الثالث والعشرون"}]
[{"$f":"IF(B30<>0,STName!A30,\"\")","v":24},{"$f":"STName!B30","v":"يوسف رشاد سلوم"},12,20,16,14,5,6,19,20,13,19,20,15,7,6,null,null,192,17.454545454545453,9,"A","ناجح",null,{"$f":"IF(B30=0,\"\",TOPTEN($S$7:$S$36,$B$7:$B$36,24,FALSE))","v":"إسماعيل محمد غيث"},{"$f":"IF(C30=0,\"\",TOPTEN($S$7:$S$36,$B$7:$B$36,24,TRUE))","v":"الرابع والعشرون"}]
[{"$f":"IF(B31<>0,STName!A31,\"\")","v":""},{"$f":"STName!B31","v":0},null,null,null,null,null,null,null,null,null,null,null,null,null,null,null,null,"","","","","",null,{"$f":"IF(B31=0,\"\",TOPTEN($S$7:$S$36,$B$7:$B$36,25,FALSE))","v":""},{"$f":"IF(C31=0,\"\",TOPTEN($S$7:$S$36,$B$7:$B$36,25,TRUE))","v":""}]
[{"$f":"IF(B32<>0,STName!A32,\"\")","v":""},{"$f":"STName!B32","v":0},null,null,null,null,null,null,null,null,null,null,null,null,null,null,null,null,"","","","","",null,{"$f":"IF(B32=0,\"\",TOPTEN($S$7:$S$36,$B$7:$B$36,26,FALSE))","v":""},{"$f":"IF(C32=0,\"\",TOPTEN($S$7:$S$36,$B$7:$B$36,26,TRUE))","v":""}]
[{"$f":"IF(B33<>0,STName!A33,\"\")","v":""},{"$f":"STName!B33","v":0},null,null,null,null,null,null,null,null,null,null,null,null,null,null,null,null,"","","","","",null,{"$f":"IF(B33=0,\"\",TOPTEN($S$7:$S$36,$B$7:$B$36,27,FALSE))","v":""},{"$f":"IF(C33=0,\"\",TOPTEN($S$7:$S$36,$B$7:$B$36,27,TRUE))","v":""}]
[{"$f":"IF(B34<>0,STName!A34,\"\")","v":""},{"$f":"STName!B34","v":0},null,null,null,null,null,null,null,null,null,null,null,null,null,null,null,null,"","","","","",null,{"$f":"IF(B34=0,\"\",TOPTEN($S$7:$S$36,$B$7:$B$36,28,FALSE))","v":""},{"$f":"IF(C34=0,\"\",TOPTEN($S$7:$S$36,$B$7:$B$36,28,TRUE))","v":""}]
[{"$f":"IF(B35<>0,STName!A35,\"\")","v":""},{"$f":"STName!B35","v":0},null,null,null,null,null,null,null,null,null,null,null,null,null,null,null,null,"","","","","",null,{"$f":"IF(B35=0,\"\",TOPTEN($S$7:$S$36,$B$7:$B$36,29,FALSE))","v":""},{"$f":"IF(C35=0,\"\",TOPTEN($S$7:$S$36,$B$7:$B$36,29,TRUE))","v":""}]
[{"$f":"IF(B36<>0,STName!A36,\"\")","v":""},{"$f":"STName!B36","v":0},null,null,null,null,null,null,null,null,null,null,null,null,null,null,null,null,"","","","","",null,{"$f":"IF(B36=0,\"\",TOPTEN($S$7:$S$36,$B$7:$B$36,30,FALSE))","v":""},{"$f":"IF(C36=0,\"\",TOPTEN($S$7:$S$36,$B$7:$B$36,30,TRUE))","v":""}]
[]
[null,"أعلى علامة",{"$f":"MAX(C7:C36)","v":20},{"$f":"MAX(D7:D36)","v":20},20,15,7,20,20,20,13,20,20,15,7,7,0,0,210,19.09090909090909]
[null,"أدنى علامة",{"$f":"MIN(C7:C36)","v":6},{"$f":"MIN(D7:D36)","v":12},11,4,2,5,2,2,2,5,2,1,6,5,0,0,106,9.6363636363636367]
[null,"عدد الناجحين",{"$f":"COUNTIF(C7:C36,\">=\"&C6/2)","v":17},24,24,23,21,1,18,16,17,22,22,20,24,24,0,0,{"$f":"COUNTIF(S7:S36,\">=\"&S6/2)","v":22},{"$f":"COUNTIF(T7:T36,\">=10\")","v":22}]
[null,"عدد الراسبين",{"$f":"COUNTIF(C7:C37,\"<\"&C6/2)","v":7},0,0,1,3,23,6,8,7,2,2,4,0,0,0,0,{"$f":"COUNTIF(S7:S37,\"<\"&S6/2)","v":2},{"$f":"COUNTIF(T7:T37,\"<10\")","v":2}]

{"sheet":"FinalYear","index":4,"n_rows":41,"n_cols":44,"rows_kept":41,"cut":false,"hidden":false,"merged":[[0,0,0,22],[1,2,1,4],[2,2,2,4],[2,5,2,7],[2,16,2,19],[2,20,2,22],[1,16,1,22],[2,24,2,25],[2,27,2,34],[2,36,2,43],[0,25,0,33],[0,38,0,42]]}
[{"$f":"STName!A1","v":"International Lessing School"},null,null,null,null,null,null,null,null,null,null,null,null,null,null,null,null,null,null,null,null,null,null,null,null,{"$f":"A1","v":"International Lessing School"},null,null,null,null,null,null,null,null,null,null,null,null,{"$f":"Z1","v":"International Lessing School"}]
[null,"الصــــــــــــــــــــف:",{"$f":"STName!M3","v":"Grade 01 A Moon"},null,null,null,null,null,null,null,null,null,null,null,null,null,{"$f":"STName!A2","v":"Academic Year: 2024-2025"},null,null,null,null,null,null,null,null,{"$f":"C2","v":"Grade 01 A Moon"},null,null,null,null,null,null,null,{"$f":"Q2","v":"Academic Year: 2024-2025"},null,null,null,{"$f":"Z2","v":"Grade 01 A Moon"},null,null,null,null,{"$f":"AH2","v":"Academic Year: 2024-2025"}]
[null,null,null,null,null,null,null,null,null,null,null,null,null,null,null,null,"عــلامــات شـهر:",null,null,null,"FinalYear",null,null,null,"الأوائل في امتحان آخر السنة",null,null,"معدل الفصل الثاني والاوائل في الفصل الثاني",null,null,null,null,null,null,null,null,"المعدل النهائي والأوائل في المعدل النهائي"]
[]
["الرقم","اسم الطالب",{"$f":"STName!C5","v":"Reading"},{"$f":"STName!D5","v":"Dictation"},{"$f":"STName!E5","v":"Comp + Conv"},{"$f":"STName!F5","v":"Handwriting"},{"$f":"STName!G5","v":"Poetry"},{"$f":"STName!H5","v":"Science"},{"$f":"STName!I5","v":"Mathematics"},{"$f":"STName!J5","v":"القراءة"},{"$f":"STName!K5","v":"الإملاء"},{"$f":"STName!L5","v":"التعبير والمحادثة"},{"$f":"STName!M5","v":"المحفوظات"},{"$f":"STName!N5","v":"الخط"},{"$f":"STName!O5","v":"Sport"},{"$f":"STName!P5","v":"Art"},{"$f":"STName!Q5","v":0},{"$f":"STName!R5","v":0},"المجموع","المعدل","الترتيب","الفئة","النتيجة",null,"ترتيب تصاعدي","الأوائل",null,null,"سعي ثاني","نهائي","معدل فصل الثاني","ترتيب الفصل الثاني",null,"ترتيب تصاعدي","الأوائل",null,null,"فصل أول","فصل ثاني","معدل نهائي","ترتيب نهائي",null,"ترتيب تصاعدي","الأوائل"]
[null,"العلامة القصوى",{"$f":"STName!C6","v":20},{"$f":"STName!D6","v":20},{"$f":"STName!E6","v":20},{"$f":"STName!F6","v":10},{"$f":"STName!G6","v":10},{"$f":"STName!H6","v":20},{"$f":"STName!I6","v":20},{"$f":"STName!J6","v":20},{"$f":"STName!K6","v":20},{"$f":"STName!L6","v":20},{"$f":"STName!M6","v":10},{"$f":"STName!N6","v":10},{"$f":"STName!O6","v":10},{"$f":"STName!P6","v":10},{"$f":"STName!Q6","v":0},{"$f":"STName!R6","v":0},{"$f":"IF(C6<>0,SUM(C6:R6),\"\")","v":220},20,null,null,null,null,null,null,null,null,{"$f":"Monthly2!S6","v":220},{"$f":"S6","v":220},{"$f":"IF((AC6<>\"\")*AND(AD6<>\"\"),AVERAGE(AC6,AD6),\"\")","v":220},null,null,null,null,null,null,{"$f":"MidYear!AE6","v":220},{"$f":"AE6","v":220},{"$f":"IF((AL6<>\"\")*AND(AM6<>\"\"),AVERAGE(AL6,AM6),\"\")","v":220}]
[{"$f":"IF(B7<>0,STName!A7,\"\")","v":1},{"$f":"STName!B7","v":"امير سامر عبيد"},8,16,13,13,2,7,14,20,12,19,19,2,7,6,null,null,{"$f":"IF(C7<>0,SUM(C7:R7),\"\")","v":158},{"$f":"IF(C7<>0,S7*$T$6/$S$6,\"\")","v":14.363636363636363},{"$f":"IF(C7<>0,RANK(T7,$T$7:$T$36),\"\")","v":15},{"$f":"IF(C7<>0,IF(T7>=15,\"A\",IF(T7>=12,\"B\",IF(T7>=10,\"C\",IF(T7>=7.5,\"D\",\"E\")))),\"\")","v":"B"},{"$f":"IF(C7<>0,IF(T7>=10,\"ناجح\",\"راسب\"),\"\")","v":"ناجح"},null,{"$f":"IF(B7=0,\"\",TOPTEN($S$7:$S$36,$B$7:$B$36,1,FALSE))","v":"زينب محمد فارس"},{"$f":"IF(C7=0,\"\",TOPTEN($S$7:$S$36,$B$7:$B$36,1,TRUE))","v":"الأول"},null,{"$f":"B7","v":"امير سامر عبيد"},{"$f":"Monthly2!S7","v":158},158,{"$f":"IF((AC7<>\"\")*AND(AD7<>\"\"),AVERAGE(AC7,AD7),\"\")","v":158},{"$f":"IF(C7<>0,RANK(AE7,$AE$7:$AE$36),\"\")","v":16},null,{"$f":"IF(C7=0,\"\",TOPTEN($AE$7:$AE$36,$B$7:$B$36,1,FALSE))","v":"زينب محمد فارس"},{"$f":"IF(C7=0,\"\",TOPTEN($AE$7:$AE$36,$B$7:$B$36,1,TRUE))","v":"الأول"},null,{"$f":"B7","v":"امير سامر عبيد"},{"$f":"MidYear!AE7","v":158},{"$f":"AE7","v":158},{"$f":"IF((AL7<>\"\")*AND(AM7<>\"\"),AVERAGE(AL7,AM7),\"\")","v":158},{"$f":"IF(C7<>0,RANK(AN7,$AN$7:$AN$36),\"\")","v":17},null,{"$f":"IF(C7=0,\"\",TOPTEN($AN$7:$AN$36,$B$7:$B$36,1,FALSE))","v":"زينب محمد فارس"},{"$f":"IF(C7=0,\"\",TOPTEN($AN$7:$AN$36,$B$7:$B$36,1,TRUE))","v":"الأول"}]
[{"$f":"IF(B8<>0,STName!A8,\"\")","v":2},{"$f":"STName!B8","v":"إسماعيل محمد غيث"},12,19,19,15,7,7,2,2,2,5,2,1,7,7,null,null,107,{"$f":"IF(C8<>0,S8*$T$6/$S$6,\"\")","v":9.7272727272727266},{"$f":"IF(C8<>0,RANK(T8,$T$7:$T$36),\"\")","v":24},{"$f":"IF(C8<>0,IF(T8>=15,\"A\",IF(T8>=12,\"B\",IF(T8>=10,\"C\",IF(T8>=7.5,\"D\",\"E\")))),\"\")","v":"D"},{"$f":"IF(C8<>0,IF(T8>=10,\"ناجح\",\"راسب\"),\"\")","v":"راسب"},null,{"$f":"IF(B8=0,\"\",TOPTEN($S$7:$S$36,$B$7:$B$36,2,FALSE))","v":"جنى نور سليم"},{"$f":"IF(C8=0,\"\",TOPTEN($S$7:$S$36,$B$7:$B$36,2,TRUE))","v":"الثاني"},null,"إسماعيل محمد غيث",{"$f":"Monthly2!S8","v":106},107,106.5,24,null,{"$f":"IF(C8=0,\"\",TOPTEN($AE$7:$AE$36,$B$7:$B$36,2,FALSE))","v":"جنى نور سليم"},{"$f":"IF(C8=0,\"\",TOPTEN($AE$7:$AE$36,$B$7:$B$36,2,TRUE))","v":"الثاني"},null,{"$f":"B8","v":"إسماعيل محمد غيث"},{"$f":"MidYear!AE8","v":112},106.5,109.25,{"$f":"IF(C8<>0,RANK(AN8,$AN$7:$AN$36),\"\")","v":24},null,{"$f":"IF(C8=0,\"\",TOPTEN($AN$7:$AN$36,$B$7:$B$36,2,FALSE))","v":"لين عباس زعيتر"},{"$f":"IF(C8=0,\"\",TOPTEN($AN$7:$AN$36,$B$7:$B$36,2,TRUE))","v":"الثاني"}]
[{"$f":"IF(B9<>0,STName!A9,\"\")","v":3},{"$f":"STName!B9","v":"إلين كرم الحلاق"},10,10,6,5,4,7,10,10,6,12,10,10,10,10,null,null,120,10.909090909090908,21,"C","ناجح",null,{"$f":"IF(B9=0,\"\",TOPTEN($S$7:$S$36,$B$7:$B$36,3,FALSE))","v":"لين عباس زعيتر"},{"$f":"IF(C9=0,\"\",TOPTEN($S$7:$S$36,$B$7:$B$36,3,TRUE))","v":"الثاني"},null,"إلين كرم الحلاق",{"$f":"Monthly2!S9","v":202},120,161,15,null,{"$f":"IF(C9=0,\"\",TOPTEN($AE$7:$AE$36,$B$7:$B$36,3,FALSE))","v":"لين عباس زعيتر"},{"$f":"IF(C9=0,\"\",TOPTEN($AE$7:$AE$36,$B$7:$B$36,3,TRUE))","v":"الثاني"},null,"إلين كرم الحلاق",{"$f":"MidYear!AE9","v":202},161,181.5,12,null,{"$f":"IF(C9=0,\"\",TOPTEN($AN$7:$AN$36,$B$7:$B$36,3,FALSE))","v":"رهف ايهاب رضا"},{"$f":"IF(C9=0,\"\",TOPTEN($AN$7:$AN$36,$B$7:$B$36,3,TRUE))","v":"الثالث"}]
[{"$f":"IF(B10<>0,STName!A10,\"\")","v":4},{"$f":"STName!B10","v":"إيلاف رشاد مشيك"},6,12,11,12,5,5,9,8,9,12,10,6,6,5,null,null,116,10.545454545454545,22,"C","ناجح",null,{"$f":"IF(B10=0,\"\",TOPTEN($S$7:$S$36,$B$7:$B$36,4,FALSE))","v":"رهف ايهاب رضا"},{"$f":"IF(C10=0,\"\",TOPTEN($S$7:$S$36,$B$7:$B$36,4,TRUE))","v":"الرابع"},null,"إيلاف رشاد مشيك",{"$f":"Monthly2!S10","v":117},116,116.5,21,null,{"$f":"IF(C10=0,\"\",TOPTEN($AE$7:$AE$36,$B$7:$B$36,4,FALSE))","v":"رهف ايهاب رضا"},{"$f":"IF(C10=0,\"\",TOPTEN($AE$7:$AE$36,$B$7:$B$36,4,TRUE))","v":"الرابع"},null,"إيلاف رشاد مشيك",{"$f":"MidYear!AE10","v":115.5},116.5,116,21,null,{"$f":"IF(C10=0,\"\",TOPTEN($AN$7:$AN$36,$B$7:$B$36,4,FALSE))","v":"جنى نور سليم"},{"$f":"IF(C10=0,\"\",TOPTEN($AN$7:$AN$36,$B$7:$B$36,4,TRUE))","v":"الرابع"}]
[{"$f":"IF(B11<>0,STName!A11,\"\")","v":5},{"$f":"STName!B11","v":"ألين قاسم دريس"},12,20,16,14,5,6,19,20,13,17,19,15,7,5,null,null,188,17.09090909090909,10,"A","ناجح",null,{"$f":"IF(B11=0,\"\",TOPTEN($S$7:$S$36,$B$7:$B$36,5,FALSE))","v":"ميريام زين العابدين زغيب"},{"$f":"IF(C11=0,\"\",TOPTEN($S$7:$S$36,$B$7:$B$36,5,TRUE))","v":"الخامس"},null,"ألين قاسم دريس",{"$f":"Monthly2!S11","v":188},188,188,9,null,{"$f":"IF(C11=0,\"\",TOPTEN($AE$7:$AE$36,$B$7:$B$36,5,FALSE))","v":"ميريام زين العابدين زغيب"},{"$f":"IF(C11=0,\"\",TOPTEN($AE$7:$AE$36,$B$7:$B$36,5,TRUE))","v":"الخامس"},null,"ألين قاسم دريس",{"$f":"MidYear!AE11","v":188},188,188,8,null,{"$f":"IF(C11=0,\"\",TOPTEN($AN$7:$AN$36,$B$7:$B$36,5,FALSE))","v":"ميريام زين العابدين زغيب"},{"$f":"IF(C11=0,\"\",TOPTEN($AN$7:$AN$36,$B$7:$B$36,5,TRUE))","v":"الخامس"}]
[{"$f":"IF(B12<>0,STName!A12,\"\")","v":6},{"$f":"STName!B12","v":"جنى حسن فقيه"},13,20,19,14,7,7,19,17,12,19,20,14,6,6,null,null,193,17.545454545454547,8,"A","ناجح",null,{"$f":"IF(B12=0,\"\",TOPTEN($S$7:$S$36,$B$7:$B$36,6,FALSE))","v":"فاطمه علاء العساف"},{"$f":"IF(C12=0,\"\",TOPTEN($S$7:$S$36,$B$7:$B$36,6,TRUE))","v":"السادس"},null,"جنى حسن فقيه",{"$f":"Monthly2!S12","v":164},193,178.5,13,null,{"$f":"IF(C12=0,\"\",TOPTEN($AE$7:$AE$36,$B$7:$B$36,6,FALSE))","v":"فاطمه علاء العساف"},{"$f":"IF(C12=0,\"\",TOPTEN($AE$7:$AE$36,$B$7:$B$36,6,TRUE))","v":"السادس"},null,"جنى حسن فقيه",{"$f":"MidYear!AE12","v":193},178.5,185.75,11,null,{"$f":"IF(C12=0,\"\",TOPTEN($AN$7:$AN$36,$B$7:$B$36,6,FALSE))","v":"فاطمه علاء العساف"},{"$f":"IF(C12=0,\"\",TOPTEN($AN$7:$AN$36,$B$7:$B$36,6,TRUE))","v":"السادس"}]
[{"$f":"IF(B13<>0,STName!A13,\"\")","v":7},{"$f":"STName!B13","v":"جنى نور سليم"},14,20,20,14,7,7,20,20,13,20,20,15,7,7,null,null,204,18.545454545454547,2,"A","ناجح",null,{"$f":"IF(B13=\"\",\"\",TOPTEN($S$7:$S$36,$B$7:$B$36,7,FALSE))","v":"علي الأكبر علي دره"},{"$f":"IF(C13=\"\",\"\",TOPTEN($S$7:$S$36,$B$7:$B$36,7,TRUE))","v":"السابع"},null,"جنى نور سليم",{"$f":"Monthly2!S13","v":204},204,204,2,null,{"$f":"IF(C13=0,\"\",TOPTEN($AE$7:$AE$36,$B$7:$B$36,7,FALSE))","v":"علي الأكبر علي دره"},{"$f":"IF(C13=\"\",\"\",TOPTEN($AE$7:$AE$36,$B$7:$B$36,7,TRUE))","v":"السابع"},null,"جنى نور سليم",{"$f":"MidYear!AE13","v":197},204,200.5,4,null,{"$f":"IF(C13=0,\"\",TOPTEN($AN$7:$AN$36,$B$7:$B$36,7,FALSE))","v":"علي الأكبر علي دره"},{"$f":"IF(C13=0,\"\",TOPTEN($AN$7:$AN$36,$B$7:$B$36,7,TRUE))","v":"السابع"}]
[{"$f":"IF(B14<>0,STName!A14,\"\")","v":8},{"$f":"STName!B14","v":"حسين علي حميه"},8,16,13,13,2,7,14,20,12,19,19,2,7,6,null,null,158,14.363636363636363,15,"B","ناجح",null,{"$f":"IF(B14=\"\",0,TOPTEN($S$7:$S$36,$B$7:$B$36,8,FALSE))","v":"جنى حسن فقيه"},{"$f":"IF(C14=\"\",0,TOPTEN($S$7:$S$36,$B$7:$B$36,8,TRUE))","v":"الثامن"},null,"حسين علي حميه",{"$f":"Monthly2!S14","v":158},158,158,16,null,{"$f":"IF(C14=0,\"\",TOPTEN($AE$7:$AE$36,$B$7:$B$36,8,FALSE))","v":"يوسف رشاد سلوم"},{"$f":"IF(C14=\"\",0,TOPTEN($AE$7:$AE$36,$B$7:$B$36,8,TRUE))","v":"الثامن"},null,"حسين علي حميه",{"$f":"MidYear!AE14","v":158},158,158,17,null,{"$f":"IF(C14=0,\"\",TOPTEN($AN$7:$AN$36,$B$7:$B$36,8,FALSE))","v":"ألين قاسم دريس"},{"$f":"IF(C14=0,\"\",TOPTEN($AN$7:$AN$36,$B$7:$B$36,8,TRUE))","v":"الثامن"}]
[{"$f":"IF(B15<>0,STName!A15,\"\")","v":9},{"$f":"STName!B15","v":"حنين علي العرب"},12,19,19,15,7,7,2,2,2,5,12,5,7,7,null,null,121,11,20,"C","ناجح",null,{"$f":"IF(B15=0,\"\",TOPTEN($S$7:$S$36,$B$7:$B$36,9,FALSE))","v":"يوسف رشاد سلوم"},{"$f":"IF(C15=0,\"\",TOPTEN($S$7:$S$36,$B$7:$B$36,9,TRUE))","v":"التاسع"},null,"حنين علي العرب",{"$f":"Monthly2!S15","v":107},121,114,23,null,{"$f":"IF(C15=0,\"\",TOPTEN($AE$7:$AE$36,$B$7:$B$36,9,FALSE))","v":"ألين قاسم دريس"},{"$f":"IF(C15=0,\"\",TOPTEN($AE$7:$AE$36,$B$7:$B$36,9,TRUE))","v":"التاسع"},null,"حنين علي العرب",{"$f":"MidYear!AE15","v":115},114,114.5,23,null,{"$f":"IF(C15=0,\"\",TOPTEN($AN$7:$AN$36,$B$7:$B$36,9,FALSE))","v":"زين العابدين محمد رباح"},{"$f":"IF(C15=0,\"\",TOPTEN($AN$7:$AN$36,$B$7:$B$36,9,TRUE))","v":"الثامن"}]
[{"$f":"IF(B16<>0,STName!A16,\"\")","v":10},{"$f":"STName!B16","v":"رهف ايهاب رضا"},14,20,19,15,7,7,20,20,12,20,20,15,7,6,null,null,202,18.363636363636363,4,"A","ناجح",null,{"$f":"IF(B16=0,\"\",TOPTEN($S$7:$S$36,$B$7:$B$36,10,FALSE))","v":"ألين قاسم دريس"},{"$f":"IF(C16=0,\"\",TOPTEN($S$7:$S$36,$B$7:$B$36,10,TRUE))","v":"العاشر"},null,"رهف ايهاب رضا",{"$f":"Monthly2!S16","v":202},202,202,4,null,{"$f":"IF(C16=0,\"\",TOPTEN($AE$7:$AE$36,$B$7:$B$36,10,FALSE))","v":"زين العابدين محمد رباح"},{"$f":"IF(C16=0,\"\",TOPTEN($AE$7:$AE$36,$B$7:$B$36,10,TRUE))","v":"التاسع"},null,"رهف ايهاب رضا",{"$f":"MidYear!AE16","v":202},202,202,3,null,{"$f":"IF(C16=0,\"\",TOPTEN($AN$7:$AN$36,$B$7:$B$36,10,FALSE))","v":"يوسف رشاد سلوم"},{"$f":"IF(C16=0,\"\",TOPTEN($AN$7:$AN$36,$B$7:$B$36,10,TRUE))","v":"العاشر"}]
[{"$f":"IF(B17<>0,STName!A17,\"\")","v":11},{"$f":"STName!B17","v":"روان عباس شميس"},6,12,11,12,5,5,9,8,9,12,10,6,6,5,null,null,116,10.545454545454545,22,"C","ناجح",null,{"$f":"IF(B17=0,\"\",TOPTEN($S$7:$S$36,$B$7:$B$36,11,FALSE))","v":"زين العابدين محمد رباح"},{"$f":"IF(C17=0,\"\",TOPTEN($S$7:$S$36,$B$7:$B$36,11,TRUE))","v":"العاشر"},null,"روان عباس شميس",{"$f":"Monthly2!S17","v":116},116,116,22,null,{"$f":"IF(C17=0,\"\",TOPTEN($AE$7:$AE$36,$B$7:$B$36,11,FALSE))","v":"علي رضا يوسف المولى"},{"$f":"IF(C17=0,\"\",TOPTEN($AE$7:$AE$36,$B$7:$B$36,11,TRUE))","v":"الحادى عشر"},null,"روان عباس شميس",{"$f":"MidYear!AE17","v":116},116,116,21,null,{"$f":"IF(C17=0,\"\",TOPTEN($AN$7:$AN$36,$B$7:$B$36,11,FALSE))","v":"جنى حسن فقيه"},{"$f":"IF(C17=0,\"\",TOPTEN($AN$7:$AN$36,$B$7:$B$36,11,TRUE))","v":"الحادى عشر"}]
[{"$f":"IF(B18<>0,STName!A18,\"\")","v":12},{"$f":"STName!B18","v":"زين العابدين محمد رباح"},12,20,16,14,5,6,19,20,13,17,19,15,7,5,null,null,188,17.09090909090909,10,"A","ناجح",null,{"$f":"IF(B18=0,\"\",TOPTEN($S$7:$S$36,$B$7:$B$36,12,FALSE))","v":"علي رضا يوسف المولى"},{"$f":"IF(C18=0,\"\",TOPTEN($S$7:$S$36,$B$7:$B$36,12,TRUE))","v":"الثانى عشر"},null,"زين العابدين محمد رباح",{"$f":"Monthly2!S18","v":188},188,188,9,null,{"$f":"IF(C18=0,\"\",TOPTEN($AE$7:$AE$36,$B$7:$B$36,12,FALSE))","v":"محمد ايلي دبوس"},{"$f":"IF(C18=0,\"\",TOPTEN($AE$7:$AE$36,$B$7:$B$36,12,TRUE))","v":"الحادى عشر"},null,"زين العابدين محمد رباح",{"$f":"MidYear!AE18","v":188},188,188,8,null,{"$f":"IF(C18=0,\"\",TOPTEN($AN$7:$AN$36,$B$7:$B$36,12,FALSE))","v":"إلين كرم الحلاق"},{"$f":"IF(C18=0,\"\",TOPTEN($AN$7:$AN$36,$B$7:$B$36,12,TRUE))","v":"الثانى عشر"}]
[{"$f":"IF(B19<>0,STName!A19,\"\")","v":13},{"$f":"STName!B19","v":"زينب محمد فارس"},20,20,14,7,7,20,20,20,13,20,20,15,7,7,null,null,210,19.09090909090909,1,"A","ناجح",null,{"$f":"IF(B19=0,\"\",TOPTEN($S$7:$S$36,$B$7:$B$36,13,FALSE))","v":"محمد ايلي دبوس"},{"$f":"IF(C19=0,\"\",TOPTEN($S$7:$S$36,$B$7:$B$36,13,TRUE))","v":"الثانى عشر"},null,"زينب محمد فارس",{"$f":"Monthly2!S19","v":210},210,210,1,null,{"$f":"IF(C19=0,\"\",TOPTEN($AE$7:$AE$36,$B$7:$B$36,13,FALSE))","v":"جنى حسن فقيه"},{"$f":"IF(C19=0,\"\",TOPTEN($AE$7:$AE$36,$B$7:$B$36,13,TRUE))","v":"الثالث عشر"},null,"زينب محمد فارس",{"$f":"MidYear!AE19","v":210},210,210,1,null,{"$f":"IF(C19=0,\"\",TOPTEN($AN$7:$AN$36,$B$7:$B$36,13,FALSE))","v":"محمد ايلي دبوس"},{"$f":"IF(C19=0,\"\",TOPTEN($AN$7:$AN$36,$B$7:$B$36,13,TRUE))","v":"الثالث عشر"}]
[{"$f":"IF(B20<>0,STName!A20,\"\")","v":14},{"$f":"STName!B20","v":"علي الأكبر علي دره"},12,20,20,15,7,6,20,17,12,20,20,15,7,5,null,null,196,17.818181818181817,7,"A","ناجح",null,{"$f":"IF(B20=0,\"\",TOPTEN($S$7:$S$36,$B$7:$B$36,14,FALSE))","v":"علي حسين سليم"},{"$f":"IF(C20=0,\"\",TOPTEN($S$7:$S$36,$B$7:$B$36,14,TRUE))","v":"الرايع عشر"},null,"علي الأكبر علي دره",{"$f":"Monthly2!S20","v":196},196,196,7,null,{"$f":"IF(C20=0,\"\",TOPTEN($AE$7:$AE$36,$B$7:$B$36,14,FALSE))","v":"علي حسين سليم"},{"$f":"IF(C20=0,\"\",TOPTEN($AE$7:$AE$36,$B$7:$B$36,14,TRUE))","v":"الرايع عشر"},null,"علي الأكبر علي دره",{"$f":"MidYear!AE20","v":185},196,190.5,7,null,{"$f":"IF(C20=0,\"\",TOPTEN($AN$7:$AN$36,$B$7:$B$36,14,FALSE))","v":"علي رضا يوسف المولى"},{"$f":"IF(C20=0,\"\",TOPTEN($AN$7:$AN$36,$B$7:$B$36,14,TRUE))","v":"الرايع عشر"}]
[{"$f":"IF(B21<>0,STName!A21,\"\")","v":15},{"$f":"STName!B21","v":"علي حسين سليم"},8,17,18,13,7,6,15,14,10,15,19,8,7,5,null,null,162,14.727272727272727,14,"B","ناجح",null,{"$f":"IF(B21=0,\"\",TOPTEN($S$7:$S$36,$B$7:$B$36,15,FALSE))","v":"امير سامر عبيد"},{"$f":"IF(C21=0,\"\",TOPTEN($S$7:$S$36,$B$7:$B$36,15,TRUE))","v":"الخامس عشر"},null,"علي حسين سليم",{"$f":"Monthly2!S21","v":162},162,162,14,null,{"$f":"IF(C21=0,\"\",TOPTEN($AE$7:$AE$36,$B$7:$B$36,15,FALSE))","v":"إلين كرم الحلاق"},{"$f":"IF(C21=0,\"\",TOPTEN($AE$7:$AE$36,$B$7:$B$36,15,TRUE))","v":"الخامس عشر"},null,"علي حسين سليم",{"$f":"MidYear!AE21","v":153},162,157.5,19,null,{"$f":"IF(C21=0,\"\",TOPTEN($AN$7:$AN$36,$B$7:$B$36,15,FALSE))","v":"نور محمد غيث"},{"$f":"IF(C21=0,\"\",TOPTEN($AN$7:$AN$36,$B$7:$B$36,15,TRUE))","v":"الخامس عشر"}]
[{"$f":"IF(B22<>0,STName!A22,\"\")","v":16},{"$f":"STName!B22","v":"علي رضا يوسف المولى"},12,16,20,15,4,6,20,14,11,17,20,13,7,6,null,null,181,16.454545454545453,12,"A","ناجح",null,{"$f":"IF(B22=0,\"\",TOPTEN($S$7:$S$36,$B$7:$B$36,16,FALSE))","v":"حسين علي حميه"},{"$f":"IF(C22=0,\"\",TOPTEN($S$7:$S$36,$B$7:$B$36,16,TRUE))","v":"الخامس عشر"},null,"علي رضا يوسف المولى",{"$f":"Monthly2!S22","v":181},181,181,11,null,{"$f":"IF(C22=0,\"\",TOPTEN($AE$7:$AE$36,$B$7:$B$36,16,FALSE))","v":"امير سامر عبيد"},{"$f":"IF(C22=0,\"\",TOPTEN($AE$7:$AE$36,$B$7:$B$36,16,TRUE))","v":"السادس عشر"},null,"علي رضا يوسف المولى",{"$f":"MidYear!AE22","v":172.5},181,176.75,14,null,{"$f":"IF(C22=0,\"\",TOPTEN($AN$7:$AN$36,$B$7:$B$36,16,FALSE))","v":"محمد علي فؤاد زعيتر"},{"$f":"IF(C22=0,\"\",TOPTEN($AN$7:$AN$36,$B$7:$B$36,16,TRUE))","v":"السادس عشر"}]
[{"$f":"IF(B23<>0,STName!A23,\"\")","v":17},{"$f":"STName!B23","v":"علي هادي المقداد"},9,14,11,12,6,6,11,9,10,19,18,14,7,6,null,null,152,13.818181818181818,17,"B","ناجح",null,{"$f":"IF(B23=0,\"\",TOPTEN($S$7:$S$36,$B$7:$B$36,17,FALSE))","v":"علي هادي المقداد"},{"$f":"IF(C23=0,\"\",TOPTEN($S$7:$S$36,$B$7:$B$36,17,TRUE))","v":"السابع عشر"},null,"علي هادي المقداد",{"$f":"Monthly2!S23","v":152},152,152,18,null,{"$f":"IF(C23=0,\"\",TOPTEN($AE$7:$AE$36,$B$7:$B$36,17,FALSE))","v":"حسين علي حميه"},{"$f":"IF(C23=0,\"\",TOPTEN($AE$7:$AE$36,$B$7:$B$36,17,TRUE))","v":"السادس عشر"},null,"علي هادي المقداد",{"$f":"MidYear!AE23","v":152},152,152,20,null,{"$f":"IF(C23=0,\"\",TOPTEN($AN$7:$AN$36,$B$7:$B$36,17,FALSE))","v":"امير سامر عبيد"},{"$f":"IF(C23=0,\"\",TOPTEN($AN$7:$AN$36,$B$7:$B$36,17,TRUE))","v":"السابع عشر"}]
[{"$f":"IF(B24<>0,STName!A24,\"\")","v":18},{"$f":"STName!B24","v":"فاطمه علاء العساف"},13,20,19,14,7,7,19,17,12,19,20,14,9,9,null,null,199,18.09090909090909,6,"A","ناجح",null,{"$f":"IF(B24=0,\"\",TOPTEN($S$7:$S$36,$B$7:$B$36,18,FALSE))","v":"محمد علي فؤاد زعيتر"},{"$f":"IF(C24=0,\"\",TOPTEN($S$7:$S$36,$B$7:$B$36,18,TRUE))","v":"الثامن عشر"},null,"فاطمه علاء العساف",{"$f":"Monthly2!S24","v":194},199,196.5,6,null,{"$f":"IF(C24=0,\"\",TOPTEN($AE$7:$AE$36,$B$7:$B$36,18,FALSE))","v":"علي هادي المقداد"},{"$f":"IF(C24=0,\"\",TOPTEN($AE$7:$AE$36,$B$7:$B$36,18,TRUE))","v":"الثامن عشر"},null,"فاطمه علاء العساف",{"$f":"MidYear!AE24","v":192.5},196.5,194.5,6,null,{"$f":"IF(C24=0,\"\",TOPTEN($AN$7:$AN$36,$B$7:$B$36,18,FALSE))","v":"حسين علي حميه"},{"$f":"IF(C24=0,\"\",TOPTEN($AN$7:$AN$36,$B$7:$B$36,18,TRUE))","v":"السابع عشر"}]
[{"$f":"IF(B25<>0,STName!A25,\"\")","v":19},{"$f":"STName!B25","v":"لين عباس زعيتر"},14,20,20,14,7,7,20,20,13,20,20,15,7,7,null,null,204,18.545454545454547,2,"A","ناجح",null,{"$f":"IF(B25=0,\"\",TOPTEN($S$7:$S$36,$B$7:$B$36,19,FALSE))","v":"نور محمد غيث"},{"$f":"IF(C25=0,\"\",TOPTEN($S$7:$S$36,$B$7:$B$36,19,TRUE))","v":"التاسع عشر"},null,"لين عباس زعيتر",{"$f":"Monthly2!S25","v":204},204,204,2,null,{"$f":"IF(C25=0,\"\",TOPTEN($AE$7:$AE$36,$B$7:$B$36,19,FALSE))","v":"محمد علي فؤاد زعيتر"},{"$f":"IF(C25=0,\"\",TOPTEN($AE$7:$AE$36,$B$7:$B$36,19,TRUE))","v":"التاسع عشر"},null,"لين عباس زعيتر",{"$f":"MidYear!AE25","v":204},204,204,2,null,{"$f":"IF(C25=0,\"\",TOPTEN($AN$7:$AN$36,$B$7:$B$36,19,FALSE))","v":"علي حسين سليم"},{"$f":"IF(C25=0,\"\",TOPTEN($AN$7:$AN$36,$B$7:$B$36,19,TRUE))","v":"التاسع عشر"}]
[{"$f":"IF(B26<>0,STName!A26,\"\")","v":20},{"$f":"STName!B26","v":"محمد ايلي دبوس"},13,13,18,14,7,6,17,14,12,19,20,15,7,6,null,null,181,16.454545454545453,12,"A","ناجح",null,{"$f":"IF(B26=0,\"\",TOPTEN($S$7:$S$36,$B$7:$B$36,20,FALSE))","v":"حنين علي العرب"},{"$f":"IF(C26=0,\"\",TOPTEN($S$7:$S$36,$B$7:$B$36,20,TRUE))","v":"العشرون"},null,"محمد ايلي دبوس",{"$f":"Monthly2!S26","v":181},181,181,11,null,{"$f":"IF(C26=0,\"\",TOPTEN($AE$7:$AE$36,$B$7:$B$36,20,FALSE))","v":"نور محمد غيث"},{"$f":"IF(C26=0,\"\",TOPTEN($AE$7:$AE$36,$B$7:$B$36,20,TRUE))","v":"العشرون"},null,"محمد ايلي دبوس",{"$f":"MidYear!AE26","v":181},181,181,13,null,{"$f":"IF(C26=0,\"\",TOPTEN($AN$7:$AN$36,$B$7:$B$36,20,FALSE))","v":"علي هادي المقداد"},{"$f":"IF(C26=0,\"\",TOPTEN($AN$7:$AN$36,$B$7:$B$36,20,TRUE))","v":"العشرون"}]
[{"$f":"IF(B27<>0,STName!A27,\"\")","v":21},{"$f":"STName!B27","v":"محمد علي فؤاد زعيتر"},12,19,19,15,7,7,2,2,2,19,18,14,7,6,null,null,149,13.545454545454545,18,"B","ناجح",null,{"$f":"IF(B27=0,\"\",TOPTEN($S$7:$S$36,$B$7:$B$36,21,FALSE))","v":"إلين كرم الحلاق"},{"$f":"IF(C27=0,\"\",TOPTEN($S$7:$S$36,$B$7:$B$36,21,TRUE))","v":"الواحد والعشرون"},null,"محمد علي فؤاد زعيتر",{"$f":"Monthly2!S27","v":149},149,149,19,null,{"$f":"IF(C27=0,\"\",TOPTEN($AE$7:$AE$36,$B$7:$B$36,21,FALSE))","v":"إيلاف رشاد مشيك"},{"$f":"IF(C27=0,\"\",TOPTEN($AE$7:$AE$36,$B$7:$B$36,21,TRUE))","v":"الواحد والعشرون"},null,"محمد علي فؤاد زعيتر",{"$f":"MidYear!AE27","v":180.5},149,164.75,16,null,{"$f":"IF(C27=0,\"\",TOPTEN($AN$7:$AN$36,$B$7:$B$36,21,FALSE))","v":"إيلاف رشاد مشيك"},{"$f":"IF(C27=0,\"\",TOPTEN($AN$7:$AN$36,$B$7:$B$36,21,TRUE))","v":"الواحد والعشرون"}]
[{"$f":"IF(B28<>0,STName!A28,\"\")","v":22},{"$f":"STName!B28","v":"ميريام زين العابدين زغيب"},14,20,19,15,7,7,20,20,12,19,20,14,7,6,null,null,200,18.181818181818183,5,"A","ناجح",null,{"$f":"IF(B28=0,\"\",TOPTEN($S$7:$S$36,$B$7:$B$36,22,FALSE))","v":"إيلاف رشاد مشيك"},{"$f":"IF(C28=0,\"\",TOPTEN($S$7:$S$36,$B$7:$B$36,22,TRUE))","v":"الثانى والعشرون"},null,"ميريام زين العابدين زغيب",{"$f":"Monthly2!S28","v":200},200,200,5,null,{"$f":"IF(C28=0,\"\",TOPTEN($AE$7:$AE$36,$B$7:$B$36,22,FALSE))","v":"روان عباس شميس"},{"$f":"IF(C28=0,\"\",TOPTEN($AE$7:$AE$36,$B$7:$B$36,22,TRUE))","v":"الثانى والعشرون"},null,"ميريام زين العابدين زغيب",{"$f":"MidYear!AE28","v":195},200,197.5,5,null,{"$f":"IF(C28=0,\"\",TOPTEN($AN$7:$AN$36,$B$7:$B$36,22,FALSE))","v":"روان عباس شميس"},{"$f":"IF(C28=0,\"\",TOPTEN($AN$7:$AN$36,$B$7:$B$36,22,TRUE))","v":"الواحد والعشرون"}]
[{"$f":"IF(B29<>0,STName!A29,\"\")","v":23},{"$f":"STName!B29","v":"نور محمد غيث"},6,12,11,12,5,5,9,8,9,20,20,15,7,7,null,null,146,13.272727272727273,19,"B","ناجح",null,{"$f":"IF(B29=0,\"\",TOPTEN($S$7:$S$36,$B$7:$B$36,23,FALSE))","v":"روان عباس شميس"},{"$f":"IF(C29=0,\"\",TOPTEN($S$7:$S$36,$B$7:$B$36,23,TRUE))","v":"الثانى والعشرون"},null,"نور محمد غيث",{"$f":"Monthly2!S29","v":146},146,146,20,null,{"$f":"IF(C29=0,\"\",TOPTEN($AE$7:$AE$36,$B$7:$B$36,23,FALSE))","v":"حنين علي العرب"},{"$f":"IF(C29=0,\"\",TOPTEN($AE$7:$AE$36,$B$7:$B$36,23,TRUE))","v":"الثالث والعشرون"},null,"نور محمد غيث",{"$f":"MidYear!AE29","v":188},146,167,15,null,{"$f":"IF(C29=0,\"\",TOPTEN($AN$7:$AN$36,$B$7:$B$36,23,FALSE))","v":"حنين علي العرب"},{"$f":"IF(C29=0,\"\",TOPTEN($AN$7:$AN$36,$B$7:$B$36,23,TRUE))","v":"الثالث والعشرون"}]
[{"$f":"IF(B30<>0,STName!A30,\"\")","v":24},{"$f":"STName!B30","v":"يوسف رشاد سلوم"},12,20,16,14,5,6,19,20,13,19,20,15,7,6,null,null,192,17.454545454545453,9,"A","ناجح",null,{"$f":"IF(B30=0,\"\",TOPTEN($S$7:$S$36,$B$7:$B$36,24,FALSE))","v":"إسماعيل محمد غيث"},{"$f":"IF(C30=0,\"\",TOPTEN($S$7:$S$36,$B$7:$B$36,24,TRUE))","v":"الرابع والعشرون"},null,"يوسف رشاد سلوم",{"$f":"Monthly2!S30","v":192},192,192,8,null,{"$f":"IF(C30=0,\"\",TOPTEN($AE$7:$AE$36,$B$7:$B$36,24,FALSE))","v":"إسماعيل محمد غيث"},{"$f":"IF(C30=0,\"\",TOPTEN($AE$7:$AE$36,$B$7:$B$36,24,TRUE))","v":"الرابع والعشرون"},null,"يوسف رشاد سلوم",{"$f":"MidYear!AE30","v":182},192,187,10,null,{"$f":"IF(C30=0,\"\",TOPTEN($AN$7:$AN$36,$B$7:$B$36,24,FALSE))","v":"إسماعيل محمد غيث"},{"$f":"IF(C30=0,\"\",TOPTEN($AN$7:$AN$36,$B$7:$B$36,24,TRUE))","v":"الرابع والعشرون"}]
[{"$f":"IF(B31<>0,STName!A31,\"\")","v":""},{"$f":"STName!B31","v":0},null,null,null,null,null,null,null,null,null,null,null,null,null,null,null,null,"","","","","",null,{"$f":"IF(B31=0,\"\",TOPTEN($S$7:$S$36,$B$7:$B$36,25,FALSE))","v":""},{"$f":"IF(C31=0,\"\",TOPTEN($S$7:$S$36,$B$7:$B$36,25,TRUE))","v":""},null,0,{"$f":"Monthly2!S31","v":""},"","","",null,{"$f":"IF(C31=0,\"\",TOPTEN($AE$7:$AE$36,$B$7:$B$36,25,FALSE))","v":""},{"$f":"IF(C31=0,\"\",TOPTEN($AE$7:$AE$36,$B$7:$B$36,25,TRUE))","v":""},null,0,{"$f":"MidYear!AE31","v":""},"","","",null,{"$f":"IF(C31=0,\"\",TOPTEN($AN$7:$AN$36,$B$7:$B$36,25,FALSE))","v":""},{"$f":"IF(C31=0,\"\",TOPTEN($AN$7:$AN$36,$B$7:$B$36,25,TRUE))","v":""}]
[{"$f":"IF(B32<>0,STName!A32,\"\")","v":""},{"$f":"STName!B32","v":0},null,null,null,null,null,null,null,null,null,null,null,null,null,null,null,null,"","","","","",null,{"$f":"IF(B32=0,\"\",TOPTEN($S$7:$S$36,$B$7:$B$36,26,FALSE))","v":""},{"$f":"IF(C32=0,\"\",TOPTEN($S$7:$S$36,$B$7:$B$36,26,TRUE))","v":""},null,0,{"$f":"Monthly2!S32","v":""},"","","",null,{"$f":"IF(C32=0,\"\",TOPTEN($AE$7:$AE$36,$B$7:$B$36,26,FALSE))","v":""},{"$f":"IF(C32=0,\"\",TOPTEN($AE$7:$AE$36,$B$7:$B$36,26,TRUE))","v":""},null,0,{"$f":"MidYear!AE32","v":""},"","","",null,{"$f":"IF(C32=0,\"\",TOPTEN($AN$7:$AN$36,$B$7:$B$36,26,FALSE))","v":""},{"$f":"IF(C32=0,\"\",TOPTEN($AN$7:$AN$36,$B$7:$B$36,26,TRUE))","v":""}]
[{"$f":"IF(B33<>0,STName!A33,\"\")","v":""},{"$f":"STName!B33","v":0},null,null,null,null,null,null,null,null,null,null,null,null,null,null,null,null,"","","","","",null,{"$f":"IF(B33=0,\"\",TOPTEN($S$7:$S$36,$B$7:$B$36,27,FALSE))","v":""},{"$f":"IF(C33=0,\"\",TOPTEN($S$7:$S$36,$B$7:$B$36,27,TRUE))","v":""},null,0,{"$f":"Monthly2!S33","v":""},"","","",null,{"$f":"IF(C33=0,\"\",TOPTEN($AE$7:$AE$36,$B$7:$B$36,27,FALSE))","v":""},{"$f":"IF(C33=0,\"\",TOPTEN($AE$7:$AE$36,$B$7:$B$36,27,TRUE))","v":""},null,0,{"$f":"MidYear!AE33","v":""},"","","",null,{"$f":"IF(C33=0,\"\",TOPTEN($AN$7:$AN$36,$B$7:$B$36,27,FALSE))","v":""},{"$f":"IF(C33=0,\"\",TOPTEN($AN$7:$AN$36,$B$7:$B$36,27,TRUE))","v":""}]
[{"$f":"IF(B34<>0,STName!A34,\"\")","v":""},{"$f":"STName!B34","v":0},null,null,null,null,null,null,null,null,null,null,null,null,null,null,null,null,"","","","","",null,{"$f":"IF(B34=0,\"\",TOPTEN($S$7:$S$36,$B$7:$B$36,28,FALSE))","v":""},{"$f":"IF(C34=0,\"\",TOPTEN($S$7:$S$36,$B$7:$B$36,28,TRUE))","v":""},null,0,{"$f":"Monthly2!S34","v":""},"","","",null,{"$f":"IF(C34=0,\"\",TOPTEN($AE$7:$AE$36,$B$7:$B$36,28,FALSE))","v":""},{"$f":"IF(C34=0,\"\",TOPTEN($AE$7:$AE$36,$B$7:$B$36,28,TRUE))","v":""},null,0,{"$f":"MidYear!AE34","v":""},"","","",null,{"$f":"IF(C34=0,\"\",TOPTEN($AN$7:$AN$36,$B$7:$B$36,28,FALSE))","v":""},{"$f":"IF(C34=0,\"\",TOPTEN($AN$7:$AN$36,$B$7:$B$36,28,TRUE))","v":""}]
[{"$f":"IF(B35<>0,STName!A35,\"\")","v":""},{"$f":"STName!B35","v":0},null,null,null,null,null,null,null,null,null,null,null,null,null,null,null,null,"","","","","",null,{"$f":"IF(B35=0,\"\",TOPTEN($S$7:$S$36,$B$7:$B$36,29,FALSE))","v":""},{"$f":"IF(C35=0,\"\",TOPTEN($S$7:$S$36,$B$7:$B$36,29,TRUE))","v":""},null,0,{"$f":"Monthly2!S35","v":""},"","","",null,{"$f":"IF(C35=0,\"\",TOPTEN($AE$7:$AE$36,$B$7:$B$36,29,FALSE))","v":""},{"$f":"IF(C35=0,\"\",TOPTEN($AE$7:$AE$36,$B$7:$B$36,29,TRUE))","v":""},null,0,{"$f":"MidYear!AE35","v":""},"","","",null,{"$f":"IF(C35=0,\"\",TOPTEN($AN$7:$AN$36,$B$7:$B$36,29,FALSE))","v":""},{"$f":"IF(C35=0,\"\",TOPTEN($AN$7:$AN$36,$B$7:$B$36,29,TRUE))","v":""}]
[{"$f":"IF(B36<>0,STName!A36,\"\")","v":""},{"$f":"STName!B36","v":0},null,null,null,null,null,null,null,null,null,null,null,null,null,null,null,null,"","","","","",null,{"$f":"IF(B36=0,\"\",TOPTEN($S$7:$S$36,$B$7:$B$36,30,FALSE))","v":""},{"$f":"IF(C36=0,\"\",TOPTEN($S$7:$S$36,$B$7:$B$36,30,TRUE))","v":""},null,0,{"$f":"Monthly2!S36","v":""},"","","",null,{"$f":"IF(C36=0,\"\",TOPTEN($AE$7:$AE$36,$B$7:$B$36,30,FALSE))","v":""},{"$f":"IF(C36=0,\"\",TOPTEN($AE$7:$AE$36,$B$7:$B$36,30,TRUE))","v":""},null,0,{"$f":"MidYear!AE36","v":""},"","","",null,{"$f":"IF(C36=0,\"\",TOPTEN($AN$7:$AN$36,$B$7:$B$36,30,FALSE))","v":""},{"$f":"IF(C36=0,\"\",TOPTEN($AN$7:$AN$36,$B$7:$B$36,30,TRUE))","v":""}]
[]
[null,"أعلى علامة",{"$f":"MAX(C7:C36)","v":20},{"$f":"MAX(D7:D36)","v":20},20,15,7,20,20,20,13,20,20,15,10,10,0,0,210,19.09090909090909]
[null,"أدنى علامة",{"$f":"MIN(C7:C36)","v":6},{"$f":"MIN(D7:D36)","v":10},6,5,2,5,2,2,2,5,2,1,6,5,0,0,107,9.7272727272727266]
[null,"عدد الناجحين",{"$f":"COUNTIF(C7:C36,\">=\"&C6/2)","v":17},24,23,24,20,1,18,17,17,22,23,21,24,24,0,0,{"$f":"COUNTIF(S7:S36,\">=\"&S6/2)","v":23},{"$f":"COUNTIF(T7:T36,\">=10\")","v":23}]
[null,"عدد الراسبين",{"$f":"COUNTIF(C7:C37,\"<\"&C6/2)","v":7},0,1,0,4,23,6,7,7,2,1,3,0,0,0,0,{"$f":"COUNTIF(S7:S37,\"<\"&S6/2)","v":1},{"$f":"COUNTIF(T7:T37,\"<10\")","v":1}]

{"sheet":"الشهادة","index":5,"n_rows":36,"n_cols":9,"rows_kept":36,"cut":false,"hidden":false,"merged":[[0,7,0,8],[0,5,0,6],[3,0,3,8],[4,0,4,8],[35,0,35,2],[34,0,34,8],[35,6,35,8],[8,1,8,3],[10,5,10,8]]}
[null,null,null,null,null,"بحث برقم الطالب",null,"إجمالي الشهادات"]
[null,null,null,null,null,1,null,{"$f":"COUNTIF(Monthly1!A7:A36,\">0\")","v":24}]
[]
[{"$f":"STName!A1","v":"International Lessing School"}]
[{"$f":"STName!A2","v":"Academic Year: 2024-2025"}]
["Class",{"$f":"STName!M3","v":"Grade 01 A Moon"}]
["Year",{"$f":"STName!I3&\"  \"&STName!H3","v":"24-25  "}]
["Student Number",{"$f":"F2","v":1},"from ",{"$f":"H2","v":24}]
["Student Name",{"$f":"LOOKUP(B8,Monthly1!A7:A36,Monthly1!B7:B36)","v":"امير سامر عبيد"}]
[]
[null,null,null,null,null,"   الشويفات/ هاتف: 05/434419"]
["Subject","Max Mark","Monthly1","Mid Year Exam","Semester One Average","Monthly2","Final Exam","Semester Two Average","Total Average"]
[{"$f":"Monthly1!C5","v":"Reading"},{"$f":"Monthly1!C6","v":20},{"$f":"IF($B$8=\"\",\"\",IFERROR(1/(1/INDEX(Monthly1,$B$8,3)),\"\"))","v":8},{"$f":"IF($B$8=\"\",\"\",IFERROR(1/(1/INDEX(MidYear,$B$8,3)),\"\"))","v":8},{"$f":"IF((C13<>\"\")*AND(D13<>\"\"),CEILING(AVERAGE(C13,D13),1),\"\")","v":8},{"$f":"IF($B$8=\"\",\"\",IFERROR(1/(1/INDEX(Monthly2,$B$8,3)),\"\"))","v":8},{"$f":"IF($B$8=\"\",\"\",IFERROR(1/(1/INDEX(FinalYear,$B$8,3)),\"\"))","v":8},{"$f":"IF((F13<>\"\")*AND(G13<>\"\"),CEILING(AVERAGE(F13,G13),1),\"\")","v":8},{"$f":"IF((E13<>\"\")*AND(H13<>\"\"),CEILING(AVERAGE(E13,H13),1),\"\")","v":8}]
[{"$f":"Monthly1!D5","v":"Dictation"},{"$f":"Monthly1!D6","v":20},{"$f":"IF($B$8=\"\",\"\",IFERROR(1/(1/INDEX(Monthly1,$B$8,4)),\"\"))","v":16},{"$f":"IF($B$8=\"\",\"\",IFERROR(1/(1/INDEX(MidYear,$B$8,4)),\"\"))","v":16},16,{"$f":"IF($B$8=\"\",\"\",IFERROR(1/(1/INDEX(Monthly2,$B$8,4)),\"\"))","v":16},{"$f":"IF($B$8=\"\",\"\",IFERROR(1/(1/INDEX(FinalYear,$B$8,4)),\"\"))","v":16},{"$f":"IF((F14<>\"\")*AND(G14<>\"\"),CEILING(AVERAGE(F14,G14),1),\"\")","v":16},16]
[{"$f":"Monthly1!E5","v":"Comp + Conv"},{"$f":"Monthly1!E6","v":20},{"$f":"IF($B$8=\"\",\"\",IFERROR(1/(1/INDEX(Monthly1,$B$8,5)),\"\"))","v":13},{"$f":"IF($B$8=\"\",\"\",IFERROR(1/(1/INDEX(MidYear,$B$8,5)),\"\"))","v":13},13,{"$f":"IF($B$8=\"\",\"\",IFERROR(1/(1/INDEX(Monthly2,$B$8,5)),\"\"))","v":13},{"$f":"IF($B$8=\"\",\"\",IFERROR(1/(1/INDEX(FinalYear,$B$8,5)),\"\"))","v":13},13,13]
[{"$f":"Monthly1!F5","v":"Handwriting"},{"$f":"Monthly1!F6","v":10},{"$f":"IF($B$8=\"\",\"\",IFERROR(1/(1/INDEX(Monthly1,$B$8,6)),\"\"))","v":13},{"$f":"IF($B$8=\"\",\"\",IFERROR(1/(1/INDEX(MidYear,$B$8,6)),\"\"))","v":13},13,{"$f":"IF($B$8=\"\",\"\",IFERROR(1/(1/INDEX(Monthly2,$B$8,6)),\"\"))","v":13},{"$f":"IF($B$8=\"\",\"\",IFERROR(1/(1/INDEX(FinalYear,$B$8,6)),\"\"))","v":13},13,13]
[{"$f":"Monthly1!G5","v":"Poetry"},{"$f":"Monthly1!G6","v":10},{"$f":"IF($B$8=\"\",\"\",IFERROR(1/(1/INDEX(Monthly1,$B$8,7)),\"\"))","v":2},{"$f":"IF($B$8=\"\",\"\",IFERROR(1/(1/INDEX(MidYear,$B$8,7)),\"\"))","v":2},2,{"$f":"IF($B$8=\"\",\"\",IFERROR(1/(1/INDEX(Monthly2,$B$8,7)),\"\"))","v":2},{"$f":"IF($B$8=\"\",\"\",IFERROR(1/(1/INDEX(FinalYear,$B$8,7)),\"\"))","v":2},2,2]
[{"$f":"Monthly1!H5","v":"Science"},{"$f":"Monthly1!H6","v":20},{"$f":"IF($B$8=\"\",\"\",IFERROR(1/(1/INDEX(Monthly1,$B$8,8)),\"\"))","v":7},{"$f":"IF($B$8=\"\",\"\",IFERROR(1/(1/INDEX(MidYear,$B$8,8)),\"\"))","v":7},7,{"$f":"IF($B$8=\"\",\"\",IFERROR(1/(1/INDEX(Monthly2,$B$8,8)),\"\"))","v":7},{"$f":"IF($B$8=\"\",\"\",IFERROR(1/(1/INDEX(FinalYear,$B$8,8)),\"\"))","v":7},7,7]
[{"$f":"Monthly1!I5","v":"Mathematics"},{"$f":"Monthly1!I6","v":20},{"$f":"IF($B$8=\"\",\"\",IFERROR(1/(1/INDEX(Monthly1,$B$8,9)),\"\"))","v":14},{"$f":"IF($B$8=\"\",\"\",IFERROR(1/(1/INDEX(MidYear,$B$8,9)),\"\"))","v":14},14,{"$f":"IF($B$8=\"\",\"\",IFERROR(1/(1/INDEX(Monthly2,$B$8,9)),\"\"))","v":14},{"$f":"IF($B$8=\"\",\"\",IFERROR(1/(1/INDEX(FinalYear,$B$8,9)),\"\"))","v":14},14,14]
[{"$f":"Monthly1!J5","v":"القراءة"},{"$f":"Monthly1!J6","v":20},{"$f":"IF($B$8=\"\",\"\",IFERROR(1/(1/INDEX(Monthly1,$B$8,10)),\"\"))","v":20},{"$f":"IF($B$8=\"\",\"\",IFERROR(1/(1/INDEX(MidYear,$B$8,10)),\"\"))","v":20},20,{"$f":"IF($B$8=\"\",\"\",IFERROR(1/(1/INDEX(Monthly2,$B$8,10)),\"\"))","v":20},{"$f":"IF($B$8=\"\",\"\",IFERROR(1/(1/INDEX(FinalYear,$B$8,10)),\"\"))","v":20},20,20]
[{"$f":"Monthly1!K5","v":"الإملاء"},{"$f":"Monthly1!K6","v":20},{"$f":"IF($B$8=\"\",\"\",IFERROR(1/(1/INDEX(Monthly1,$B$8,11)),\"\"))","v":12},{"$f":"IF($B$8=\"\",\"\",IFERROR(1/(1/INDEX(MidYear,$B$8,11)),\"\"))","v":12},12,{"$f":"IF($B$8=\"\",\"\",IFERROR(1/(1/INDEX(Monthly2,$B$8,11)),\"\"))","v":12},{"$f":"IF($B$8=\"\",\"\",IFERROR(1/(1/INDEX(FinalYear,$B$8,11)),\"\"))","v":12},12,12]
[{"$f":"Monthly1!L5","v":"التعبير والمحادثة"},{"$f":"Monthly1!L6","v":20},{"$f":"IF($B$8=\"\",\"\",IFERROR(1/(1/INDEX(Monthly1,$B$8,12)),\"\"))","v":19},{"$f":"IF($B$8=\"\",\"\",IFERROR(1/(1/INDEX(MidYear,$B$8,12)),\"\"))","v":19},19,{"$f":"IF($B$8=\"\",\"\",IFERROR(1/(1/INDEX(Monthly2,$B$8,12)),\"\"))","v":19},{"$f":"IF($B$8=\"\",\"\",IFERROR(1/(1/INDEX(FinalYear,$B$8,12)),\"\"))","v":19},19,19]
[{"$f":"Monthly1!M5","v":"المحفوظات"},{"$f":"Monthly1!M6","v":10},{"$f":"IF($B$8=\"\",\"\",IFERROR(1/(1/INDEX(Monthly1,$B$8,13)),\"\"))","v":19},{"$f":"IF($B$8=\"\",\"\",IFERROR(1/(1/INDEX(MidYear,$B$8,13)),\"\"))","v":19},19,{"$f":"IF($B$8=\"\",\"\",IFERROR(1/(1/INDEX(Monthly2,$B$8,13)),\"\"))","v":19},{"$f":"IF($B$8=\"\",\"\",IFERROR(1/(1/INDEX(FinalYear,$B$8,13)),\"\"))","v":19},19,19]
[{"$f":"Monthly1!N5","v":"الخط"},{"$f":"Monthly1!N6","v":10},{"$f":"IF($B$8=\"\",\"\",IFERROR(1/(1/INDEX(Monthly1,$B$8,14)),\"\"))","v":2},{"$f":"IF($B$8=\"\",\"\",IFERROR(1/(1/INDEX(MidYear,$B$8,14)),\"\"))","v":2},2,{"$f":"IF($B$8=\"\",\"\",IFERROR(1/(1/INDEX(Monthly2,$B$8,14)),\"\"))","v":2},{"$f":"IF($B$8=\"\",\"\",IFERROR(1/(1/INDEX(FinalYear,$B$8,14)),\"\"))","v":2},2,2]
[{"$f":"Monthly1!O5","v":"Sport"},{"$f":"Monthly1!O6","v":10},{"$f":"IF($B$8=\"\",\"\",IFERROR(1/(1/INDEX(Monthly1,$B$8,15)),\"\"))","v":7},{"$f":"IF($B$8=\"\",\"\",IFERROR(1/(1/INDEX(MidYear,$B$8,15)),\"\"))","v":7},7,{"$f":"IF($B$8=\"\",\"\",IFERROR(1/(1/INDEX(Monthly2,$B$8,15)),\"\"))","v":7},{"$f":"IF($B$8=\"\",\"\",IFERROR(1/(1/INDEX(FinalYear,$B$8,15)),\"\"))","v":7},7,7]
[{"$f":"Monthly1!P5","v":"Art"},{"$f":"Monthly1!P6","v":10},{"$f":"IF($B$8=\"\",\"\",IFERROR(1/(1/INDEX(Monthly1,$B$8,16)),\"\"))","v":6},{"$f":"IF($B$8=\"\",\"\",IFERROR(1/(1/INDEX(MidYear,$B$8,16)),\"\"))","v":6},6,{"$f":"IF($B$8=\"\",\"\",IFERROR(1/(1/INDEX(Monthly2,$B$8,16)),\"\"))","v":6},{"$f":"IF($B$8=\"\",\"\",IFERROR(1/(1/INDEX(FinalYear,$B$8,16)),\"\"))","v":6},6,6]
[{"$f":"Monthly1!Q5","v":0},{"$f":"Monthly1!Q6","v":0},{"$f":"IF($B$8=\"\",\"\",IFERROR(1/(1/INDEX(Monthly1,$B$8,17)),\"\"))","v":""},{"$f":"IF($B$8=\"\",\"\",IFERROR(1/(1/INDEX(MidYear,$B$8,17)),\"\"))","v":""},"",{"$f":"IF($B$8=\"\",\"\",IFERROR(1/(1/INDEX(Monthly2,$B$8,17)),\"\"))","v":""},{"$f":"IF($B$8=\"\",\"\",IFERROR(1/(1/INDEX(FinalYear,$B$8,17)),\"\"))","v":""},"",""]
[{"$f":"Monthly1!R5","v":0},{"$f":"Monthly1!R6","v":0},{"$f":"IF($B$8=\"\",\"\",IFERROR(1/(1/INDEX(Monthly1,$B$8,18)),\"\"))","v":""},{"$f":"IF($B$8=\"\",\"\",IFERROR(1/(1/INDEX(MidYear,$B$8,18)),\"\"))","v":""},"",{"$f":"IF($B$8=\"\",\"\",IFERROR(1/(1/INDEX(Monthly2,$B$8,18)),\"\"))","v":""},{"$f":"IF($B$8=\"\",\"\",IFERROR(1/(1/INDEX(FinalYear,$B$8,18)),\"\"))","v":""},"",""]
["Total",{"$f":"Monthly1!S6","v":220},{"$f":"IF($B$8=\"\",\"\",IFERROR(1/(1/INDEX(Monthly1,$B$8,19)),\"\"))","v":158},{"$f":"IF($B$8=\"\",\"\",IFERROR(1/(1/INDEX(MidYear,$B$8,19)),\"\"))","v":158},{"$f":"IF(E13<>\"\",SUM(E13:E28),\"\")","v":158},{"$f":"IF($B$8=\"\",\"\",IFERROR(1/(1/INDEX(Monthly2,$B$8,19)),\"\"))","v":158},{"$f":"IF($B$8=\"\",\"\",IFERROR(1/(1/INDEX(FinalYear,$B$8,19)),\"\"))","v":158},158,158]
["Average",{"$f":"Monthly1!T6","v":20},{"$f":"IF($B$8=\"\",\"\",IFERROR(1/(1/INDEX(Monthly1,$B$8,20)),\"\"))","v":14.363636363636365},{"$f":"IF($B$8=\"\",\"\",IFERROR(1/(1/INDEX(MidYear,$B$8,20)),\"\"))","v":14.363636363636365},{"$f":"IF(E29<>\"\",E29/13,\"\")","v":12.153846153846153},{"$f":"IF($B$8=\"\",\"\",IFERROR(1/(1/INDEX(Monthly2,$B$8,20)),\"\"))","v":14.363636363636365},{"$f":"IF($B$8=\"\",\"\",IFERROR(1/(1/INDEX(FinalYear,$B$8,20)),\"\"))","v":14.363636363636365},12.153846153846153,12.153846153846153]
["Rank",null,{"$f":"IF($B$8=\"\",\"\",IFERROR(1/(1/INDEX(Monthly1,$B$8,21)),\"\"))","v":18},{"$f":"IF($B$8=\"\",\"\",IFERROR(1/(1/INDEX(MidYear,$B$8,21)),\"\"))","v":16},{"$f":"_xlfn.XLOOKUP(B8,MidYear!A7:A36,MidYear!AF7:AF36)","v":17},{"$f":"IF($B$8=\"\",\"\",IFERROR(1/(1/INDEX(Monthly2,$B$8,21)),\"\"))","v":16},{"$f":"IF($B$8=\"\",\"\",IFERROR(1/(1/INDEX(FinalYear,$B$8,21)),\"\"))","v":15},{"$f":"_xlfn.XLOOKUP(B8,FinalYear!A7:A36,FinalYear!AF7:AF36)","v":{"$error":"#NAME?"}},{"$f":"_xlfn.XLOOKUP(B8,FinalYear!A7:A36,FinalYear!AO7:AO36)","v":{"$error":"#NAME?"}}]
["Evaluation",null,{"$f":"IF($B$8=\"\",\"\",IF(INDEX(Monthly1,$B$8,22)=0,\"\",INDEX(Monthly1,$B$8,22)))","v":"B"},{"$f":"IF($B$8=\"\",\"\",IF(INDEX(MidYear,$B$8,22)=0,\"\",INDEX(MidYear,$B$8,22)))","v":"B"},{"$f":"IF(E13<>\"\",IF(E30>=15,\"A\",IF(E30>=12,\"B\",IF(E30>=10,\"C\",IF(E30>=7.5,\"D\",\"E\")))),\"\")","v":"B"},{"$f":"IF($B$8=\"\",\"\",IF(INDEX(Monthly2,$B$8,22)=0,\"\",INDEX(Monthly2,$B$8,22)))","v":"B"},{"$f":"IF($B$8=\"\",\"\",IF(INDEX(FinalYear,$B$8,22)=0,\"\",INDEX(FinalYear,$B$8,22)))","v":"B"},"B","B"]
["Result",null,{"$f":"IF($B$8=\"\",\"\",IF(INDEX(Monthly1,$B$8,22)=0,\"\",INDEX(Monthly1,$B$8,23)))","v":"ناجح"},{"$f":"IF($B$8=\"\",\"\",IF(INDEX(MidYear,$B$8,22)=0,\"\",INDEX(MidYear,$B$8,23)))","v":"ناجح"},{"$f":"IF(E13<>\"\",IF(E30>=10,\"ناجح\",\"راسب\"),\"\")","v":"ناجح"},{"$f":"IF($B$8=\"\",\"\",IF(INDEX(Monthly2,$B$8,22)=0,\"\",INDEX(Monthly2,$B$8,23)))","v":"ناجح"},{"$f":"IF($B$8=\"\",\"\",IF(INDEX(FinalYear,$B$8,22)=0,\"\",INDEX(FinalYear,$B$8,23)))","v":"ناجح"},"ناجح","ناجح"]
[]
["(A>15 = جيد جداً)    (B>12 = جيد)    (C>10 = وسط)    (D>7.5 = غير مقبول)    (D<7.5 = ضعيف جداً)  "]
["ختم الإدارة",null,null,null,null,null,"توقيع الأهل"]