{"text_format":"1","workbook":"xlsx","n_sheets":7,"sheets":["main","dashboard","data","pivotButton","pivotMonthly","pivotCatogery","setup"],"not_rendered":{"charts":2,"images":31,"macros":1,"external_links":0,"defined_names":5,"comments":0,"pivot_tables":3},"unopened":[],"bounds":{"document_bytes":16777216,"sheet_cells":100000,"rows_first":2000,"rows_last":500,"rows_between":2000,"halvings":0,"cell_chars":16384,"cell_head_chars":4096},"cells_cut":0,"cells_raw":0,"read":"whole","date_system":"1900"}

{"sheet":"main","index":0,"n_rows":26,"n_cols":10,"rows_kept":26,"cut":false,"hidden":false,"merged":[]}
["الشهر","السنة"]
[1,2021]
[]
["البند","المصروفات","الإجمالي السنوي","المدفوع","المتبقي",null,null,"آخر دفعة","التاريخ","الوصف"]
[null,{"$f":"DSUM(data!$A$1:$C$1000,data!$C$1,setup!B2:E3)","v":0},{"$f":"DSUM(data!$A$1:$C$1000,data!$C$1,setup!K2:N3)","v":0},{"$f":"DSUM(data!$A$1:$C$1000,data!$C$1,setup!P2:S3)","v":0},{"$f":"C5-D5","v":0},null,null,{"$f":"IFERROR(IF(LOOKUP(2,1/(data!B:B=A5),data!C:C)=0,\"-\",LOOKUP(2,1/(data!B:B=A5),data!C:C)),\"-\")","v":"-"},{"$f":"IFERROR(IF(LOOKUP(2,1/(data!B:B=A5),data!A:A)=0,\"-\",LOOKUP(2,1/(data!B:B=A5),data!A:A)),\"-\")","v":"-"},{"$f":"IFERROR(IF(LOOKUP(2,1/(data!B:B=A5),data!D:D)=0,\"-\",LOOKUP(2,1/(data!B:B=A5),data!D:D)),\"-\")","v":"-"}]
[null,{"$f":"DSUM(data!$A$1:$C$1000,data!$C$1,setup!B5:E6)","v":0},{"$f":"DSUM(data!$A$1:$C$1000,data!$C$1,setup!K5:N6)","v":0},{"$f":"DSUM(data!$A$1:$C$1000,data!$C$1,setup!P5:S6)","v":0},{"$f":"C6-D6","v":0},null,null,{"$f":"IFERROR(IF(LOOKUP(2,1/(data!B:B=A6),data!C:C)=0,\"-\",LOOKUP(2,1/(data!B:B=A6),data!C:C)),\"-\")","v":"-"},{"$f":"IFERROR(IF(LOOKUP(2,1/(data!B:B=A6),data!A:A)=0,\"-\",LOOKUP(2,1/(data!B:B=A6),data!A:A)),\"-\")","v":"-"},{"$f":"IFERROR(IF(LOOKUP(2,1/(data!B:B=A6),data!D:D)=0,\"-\",LOOKUP(2,1/(data!B:B=A6),data!D:D)),\"-\")","v":"-"}]
[null,{"$f":"DSUM(data!$A$1:$C$1000,data!$C$1,setup!B8:E9)","v":0},{"$f":"DSUM(data!$A$1:$C$1000,data!$C$1,setup!K8:N9)","v":0},{"$f":"DSUM(data!$A$1:$C$1000,data!$C$1,setup!P8:S9)","v":0},0,null,null,{"$f":"IFERROR(IF(LOOKUP(2,1/(data!B:B=A7),data!C:C)=0,\"-\",LOOKUP(2,1/(data!B:B=A7),data!C:C)),\"-\")","v":"-"},{"$f":"IFERROR(IF(LOOKUP(2,1/(data!B:B=A7),data!A:A)=0,\"-\",LOOKUP(2,1/(data!B:B=A7),data!A:A)),\"-\")","v":"-"},{"$f":"IFERROR(IF(LOOKUP(2,1/(data!B:B=A7),data!D:D)=0,\"-\",LOOKUP(2,1/(data!B:B=A7),data!D:D)),\"-\")","v":"-"}]
[null,{"$f":"DSUM(data!$A$1:$C$1000,data!$C$1,setup!B11:E12)","v":0},{"$f":"DSUM(data!$A$1:$C$1000,data!$C$1,setup!K11:N12)","v":0},{"$f":"DSUM(data!$A$1:$C$1000,data!$C$1,setup!P11:S12)","v":0},0,null,null,{"$f":"IFERROR(IF(LOOKUP(2,1/(data!B:B=A8),data!C:C)=0,\"-\",LOOKUP(2,1/(data!B:B=A8),data!C:C)),\"-\")","v":"-"},{"$f":"IFERROR(IF(LOOKUP(2,1/(data!B:B=A8),data!A:A)=0,\"-\",LOOKUP(2,1/(data!B:B=A8),data!A:A)),\"-\")","v":"-"},{"$f":"IFERROR(IF(LOOKUP(2,1/(data!B:B=A8),data!D:D)=0,\"-\",LOOKUP(2,1/(data!B:B=A8),data!D:D)),\"-\")","v":"-"}]
[null,{"$f":"DSUM(data!$A$1:$C$1000,data!$C$1,setup!B14:E15)","v":0},{"$f":"DSUM(data!$A$1:$C$1000,data!$C$1,setup!K14:N15)","v":0},{"$f":"DSUM(data!$A$1:$C$1000,data!$C$1,setup!P14:S15)","v":0},0,null,null,{"$f":"IFERROR(IF(LOOKUP(2,1/(data!B:B=A9),data!C:C)=0,\"-\",LOOKUP(2,1/(data!B:B=A9),data!C:C)),\"-\")","v":"-"},{"$f":"IFERROR(IF(LOOKUP(2,1/(data!B:B=A9),data!A:A)=0,\"-\",LOOKUP(2,1/(data!B:B=A9),data!A:A)),\"-\")","v":"-"},{"$f":"IFERROR(IF(LOOKUP(2,1/(data!B:B=A9),data!D:D)=0,\"-\",LOOKUP(2,1/(data!B:B=A9),data!D:D)),\"-\")","v":"-"}]
[null,{"$f":"DSUM(data!$A$1:$C$1000,data!$C$1,setup!B17:E18)","v":0},{"$f":"DSUM(data!$A$1:$C$1000,data!$C$1,setup!K17:N18)","v":0},{"$f":"DSUM(data!$A$1:$C$1000,data!$C$1,setup!P17:S18)","v":0},0,null,null,{"$f":"IFERROR(IF(LOOKUP(2,1/(data!B:B=A10),data!C:C)=0,\"-\",LOOKUP(2,1/(data!B:B=A10),data!C:C)),\"-\")","v":"-"},{"$f":"IFERROR(IF(LOOKUP(2,1/(data!B:B=A10),data!A:A)=0,\"-\",LOOKUP(2,1/(data!B:B=A10),data!A:A)),\"-\")","v":"-"},{"$f":"IFERROR(IF(LOOKUP(2,1/(data!B:B=A10),data!D:D)=0,\"-\",LOOKUP(2,1/(data!B:B=A10),data!D:D)),\"-\")","v":"-"}]
[null,{"$f":"DSUM(data!$A$1:$C$1000,data!$C$1,setup!B20:E21)","v":0},{"$f":"DSUM(data!$A$1:$C$1000,data!$C$1,setup!K20:N21)","v":0},{"$f":"DSUM(data!$A$1:$C$1000,data!$C$1,setup!P20:S21)","v":0},0,null,null,{"$f":"IFERROR(IF(LOOKUP(2,1/(data!B:B=A11),data!C:C)=0,\"-\",LOOKUP(2,1/(data!B:B=A11),data!C:C)),\"-\")","v":"-"},{"$f":"IFERROR(IF(LOOKUP(2,1/(data!B:B=A11),data!A:A)=0,\"-\",LOOKUP(2,1/(data!B:B=A11),data!A:A)),\"-\")","v":"-"},{"$f":"IFERROR(IF(LOOKUP(2,1/(data!B:B=A11),data!D:D)=0,\"-\",LOOKUP(2,1/(data!B:B=A11),data!D:D)),\"-\")","v":"-"}]
[null,{"$f":"DSUM(data!$A$1:$C$1000,data!$C$1,setup!B23:E24)","v":0},{"$f":"DSUM(data!$A$1:$C$1000,data!$C$1,setup!K23:N24)","v":0},{"$f":"DSUM(data!$A$1:$C$1000,data!$C$1,setup!P23:S24)","v":0},0,null,null,{"$f":"IFERROR(IF(LOOKUP(2,1/(data!B:B=A12),data!C:C)=0,\"-\",LOOKUP(2,1/(data!B:B=A12),data!C:C)),\"-\")","v":"-"},{"$f":"IFERROR(IF(LOOKUP(2,1/(data!B:B=A12),data!A:A)=0,\"-\",LOOKUP(2,1/(data!B:B=A12),data!A:A)),\"-\")","v":"-"},{"$f":"IFERROR(IF(LOOKUP(2,1/(data!B:B=A12),data!D:D)=0,\"-\",LOOKUP(2,1/(data!B:B=A12),data!D:D)),\"-\")","v":"-"}]
[null,{"$f":"DSUM(data!$A$1:$C$1000,data!$C$1,setup!B26:E27)","v":0},{"$f":"DSUM(data!$A$1:$C$1000,data!$C$1,setup!K26:N27)","v":0},{"$f":"DSUM(data!$A$1:$C$1000,data!$C$1,setup!P26:S27)","v":0},0,null,null,{"$f":"IFERROR(IF(LOOKUP(2,1/(data!B:B=A13),data!C:C)=0,\"-\",LOOKUP(2,1/(data!B:B=A13),data!C:C)),\"-\")","v":"-"},{"$f":"IFERROR(IF(LOOKUP(2,1/(data!B:B=A13),data!A:A)=0,\"-\",LOOKUP(2,1/(data!B:B=A13),data!A:A)),\"-\")","v":"-"},{"$f":"IFERROR(IF(LOOKUP(2,1/(data!B:B=A13),data!D:D)=0,\"-\",LOOKUP(2,1/(data!B:B=A13),data!D:D)),\"-\")","v":"-"}]
[null,{"$f":"DSUM(data!$A$1:$C$1000,data!$C$1,setup!B29:E30)","v":0},{"$f":"DSUM(data!$A$1:$C$1000,data!$C$1,setup!K29:N30)","v":0},{"$f":"DSUM(data!$A$1:$C$1000,data!$C$1,setup!P29:S30)","v":0},0,null,null,{"$f":"IFERROR(IF(LOOKUP(2,1/(data!B:B=A14),data!C:C)=0,\"-\",LOOKUP(2,1/(data!B:B=A14),data!C:C)),\"-\")","v":"-"},{"$f":"IFERROR(IF(LOOKUP(2,1/(data!B:B=A14),data!A:A)=0,\"-\",LOOKUP(2,1/(data!B:B=A14),data!A:A)),\"-\")","v":"-"},{"$f":"IFERROR(IF(LOOKUP(2,1/(data!B:B=A14),data!D:D)=0,\"-\",LOOKUP(2,1/(data!B:B=A14),data!D:D)),\"-\")","v":"-"}]
[null,{"$f":"DSUM(data!$A$1:$C$1000,data!$C$1,setup!B32:E33)","v":0},{"$f":"DSUM(data!$A$1:$C$1000,data!$C$1,setup!K32:N33)","v":0},{"$f":"DSUM(data!$A$1:$C$1000,data!$C$1,setup!P32:S33)","v":0},{"$f":"C15-D15","v":0},null,null,{"$f":"IFERROR(IF(LOOKUP(2,1/(data!B:B=A15),data!C:C)=0,\"-\",LOOKUP(2,1/(data!B:B=A15),data!C:C)),\"-\")","v":"-"},{"$f":"IFERROR(IF(LOOKUP(2,1/(data!B:B=A15),data!A:A)=0,\"-\",LOOKUP(2,1/(data!B:B=A15),data!A:A)),\"-\")","v":"-"},{"$f":"IFERROR(IF(LOOKUP(2,1/(data!B:B=A15),data!D:D)=0,\"-\",LOOKUP(2,1/(data!B:B=A15),data!D:D)),\"-\")","v":"-"}]
[null,{"$f":"DSUM(data!$A$1:$C$1000,data!$C$1,setup!B35:E36)","v":0},{"$f":"DSUM(data!$A$1:$C$1000,data!$C$1,setup!K35:N36)","v":0},{"$f":"DSUM(data!$A$1:$C$1000,data!$C$1,setup!P35:S36)","v":0},0,null,null,{"$f":"IFERROR(IF(LOOKUP(2,1/(data!B:B=A16),data!C:C)=0,\"-\",LOOKUP(2,1/(data!B:B=A16),data!C:C)),\"-\")","v":"-"},{"$f":"IFERROR(IF(LOOKUP(2,1/(data!B:B=A16),data!A:A)=0,\"-\",LOOKUP(2,1/(data!B:B=A16),data!A:A)),\"-\")","v":"-"},{"$f":"IFERROR(IF(LOOKUP(2,1/(data!B:B=A16),data!D:D)=0,\"-\",LOOKUP(2,1/(data!B:B=A16),data!D:D)),\"-\")","v":"-"}]
[null,{"$f":"DSUM(data!$A$1:$C$1000,data!$C$1,setup!B38:E39)","v":0},{"$f":"DSUM(data!$A$1:$C$1000,data!$C$1,setup!K38:N39)","v":0},{"$f":"DSUM(data!$A$1:$C$1000,data!$C$1,setup!P38:S39)","v":0},0,null,null,{"$f":"IFERROR(IF(LOOKUP(2,1/(data!B:B=A17),data!C:C)=0,\"-\",LOOKUP(2,1/(data!B:B=A17),data!C:C)),\"-\")","v":"-"},{"$f":"IFERROR(IF(LOOKUP(2,1/(data!B:B=A17),data!A:A)=0,\"-\",LOOKUP(2,1/(data!B:B=A17),data!A:A)),\"-\")","v":"-"},{"$f":"IFERROR(IF(LOOKUP(2,1/(data!B:B=A17),data!D:D)=0,\"-\",LOOKUP(2,1/(data!B:B=A17),data!D:D)),\"-\")","v":"-"}]
[null,{"$f":"DSUM(data!$A$1:$C$1000,data!$C$1,setup!B41:E42)","v":0},{"$f":"DSUM(data!$A$1:$C$1000,data!$C$1,setup!K41:N42)","v":0},{"$f":"DSUM(data!$A$1:$C$1000,data!$C$1,setup!P41:S42)","v":0},0,null,null,{"$f":"IFERROR(IF(LOOKUP(2,1/(data!B:B=A18),data!C:C)=0,\"-\",LOOKUP(2,1/(data!B:B=A18),data!C:C)),\"-\")","v":"-"},{"$f":"IFERROR(IF(LOOKUP(2,1/(data!B:B=A18),data!A:A)=0,\"-\",LOOKUP(2,1/(data!B:B=A18),data!A:A)),\"-\")","v":"-"},{"$f":"IFERROR(IF(LOOKUP(2,1/(data!B:B=A18),data!D:D)=0,\"-\",LOOKUP(2,1/(data!B:B=A18),data!D:D)),\"-\")","v":"-"}]
[null,{"$f":"DSUM(data!$A$1:$C$1000,data!$C$1,setup!B44:E45)","v":0},{"$f":"DSUM(data!$A$1:$C$1000,data!$C$1,setup!K44:N45)","v":0},{"$f":"DSUM(data!$A$1:$C$1000,data!$C$1,setup!P44:S45)","v":0},0,null,null,{"$f":"IFERROR(IF(LOOKUP(2,1/(data!B:B=A19),data!C:C)=0,\"-\",LOOKUP(2,1/(data!B:B=A19),data!C:C)),\"-\")","v":"-"},{"$f":"IFERROR(IF(LOOKUP(2,1/(data!B:B=A19),data!A:A)=0,\"-\",LOOKUP(2,1/(data!B:B=A19),data!A:A)),\"-\")","v":"-"},{"$f":"IFERROR(IF(LOOKUP(2,1/(data!B:B=A19),data!D:D)=0,\"-\",LOOKUP(2,1/(data!B:B=A19),data!D:D)),\"-\")","v":"-"}]
[null,{"$f":"DSUM(data!$A$1:$C$1000,data!$C$1,setup!B47:E48)","v":0},{"$f":"DSUM(data!$A$1:$C$1000,data!$C$1,setup!K47:N48)","v":0},{"$f":"DSUM(data!$A$1:$C$1000,data!$C$1,setup!P47:S48)","v":0},0,null,null,{"$f":"IFERROR(IF(LOOKUP(2,1/(data!B:B=A20),data!C:C)=0,\"-\",LOOKUP(2,1/(data!B:B=A20),data!C:C)),\"-\")","v":"-"},{"$f":"IFERROR(IF(LOOKUP(2,1/(data!B:B=A20),data!A:A)=0,\"-\",LOOKUP(2,1/(data!B:B=A20),data!A:A)),\"-\")","v":"-"},{"$f":"IFERROR(IF(LOOKUP(2,1/(data!B:B=A20),data!D:D)=0,\"-\",LOOKUP(2,1/(data!B:B=A20),data!D:D)),\"-\")","v":"-"}]
[null,{"$f":"DSUM(data!$A$1:$C$1000,data!$C$1,setup!B50:E51)","v":0},{"$f":"DSUM(data!$A$1:$C$1000,data!$C$1,setup!K50:N51)","v":0},{"$f":"DSUM(data!$A$1:$C$1000,data!$C$1,setup!P50:S51)","v":0},0,null,null,{"$f":"IFERROR(IF(LOOKUP(2,1/(data!B:B=A21),data!C:C)=0,\"-\",LOOKUP(2,1/(data!B:B=A21),data!C:C)),\"-\")","v":"-"},{"$f":"IFERROR(IF(LOOKUP(2,1/(data!B:B=A21),data!A:A)=0,\"-\",LOOKUP(2,1/(data!B:B=A21),data!A:A)),\"-\")","v":"-"},{"$f":"IFERROR(IF(LOOKUP(2,1/(data!B:B=A21),data!D:D)=0,\"-\",LOOKUP(2,1/(data!B:B=A21),data!D:D)),\"-\")","v":"-"}]
[null,{"$f":"DSUM(data!$A$1:$C$1000,data!$C$1,setup!B53:E54)","v":0},{"$f":"DSUM(data!$A$1:$C$1000,data!$C$1,setup!K53:N54)","v":0},{"$f":"DSUM(data!$A$1:$C$1000,data!$C$1,setup!P53:S54)","v":0},0,null,null,{"$f":"IFERROR(IF(LOOKUP(2,1/(data!B:B=A22),data!C:C)=0,\"-\",LOOKUP(2,1/(data!B:B=A22),data!C:C)),\"-\")","v":"-"},{"$f":"IFERROR(IF(LOOKUP(2,1/(data!B:B=A22),data!A:A)=0,\"-\",LOOKUP(2,1/(data!B:B=A22),data!A:A)),\"-\")","v":"-"},{"$f":"IFERROR(IF(LOOKUP(2,1/(data!B:B=A22),data!D:D)=0,\"-\",LOOKUP(2,1/(data!B:B=A22),data!D:D)),\"-\")","v":"-"}]
[null,{"$f":"DSUM(data!$A$1:$C$1000,data!$C$1,setup!B56:E57)","v":0},{"$f":"DSUM(data!$A$1:$C$1000,data!$C$1,setup!K56:N57)","v":0},{"$f":"DSUM(data!$A$1:$C$1000,data!$C$1,setup!P56:S57)","v":0},0,null,null,{"$f":"IFERROR(IF(LOOKUP(2,1/(data!B:B=A23),data!C:C)=0,\"-\",LOOKUP(2,1/(data!B:B=A23),data!C:C)),\"-\")","v":"-"},{"$f":"IFERROR(IF(LOOKUP(2,1/(data!B:B=A23),data!A:A)=0,\"-\",LOOKUP(2,1/(data!B:B=A23),data!A:A)),\"-\")","v":"-"},{"$f":"IFERROR(IF(LOOKUP(2,1/(data!B:B=A23),data!D:D)=0,\"-\",LOOKUP(2,1/(data!B:B=A23),data!D:D)),\"-\")","v":"-"}]
[null,{"$f":"DSUM(data!$A$1:$C$1000,data!$C$1,setup!B59:E60)","v":0},{"$f":"DSUM(data!$A$1:$C$1000,data!$C$1,setup!K59:N60)","v":0},{"$f":"DSUM(data!$A$1:$C$1000,data!$C$1,setup!P59:S60)","v":0},0,null,null,{"$f":"IFERROR(IF(LOOKUP(2,1/(data!B:B=A24),data!C:C)=0,\"-\",LOOKUP(2,1/(data!B:B=A24),data!C:C)),\"-\")","v":"-"},{"$f":"IFERROR(IF(LOOKUP(2,1/(data!B:B=A24),data!A:A)=0,\"-\",LOOKUP(2,1/(data!B:B=A24),data!A:A)),\"-\")","v":"-"},{"$f":"IFERROR(IF(LOOKUP(2,1/(data!B:B=A24),data!D:D)=0,\"-\",LOOKUP(2,1/(data!B:B=A24),data!D:D)),\"-\")","v":"-"}]
[]
["الإجمالي",{"$f":"SUM(B5:B24)","v":0},{"$f":"SUM(C5:C25)","v":0},{"$f":"SUM(D5:D24)","v":0},{"$f":"C26-D26","v":0}]

{"sheet":"dashboard","index":1,"n_rows":0,"n_cols":0,"rows_kept":0,"cut":false,"hidden":false,"merged":[]}

{"sheet":"data","index":2,"n_rows":1,"n_cols":6,"rows_kept":1,"cut":false,"hidden":false,"merged":[]}
["التاريخ","البند","المبلغ","الوصف","السنة","الشهر"]

{"sheet":"pivotButton","index":3,"n_rows":5,"n_cols":2,"rows_kept":5,"cut":false,"hidden":true,"merged":[]}
[]
[]
["Row Labels","Sum of المبلغ"]
[2025,3000]
["Grand Total",3000]

{"sheet":"pivotMonthly","index":4,"n_rows":5,"n_cols":3,"rows_kept":5,"cut":false,"hidden":true,"merged":[]}
[]
[]
["Row Labels","Sum of المبلغ","Count of المبلغ2"]
[4,3000,3]
["Grand Total",3000,3]

{"sheet":"pivotCatogery","index":5,"n_rows":6,"n_cols":8,"rows_kept":6,"cut":false,"hidden":true,"merged":[]}
[]
[null,null,null,null,null,null,null,{"$f":"\"(\"&MAX(B:B)&\")\"","v":"(3000)"}]
["Row Labels","Sum of المبلغ"]
["إيجار 1202",1000]
["قرض شخصي",2000]
["Grand Total",3000]

{"sheet":"setup","index":6,"n_rows":60,"n_cols":19,"rows_kept":60,"cut":false,"hidden":true,"merged":[]}
[]
[null,"التاريخ","التاريخ","البند","المبلغ",null,"الشهر","السنة","بداية الشهر","نهاية الشهر","التاريخ","التاريخ","البند","المبلغ",null,"التاريخ","التاريخ","البند","المبلغ"]
[null,{"$f":"CONCATENATE(\">=\",1,\"/\",$G$3,\"/\",$H$3)","v":">=1/1/2021"},{"$f":"CONCATENATE(\"<=\",DAY($J$3),\"/\",$G$3,\"/\",$H$3)","v":"<=31/1/2021"},{"$f":"M3","v":0},null,null,{"$f":"main!A2","v":1},{"$f":"main!B2","v":2021},{"$f":"DATE(H3,G3,1)","v":"2021-01-01"},{"$f":"EOMONTH(I3,0)","v":"2021-01-31"},{"$f":"CONCATENATE(\">=\",1,\"/\",1,\"/\",$H$3)","v":">=1/1/2021"},{"$f":"CONCATENATE(\"<=\",31,\"/\",12,\"/\",$H$3)","v":"<=31/12/2021"},{"$f":"main!A5","v":0},null,null,{"$f":"CONCATENATE(\">=\",1,\"/\",1,\"/\",$H$3)","v":">=1/1/2021"},{"$f":"CONCATENATE(\"<=\",DAY(TODAY()),\"/\",MONTH(TODAY()),\"/\",$H$3)","v":"<=22/4/2021"},{"$f":"M3","v":0}]
[]
[null,"التاريخ","التاريخ","البند","المبلغ",null,null,null,null,null,"التاريخ","التاريخ","البند","المبلغ",null,"التاريخ","التاريخ","البند","المبلغ"]
[null,{"$f":"CONCATENATE(\">=\",1,\"/\",$G$3,\"/\",$H$3)","v":">=1/1/2021"},{"$f":"CONCATENATE(\"<=\",DAY($J$3),\"/\",$G$3,\"/\",$H$3)","v":"<=31/1/2021"},{"$f":"M6","v":0},null,null,null,null,null,null,{"$f":"CONCATENATE(\">=\",1,\"/\",1,\"/\",$H$3)","v":">=1/1/2021"},{"$f":"CONCATENATE(\"<=\",31,\"/\",12,\"/\",$H$3)","v":"<=31/12/2021"},{"$f":"main!A6","v":0},null,null,{"$f":"CONCATENATE(\">=\",1,\"/\",1,\"/\",$H$3)","v":">=1/1/2021"},{"$f":"CONCATENATE(\"<=\",DAY(TODAY()),\"/\",MONTH(TODAY()),\"/\",$H$3)","v":"<=22/4/2021"},{"$f":"M6","v":0}]
[]
[null,"التاريخ","التاريخ","البند","المبلغ",null,null,null,null,null,"التاريخ","التاريخ","البند","المبلغ",null,"التاريخ","التاريخ","البند","المبلغ"]
[null,{"$f":"CONCATENATE(\">=\",1,\"/\",$G$3,\"/\",$H$3)","v":">=1/1/2021"},{"$f":"CONCATENATE(\"<=\",DAY($J$3),\"/\",$G$3,\"/\",$H$3)","v":"<=31/1/2021"},{"$f":"M9","v":0},null,null,null,null,null,null,{"$f":"CONCATENATE(\">=\",1,\"/\",1,\"/\",$H$3)","v":">=1/1/2021"},{"$f":"CONCATENATE(\"<=\",31,\"/\",12,\"/\",$H$3)","v":"<=31/12/2021"},{"$f":"main!A7","v":0},null,null,{"$f":"CONCATENATE(\">=\",1,\"/\",1,\"/\",$H$3)","v":">=1/1/2021"},{"$f":"CONCATENATE(\"<=\",DAY(TODAY()),\"/\",MONTH(TODAY()),\"/\",$H$3)","v":"<=22/4/2021"},{"$f":"M9","v":0}]
[]
[null,"التاريخ","التاريخ","البند","المبلغ",null,null,null,null,null,"التاريخ","التاريخ","البند","المبلغ",null,"التاريخ","التاريخ","البند","المبلغ"]
[null,{"$f":"CONCATENATE(\">=\",1,\"/\",$G$3,\"/\",$H$3)","v":">=1/1/2021"},{"$f":"CONCATENATE(\"<=\",DAY($J$3),\"/\",$G$3,\"/\",$H$3)","v":"<=31/1/2021"},{"$f":"M12","v":0},null,null,null,null,null,null,{"$f":"CONCATENATE(\">=\",1,\"/\",1,\"/\",$H$3)","v":">=1/1/2021"},{"$f":"CONCATENATE(\"<=\",31,\"/\",12,\"/\",$H$3)","v":"<=31/12/2021"},{"$f":"main!A8","v":0},null,null,{"$f":"CONCATENATE(\">=\",1,\"/\",1,\"/\",$H$3)","v":">=1/1/2021"},{"$f":"CONCATENATE(\"<=\",DAY(TODAY()),\"/\",MONTH(TODAY()),\"/\",$H$3)","v":"<=22/4/2021"},{"$f":"M12","v":0}]
[]
[null,"التاريخ","التاريخ","البند","المبلغ",null,null,null,null,null,"التاريخ","التاريخ","البند","المبلغ",null,"التاريخ","التاريخ","البند","المبلغ"]
[null,{"$f":"CONCATENATE(\">=\",1,\"/\",$G$3,\"/\",$H$3)","v":">=1/1/2021"},{"$f":"CONCATENATE(\"<=\",DAY($J$3),\"/\",$G$3,\"/\",$H$3)","v":"<=31/1/2021"},{"$f":"M15","v":0},null,null,null,null,null,null,{"$f":"CONCATENATE(\">=\",1,\"/\",1,\"/\",$H$3)","v":">=1/1/2021"},{"$f":"CONCATENATE(\"<=\",31,\"/\",12,\"/\",$H$3)","v":"<=31/12/2021"},{"$f":"main!A9","v":0},null,null,{"$f":"CONCATENATE(\">=\",1,\"/\",1,\"/\",$H$3)","v":">=1/1/2021"},{"$f":"CONCATENATE(\"<=\",DAY(TODAY()),\"/\",MONTH(TODAY()),\"/\",$H$3)","v":"<=22/4/2021"},{"$f":"M15","v":0}]
[]
[null,"التاريخ","التاريخ","البند","المبلغ",null,null,null,null,null,"التاريخ","التاريخ","البند","المبلغ",null,"التاريخ","التاريخ","البند","المبلغ"]
[null,{"$f":"CONCATENATE(\">=\",1,\"/\",$G$3,\"/\",$H$3)","v":">=1/1/2021"},{"$f":"CONCATENATE(\"<=\",DAY($J$3),\"/\",$G$3,\"/\",$H$3)","v":"<=31/1/2021"},{"$f":"M18","v":0},null,null,null,null,null,null,{"$f":"CONCATENATE(\">=\",1,\"/\",1,\"/\",$H$3)","v":">=1/1/2021"},{"$f":"CONCATENATE(\"<=\",31,\"/\",12,\"/\",$H$3)","v":"<=31/12/2021"},{"$f":"main!A10","v":0},null,null,{"$f":"CONCATENATE(\">=\",1,\"/\",1,\"/\",$H$3)","v":">=1/1/2021"},{"$f":"CONCATENATE(\"<=\",DAY(TODAY()),\"/\",MONTH(TODAY()),\"/\",$H$3)","v":"<=22/4/2021"},{"$f":"M18","v":0}]
[]
[null,"التاريخ","التاريخ","البند","المبلغ",null,null,null,null,null,"التاريخ","التاريخ","البند","المبلغ",null,"التاريخ","التاريخ","البند","المبلغ"]
[null,{"$f":"CONCATENATE(\">=\",1,\"/\",$G$3,\"/\",$H$3)","v":">=1/1/2021"},{"$f":"CONCATENATE(\"<=\",DAY($J$3),\"/\",$G$3,\"/\",$H$3)","v":"<=31/1/2021"},{"$f":"M21","v":0},null,null,null,null,null,null,{"$f":"CONCATENATE(\">=\",1,\"/\",1,\"/\",$H$3)","v":">=1/1/2021"},{"$f":"CONCATENATE(\"<=\",31,\"/\",12,\"/\",$H$3)","v":"<=31/12/2021"},{"$f":"main!A11","v":0},null,null,{"$f":"CONCATENATE(\">=\",1,\"/\",1,\"/\",$H$3)","v":">=1/1/2021"},{"$f":"CONCATENATE(\"<=\",DAY(TODAY()),\"/\",MONTH(TODAY()),\"/\",$H$3)","v":"<=22/4/2021"},{"$f":"M21","v":0}]
[]
[null,"التاريخ","التاريخ","البند","المبلغ",null,null,null,null,null,"التاريخ","التاريخ","البند","المبلغ",null,"التاريخ","التاريخ","البند","المبلغ"]
[null,{"$f":"CONCATENATE(\">=\",1,\"/\",$G$3,\"/\",$H$3)","v":">=1/1/2021"},{"$f":"CONCATENATE(\"<=\",DAY($J$3),\"/\",$G$3,\"/\",$H$3)","v":"<=31/1/2021"},{"$f":"M24","v":0},null,null,null,null,null,null,{"$f":"CONCATENATE(\">=\",1,\"/\",1,\"/\",$H$3)","v":">=1/1/2021"},{"$f":"CONCATENATE(\"<=\",31,\"/\",12,\"/\",$H$3)","v":"<=31/12/2021"},{"$f":"main!A12","v":0},null,null,{"$f":"CONCATENATE(\">=\",1,\"/\",1,\"/\",$H$3)","v":">=1/1/2021"},{"$f":"CONCATENATE(\"<=\",DAY(TODAY()),\"/\",MONTH(TODAY()),\"/\",$H$3)","v":"<=22/4/2021"},{"$f":"M24","v":0}]
[]
[null,"التاريخ","التاريخ","البند","المبلغ",null,null,null,null,null,"التاريخ","التاريخ","البند","المبلغ",null,"التاريخ","التاريخ","البند","المبلغ"]
[null,{"$f":"CONCATENATE(\">=\",1,\"/\",$G$3,\"/\",$H$3)","v":">=1/1/2021"},{"$f":"CONCATENATE(\"<=\",DAY($J$3),\"/\",$G$3,\"/\",$H$3)","v":"<=31/1/2021"},{"$f":"M27","v":0},null,null,null,null,null,null,{"$f":"CONCATENATE(\">=\",1,\"/\",1,\"/\",$H$3)","v":">=1/1/2021"},{"$f":"CONCATENATE(\"<=\",31,\"/\",12,\"/\",$H$3)","v":"<=31/12/2021"},{"$f":"main!A13","v":0},null,null,{"$f":"CONCATENATE(\">=\",1,\"/\",1,\"/\",$H$3)","v":">=1/1/2021"},{"$f":"CONCATENATE(\"<=\",DAY(TODAY()),\"/\",MONTH(TODAY()),\"/\",$H$3)","v":"<=22/4/2021"},{"$f":"M27","v":0}]
[]
[null,"التاريخ","التاريخ","البند","المبلغ",null,null,null,null,null,"التاريخ","التاريخ","البند","المبلغ",null,"التاريخ","التاريخ","البند","المبلغ"]
[null,{"$f":"CONCATENATE(\">=\",1,\"/\",$G$3,\"/\",$H$3)","v":">=1/1/2021"},{"$f":"CONCATENATE(\"<=\",DAY($J$3),\"/\",$G$3,\"/\",$H$3)","v":"<=31/1/2021"},{"$f":"M30","v":0},null,null,null,null,null,null,{"$f":"CONCATENATE(\">=\",1,\"/\",1,\"/\",$H$3)","v":">=1/1/2021"},{"$f":"CONCATENATE(\"<=\",31,\"/\",12,\"/\",$H$3)","v":"<=31/12/2021"},{"$f":"main!A14","v":0},null,null,{"$f":"CONCATENATE(\">=\",1,\"/\",1,\"/\",$H$3)","v":">=1/1/2021"},{"$f":"CONCATENATE(\"<=\",DAY(TODAY()),\"/\",MONTH(TODAY()),\"/\",$H$3)","v":"<=22/4/2021"},{"$f":"M30","v":0}]
[]
[null,"التاريخ","التاريخ","البند","المبلغ",null,null,null,null,null,"التاريخ","التاريخ","البند","المبلغ",null,"التاريخ","التاريخ","البند","المبلغ"]
[null,{"$f":"CONCATENATE(\">=\",1,\"/\",$G$3,\"/\",$H$3)","v":">=1/1/2021"},{"$f":"CONCATENATE(\"<=\",DAY($J$3),\"/\",$G$3,\"/\",$H$3)","v":"<=31/1/2021"},{"$f":"M33","v":0},null,null,null,null,null,null,{"$f":"CONCATENATE(\">=\",1,\"/\",1,\"/\",$H$3)","v":">=1/1/2021"},{"$f":"CONCATENATE(\"<=\",31,\"/\",12,\"/\",$H$3)","v":"<=31/12/2021"},{"$f":"main!A15","v":0},null,null,{"$f":"CONCATENATE(\">=\",1,\"/\",1,\"/\",$H$3)","v":">=1/1/2021"},{"$f":"CONCATENATE(\"<=\",DAY(TODAY()),\"/\",MONTH(TODAY()),\"/\",$H$3)","v":"<=22/4/2021"},{"$f":"M33","v":0}]
[]
[null,"التاريخ","التاريخ","البند","المبلغ",null,null,null,null,null,"التاريخ","التاريخ","البند","المبلغ",null,"التاريخ","التاريخ","البند","المبلغ"]
[null,{"$f":"CONCATENATE(\">=\",1,\"/\",$G$3,\"/\",$H$3)","v":">=1/1/2021"},{"$f":"CONCATENATE(\"<=\",DAY($J$3),\"/\",$G$3,\"/\",$H$3)","v":"<=31/1/2021"},{"$f":"M36","v":0},null,null,null,null,null,null,{"$f":"CONCATENATE(\">=\",1,\"/\",1,\"/\",$H$3)","v":">=1/1/2021"},{"$f":"CONCATENATE(\"<=\",31,\"/\",12,\"/\",$H$3)","v":"<=31/12/2021"},{"$f":"main!A16","v":0},null,null,{"$f":"CONCATENATE(\">=\",1,\"/\",1,\"/\",$H$3)","v":">=1/1/2021"},{"$f":"CONCATENATE(\"<=\",DAY(TODAY()),\"/\",MONTH(TODAY()),\"/\",$H$3)","v":"<=22/4/2021"},{"$f":"M36","v":0}]
[]
[null,"التاريخ","التاريخ","البند","المبلغ",null,null,null,null,null,"التاريخ","التاريخ","البند","المبلغ",null,"التاريخ","التاريخ","البند","المبلغ"]
[null,{"$f":"CONCATENATE(\">=\",1,\"/\",$G$3,\"/\",$H$3)","v":">=1/1/2021"},{"$f":"CONCATENATE(\"<=\",DAY($J$3),\"/\",$G$3,\"/\",$H$3)","v":"<=31/1/2021"},{"$f":"M39","v":0},null,null,null,null,null,null,{"$f":"CONCATENATE(\">=\",1,\"/\",1,\"/\",$H$3)","v":">=1/1/2021"},{"$f":"CONCATENATE(\"<=\",31,\"/\",12,\"/\",$H$3)","v":"<=31/12/2021"},{"$f":"main!A17","v":0},null,null,{"$f":"CONCATENATE(\">=\",1,\"/\",1,\"/\",$H$3)","v":">=1/1/2021"},{"$f":"CONCATENATE(\"<=\",DAY(TODAY()),\"/\",MONTH(TODAY()),\"/\",$H$3)","v":"<=22/4/2021"},{"$f":"M39","v":0}]
[]
{"$rows_left_out":20}