{"text_format":"1","workbook":"xlsx","n_sheets":2,"sheets":["جدول ","معلمين"],"not_rendered":{"charts":0,"images":0,"macros":1,"external_links":0,"defined_names":2,"comments":0,"pivot_tables":0},"unopened":[],"bounds":{"document_bytes":16777216,"sheet_cells":100000,"rows_first":2000,"rows_last":500,"rows_between":2000,"halvings":0,"cell_chars":16384,"cell_head_chars":4096},"cells_cut":0,"cells_raw":0,"read":"whole","date_system":"1900"}

{"sheet":"جدول ","index":0,"n_rows":25,"n_cols":40,"rows_kept":25,"cut":false,"hidden":false,"merged":[[24,1,24,4],[24,10,24,19],[24,29,24,34],[0,0,0,6],[1,0,1,6],[2,9,2,22],[3,0,4,0],[3,1,3,7],[3,8,3,14],[3,15,3,21],[3,22,3,28],[3,29,3,35],[23,1,23,4],[23,10,23,19],[23,29,23,34]]}
["ادارة"]
["مدرسة "]
[null,null,null,null,null,null,null,null,null,"الجدول العام للمدرسة للعام ٢٠٢٤ - ٢٠٢٥"]
[null,"الأحد",null,null,null,null,null,null,"الإثنين",null,null,null,null,null,null,"الثلاثاء",null,null,null,null,null,null,"الأربعاء",null,null,null,null,null,null,"الخميس",null,null,null,null,null,null,null,"الاسم","اللون"]
[null,"١","٢","٣","٤","٥","٦","٧","١","٢","٣","٤","٥","٦","٧","١","٢","٣","٤","٥","٦","٧","١","٢","٣","٤","٥","٦","٧","١","٢","٣","٤","٥","٦","٧",null,"s1"]
["s1",null,null,"١-١","١-١","١-١","١-١","١-١",null,null,null,null,null,null,null,"١-١","١-١","١-١","١-١","١-١",null,null,null,null,null,null,null,null,null,null,null,null,null,null,null,null,1,"s2",null,"عربي"]
["s2","١-٢","١-٢","٢-٢",null,null,null,null,null,null,"٢-٢",null,"١-٢","٢-٢","٢-٢","٢-٢","٢-٢","١-٢","١-٢",null,null,null,null,null,null,"٢-٢","٢-٢","١-٢","١-٢","٢-٢","٢-٢","١-٢","١-٢","١-٢",null,null,2,"s3",null,"عربي"]
["s3",null,null,null,null,null,null,null,null,null,"٢-١","٢-١","٢-١","٢-١","٢-١",null,null,null,null,null,null,null,"٢-١","٢-١","٢-١","٢-١","٢-١",null,null,null,null,null,null,null,null,null,3,"s4",null,"عربي"]
["s4","١-٣","١-٣",null,null,null,"٢-٣","٢-٣","١-٣",null,"٢-٣","٢-٣","٢-٣","١-٣","١-٣",null,null,null,"٢-٣","٢-٣",null,null,"١-٣","١-٣","١-٣",null,null,null,null,"١-٣","١-٣","٢-٣","٢-٣",null,null,"٢-٣",4,"s5",null,"عربي"]
["s5",null,null,null,"٢-٢","٢-٢","٢-١","٢-١","١-٢","١-٢",null,null,null,null,"١-١","٢-١","٢-١","٢-٢","٢-٢","١-٢","١-٢",null,"١-١","١-١",null,null,null,null,null,"١-١","١-١","٢-٢","٢-٢","٢-١","١-٢","١-٢",5,"s6",null,"E"]
["s6",null,null,null,null,null,null,null,null,null,null,null,null,null,null,null,"٢-٣","٢-٣",null,null,"١-٣","١-٣",null,null,null,"٢-٣","٢-٣","١-٣","١-٣","٢-٣","٢-٣",null,null,null,"١-٣","١-٣",6,"s7",null,"E"]
["s7","٢-٢","٢-٢","٢-١","٢-١",null,null,null,"١-١","١-١","١-٢","١-٢","١-١","١-١",null,"١-٢","١-٢","٢-١","٢-١",null,"٢-٢","٢-٢",null,null,null,null,null,"٢-١","٢-١","١-٢","١-٢","١-١","١-١",null,"٢-٢","٢-٢",7,"s8",null,"رياضيات"]
["s8",null,"٢-٣","٢-٣","١-٣","١-٣",null,null,null,null,null,null,null,null,null,"١-٣","١-٣",null,null,null,"٢-٣","٢-٣",null,null,null,null,null,"٢-٣","٢-٣",null,null,null,"١-٣","١-٣",null,null,8,"s9",null,"رياضيات"]
["s9","٢-١","٢-١","١-٢","١-٢",null,"٢-٢","٢-٢","٢-١","٢-١","١-١","١-١",null,null,null,null,null,null,null,null,null,null,"٢-٢","٢-٢","١-٢","١-٢",null,"١-١","١-١",null,null,null,null,null,null,null,9,"s10",null,"دراسات"]
["s10",null,null,null,"٢-٣","٢-٣","١-٣","١-٣",null,null,null,null,null,"٢-٣","٢-٣",null,null,"١-٣","١-٣",null,null,null,null,null,null,null,null,null,null,null,null,null,null,null,null,null,10,"s11",null,"دراسات"]
["s11","١-١","١-١",null,null,null,null,null,"٢-٢","٢-٢",null,null,null,"١-٢","١-٢",null,null,null,null,null,"٢-١","٢-١","١-٢","١-٢",null,null,null,"٢-٢","٢-٢","٢-١","٢-١",null,null,null,"١-١","١-١",11,"s12",null,"علوم"]
["s12",null,null,null,null,null,null,null,"٢-٣","٢-٣",null,"١-٣","١-٣",null,null,null,null,null,null,null,null,null,"٢-٣","٢-٣",null,"١-٣","١-٣",null,null,null,null,null,null,null,null,null,12,"s13",null,"علوم"]
["s13","٢-٣",null,"١-٣",null,"٢-١",null,null,null,null,null,null,null,null,null,null,null,null,null,"٢-٢","١-١","١-٢",null,null,null,null,null,null,null,null,null,null,null,null,null,null,13,"s14",null,"حاسب"]
["s14",null,null,null,null,"١-٢","١-٢",null,null,"١-٣","١-٣","٢-٢","٢-٢",null,null,null,null,null,null,null,null,null,null,null,"١-١","١-١",null,null,null,null,null,"٢-١","٢-١","٢-٣","٢-٣",null,14,"s15",null,"فنية"]
["s15",null,null,null,null,null,null,null,null,null,null,null,null,null,null,"٢-٣",null,null,null,"١-٣",null,null,null,null,"٢-٣",null,"١-١",null,null,null,null,"١-٣",null,"١-١","٢-١","٢-١",15,"s16",null,"ت.رياضية"]
["s16",null,null,null,null,null,null,"١-٢",null,null,null,null,null,null,null,null,null,null,null,null,null,null,null,null,"٢-٢",null,"١-٢",null,null,null,null,null,null,"٢-٢",null,null,16,"s17",null,"مجالات"]
["s17",null,null,null,null,null,null,null,null,null,null,null,null,null,null,null,null,null,null,"٢-١",null,"١-١",null,null,null,null,null,null,null,null,null,null,null,null,null,null,17,"s18",null,"مجالات"]
["s18",null,null,"m",null,null,null,null,null,null,"b",null,null,null,null,null,null,"c",null,null,null,null,null,null,null,"h",null,null,null,null,null,null,"f",null,null,null,18,null,null,"مشرف"]
[null,"مسئول الجدول",null,null,null,null,null,null,null,null,"تم إنشاء الجدول في :",null,null,null,null,null,null,null,null,null,null,null,null,null,null,null,null,null,null,"مدير المدرسة"]
[null,null,null,null,null,null,null,null,null,null,{"$f":"NOW()","v":"2025-04-28T21:56:39.140"}]

{"sheet":"معلمين","index":1,"n_rows":38,"n_cols":18,"rows_kept":38,"cut":false,"hidden":false,"merged":[[1,1,1,2],[3,3,3,4],[3,5,3,6],[3,7,3,8],[16,3,16,4],[16,5,16,6],[16,7,16,8],[12,4,12,5],[11,4,11,5],[10,11,13,14],[36,4,36,5],[37,4,37,5],[28,3,28,4],[28,5,28,6],[28,7,28,8],[24,4,24,5],[25,4,25,5]]}
[null,null,null,null,null,null,null,null,null,null,null,null,null,null,null,null,"الاسم","اللون"]
[null,null,null,null,null,null,null,null,null,null,null,null,1,null,null,null,"s1"]
[null,null,null,null,null,null,null,null,null,null,null,null,null,null,null,null,"s2"]
[null,"ادارة",null,"جداول المعلمين",null,"العام الدراسي",null,"2025 - 2024",null,null,null,null,null,null,null,null,"s3"]
[null,"مدرسة",null,{"$f":"INDEX('جدول '!$A$6:$A$23,MATCH($I$5,'جدول '!$AK$6:$AK$23,0))","v":"s1"},null,null,null,{"$f":"VLOOKUP($M$2,'جدول '!$AK$6:$AO$23,4,0)","v":"عربي"},{"$f":"$M$2","v":1},null,null,null,null,null,null,null,"s4"]
[null,null,"الأولى","الثانية","الثالثة","الرابعة","الخامسة","السادسة","السابعة",null,null,null,null,null,null,null,"s5"]
[null,"الأحد",{"$f":"IF(INDEX('جدول '!$B$6:$B$23,MATCH($M$2,'جدول '!$AK$6:$AK$23,0))=\"\",\"\",INDEX('جدول '!$B$6:$B$23,MATCH($M$2,'جدول '!$AK$6:$AK$23,0)))","v":""},{"$f":"IF(INDEX('جدول '!$C$6:$C$23,MATCH($M$2,'جدول '!$AK$6:$AK$23,0))=\"\",\"\",INDEX('جدول '!$C$6:$C$23,MATCH($M$2,'جدول '!$AK$6:$AK$23,0)))","v":""},{"$f":"IF(INDEX('جدول '!$D$6:$D$23,MATCH($M$2,'جدول '!$AK$6:$AK$23,0))=\"\",\"\",INDEX('جدول '!$D$6:$D$23,MATCH($M$2,'جدول '!$AK$6:$AK$23,0)))","v":"١-١"},{"$f":"IF(INDEX('جدول '!$E$6:$E$23,MATCH($M$2,'جدول '!$AK$6:$AK$23,0))=\"\",\"\",INDEX('جدول '!$E$6:$E$23,MATCH($M$2,'جدول '!$AK$6:$AK$23,0)))","v":"١-١"},{"$f":"IF(INDEX('جدول '!$F$6:$F$23,MATCH($M$2,'جدول '!$AK$6:$AK$23,0))=\"\",\"\",INDEX('جدول '!$F$6:$F$23,MATCH($M$2,'جدول '!$AK$6:$AK$23,0)))","v":"١-١"},{"$f":"IF(INDEX('جدول '!$G$6:$G$23,MATCH($M$2,'جدول '!$AK$6:$AK$23,0))=\"\",\"\",INDEX('جدول '!$G$6:$G$23,MATCH($M$2,'جدول '!$AK$6:$AK$23,0)))","v":"١-١"},{"$f":"IF(INDEX('جدول '!$H$6:$H$23,MATCH($M$2,'جدول '!$AK$6:$AK$23,0))=\"\",\"\",INDEX('جدول '!$H$6:$H$23,MATCH($M$2,'جدول '!$AK$6:$AK$23,0)))","v":"١-١"},null,null,null,null,null,null,null,"s6"]
[null,"الإثنين",{"$f":"IF(INDEX('جدول '!$I$6:$I$23,MATCH($M$2,'جدول '!$AK$6:$AK$23,0))=\"\",\"\",INDEX('جدول '!$I$6:$I$23,MATCH($M$2,'جدول '!$AK$6:$AK$23,0)))","v":""},{"$f":"IF(INDEX('جدول '!$J$6:$J$23,MATCH($M$2,'جدول '!$AK$6:$AK$23,0))=\"\",\"\",INDEX('جدول '!$J$6:$J$23,MATCH($M$2,'جدول '!$AK$6:$AK$23,0)))","v":""},{"$f":"IF(INDEX('جدول '!$K$6:$K$23,MATCH($M$2,'جدول '!$AK$6:$AK$23,0))=\"\",\"\",INDEX('جدول '!$K$6:$K$23,MATCH($M$2,'جدول '!$AK$6:$AK$23,0)))","v":""},{"$f":"IF(INDEX('جدول '!$L$6:$L$23,MATCH($M$2,'جدول '!$AK$6:$AK$23,0))=\"\",\"\",INDEX('جدول '!$L$6:$L$23,MATCH($M$2,'جدول '!$AK$6:$AK$23,0)))","v":""},{"$f":"IF(INDEX('جدول '!$M$6:$M$23,MATCH($M$2,'جدول '!$AK$6:$AK$23,0))=\"\",\"\",INDEX('جدول '!$M$6:$M$23,MATCH($M$2,'جدول '!$AK$6:$AK$23,0)))","v":""},{"$f":"IF(INDEX('جدول '!$N$6:$N$23,MATCH($M$2,'جدول '!$AK$6:$AK$23,0))=\"\",\"\",INDEX('جدول '!$N$6:$N$23,MATCH($M$2,'جدول '!$AK$6:$AK$23,0)))","v":""},{"$f":"IF(INDEX('جدول '!$O$6:$O$23,MATCH($M$2,'جدول '!$AK$6:$AK$23,0))=\"\",\"\",INDEX('جدول '!$O$6:$O$23,MATCH($M$2,'جدول '!$AK$6:$AK$23,0)))","v":""},null,null,null,null,null,null,null,"s7"]
[null,"الثلاثاء",{"$f":"IF(INDEX('جدول '!$P$6:$P$23,MATCH($M$2,'جدول '!$AK$6:$AK$23,0))=\"\",\"\",INDEX('جدول '!$P$6:$P$23,MATCH($M$2,'جدول '!$AK$6:$AK$23,0)))","v":"١-١"},{"$f":"IF(INDEX('جدول '!$Q$6:$Q$23,MATCH($M$2,'جدول '!$AK$6:$AK$23,0))=\"\",\"\",INDEX('جدول '!$Q$6:$Q$23,MATCH($M$2,'جدول '!$AK$6:$AK$23,0)))","v":"١-١"},{"$f":"IF(INDEX('جدول '!$R$6:$R$23,MATCH($M$2,'جدول '!$AK$6:$AK$23,0))=\"\",\"\",INDEX('جدول '!$R$6:$R$23,MATCH($M$2,'جدول '!$AK$6:$AK$23,0)))","v":"١-١"},{"$f":"IF(INDEX('جدول '!$S$6:$S$23,MATCH($M$2,'جدول '!$AK$6:$AK$23,0))=\"\",\"\",INDEX('جدول '!$S$6:$S$23,MATCH($M$2,'جدول '!$AK$6:$AK$23,0)))","v":"١-١"},{"$f":"IF(INDEX('جدول '!$T$6:$T$23,MATCH($M$2,'جدول '!$AK$6:$AK$23,0))=\"\",\"\",INDEX('جدول '!$T$6:$T$23,MATCH($M$2,'جدول '!$AK$6:$AK$23,0)))","v":"١-١"},{"$f":"IF(INDEX('جدول '!$U$6:$U$23,MATCH($M$2,'جدول '!$AK$6:$AK$23,0))=\"\",\"\",INDEX('جدول '!$U$6:$U$23,MATCH($M$2,'جدول '!$AK$6:$AK$23,0)))","v":""},{"$f":"IF(INDEX('جدول '!$V$6:$V$23,MATCH($M$2,'جدول '!$AK$6:$AK$23,0))=\"\",\"\",INDEX('جدول '!$V$6:$V$23,MATCH($M$2,'جدول '!$AK$6:$AK$23,0)))","v":""},null,null,null,null,null,null,null,"s8"]
[null,"الأربعاء",{"$f":"IF(INDEX('جدول '!$W$6:$W$23,MATCH($M$2,'جدول '!$AK$6:$AK$23,0))=\"\",\"\",INDEX('جدول '!$W$6:$W$23,MATCH($M$2,'جدول '!$AK$6:$AK$23,0)))","v":""},{"$f":"IF(INDEX('جدول '!$X$6:$X$23,MATCH($M$2,'جدول '!$AK$6:$AK$23,0))=\"\",\"\",INDEX('جدول '!$X$6:$X$23,MATCH($M$2,'جدول '!$AK$6:$AK$23,0)))","v":""},{"$f":"IF(INDEX('جدول '!$Y$6:$Y$23,MATCH($M$2,'جدول '!$AK$6:$AK$23,0))=\"\",\"\",INDEX('جدول '!$Y$6:$Y$23,MATCH($M$2,'جدول '!$AK$6:$AK$23,0)))","v":""},{"$f":"IF(INDEX('جدول '!$Z$6:$Z$23,MATCH($M$2,'جدول '!$AK$6:$AK$23,0))=\"\",\"\",INDEX('جدول '!$Z$6:$Z$23,MATCH($M$2,'جدول '!$AK$6:$AK$23,0)))","v":""},{"$f":"IF(INDEX('جدول '!$AA$6:$AA$23,MATCH($M$2,'جدول '!$AK$6:$AK$23,0))=\"\",\"\",INDEX('جدول '!$AA$6:$AA$23,MATCH($M$2,'جدول '!$AK$6:$AK$23,0)))","v":""},{"$f":"IF(INDEX('جدول '!$AB$6:$AB$23,MATCH($M$2,'جدول '!$AK$6:$AK$23,0))=\"\",\"\",INDEX('جدول '!$AB$6:$AB$23,MATCH($M$2,'جدول '!$AK$6:$AK$23,0)))","v":""},{"$f":"IF(INDEX('جدول '!$AC$6:$AC$23,MATCH($M$2,'جدول '!$AK$6:$AK$23,0))=\"\",\"\",INDEX('جدول '!$AC$6:$AC$23,MATCH($M$2,'جدول '!$AK$6:$AK$23,0)))","v":""},null,null,null,null,null,null,null,"s9"]
[null,"الخميس",{"$f":"IF(INDEX('جدول '!$AD$6:$AD$23,MATCH($M$2,'جدول '!$AK$6:$AK$23,0))=\"\",\"\",INDEX('جدول '!$AD$6:$AD$23,MATCH($M$2,'جدول '!$AK$6:$AK$23,0)))","v":""},{"$f":"IF(INDEX('جدول '!$AE$6:$AE$23,MATCH($M$2,'جدول '!$AK$6:$AK$23,0))=\"\",\"\",INDEX('جدول '!$AE$6:$AE$23,MATCH($M$2,'جدول '!$AK$6:$AK$23,0)))","v":""},{"$f":"IF(INDEX('جدول '!$AF$6:$AF$23,MATCH($M$2,'جدول '!$AK$6:$AK$23,0))=\"\",\"\",INDEX('جدول '!$AF$6:$AF$23,MATCH($M$2,'جدول '!$AK$6:$AK$23,0)))","v":""},{"$f":"IF(INDEX('جدول '!$AG$6:$AG$23,MATCH($M$2,'جدول '!$AK$6:$AK$23,0))=\"\",\"\",INDEX('جدول '!$AG$6:$AG$23,MATCH($M$2,'جدول '!$AK$6:$AK$23,0)))","v":""},{"$f":"IF(INDEX('جدول '!$AH$6:$AH$23,MATCH($M$2,'جدول '!$AK$6:$AK$23,0))=\"\",\"\",INDEX('جدول '!$AH$6:$AH$23,MATCH($M$2,'جدول '!$AK$6:$AK$23,0)))","v":""},{"$f":"IF(INDEX('جدول '!$AI$6:$AI$23,MATCH($M$2,'جدول '!$AK$6:$AK$23,0))=\"\",\"\",INDEX('جدول '!$AI$6:$AI$23,MATCH($M$2,'جدول '!$AK$6:$AK$23,0)))","v":""},{"$f":"IF(INDEX('جدول '!$AJ$6:$AJ$23,MATCH($M$2,'جدول '!$AK$6:$AK$23,0))=\"\",\"\",INDEX('جدول '!$AJ$6:$AJ$23,MATCH($M$2,'جدول '!$AK$6:$AK$23,0)))","v":""},null,null,"المطلوب تلوين حصص كل معلم\n حسب اللون في الشكل الموضح  بتغير الجداول بواسطة Spinner 3 او Drop Down 2",null,null,null,null,"s10"]
[null,null,"مسئول الجدول",null,"إنشاء الجدول",null,null,"مدير المدرسة",null,null,null,null,null,null,null,null,"s11"]
[null,null,null,null,{"$f":"NOW()","v":"2025-04-28T21:56:39.140"},null,null,null,null,null,null,null,null,null,null,null,"s12"]
[null,null,null,null,null,null,null,null,null,null,null,null,null,null,null,null,"s13"]
[null,null,null,null,null,null,null,null,null,null,null,null,null,null,null,null,"s14"]
[null,null,null,null,null,null,null,null,null,null,null,null,null,null,null,null,"s15"]
[null,"ادارة",null,"جداول المعلمين",null,"العام الدراسي",null,"2025 - 2024",null,null,null,null,null,null,null,null,"s16"]
[null,"مدرسة ",null,{"$f":"INDEX('جدول '!$A$6:$A$23,MATCH($I$18,'جدول '!$AK$6:$AK$23,0))","v":"s2"},null,null,null,{"$f":"VLOOKUP($M$2+1,'جدول '!$AK$6:$AO$23,4,0)","v":"عربي"},{"$f":"$M$2+1","v":2},null,null,null,null,null,null,null,"s17"]
[null,null,"الأولى","الثانية","الثالثة","الرابعة","الخامسة","السادسة","السابعة",null,null,null,null,null,null,null,"s18"]
[null,"الأحد",{"$f":"IF(INDEX('جدول '!$B$6:$B$23,MATCH($I$18,'جدول '!$AK$6:$AK$23,0))=\"\",\"\",INDEX('جدول '!$B$6:$B$23,MATCH($I$18,'جدول '!$AK$6:$AK$23,0)))","v":"١-٢"},{"$f":"IF(INDEX('جدول '!$C$6:$C$23,MATCH($I$18,'جدول '!$AK$6:$AK$23,0))=\"\",\"\",INDEX('جدول '!$C$6:$C$23,MATCH($I$18,'جدول '!$AK$6:$AK$23,0)))","v":"١-٢"},{"$f":"IF(INDEX('جدول '!$D$6:$D$23,MATCH($I$18,'جدول '!$AK$6:$AK$23,0))=\"\",\"\",INDEX('جدول '!$D$6:$D$23,MATCH($I$18,'جدول '!$AK$6:$AK$23,0)))","v":"٢-٢"},{"$f":"IF(INDEX('جدول '!$E$6:$E$23,MATCH($I$18,'جدول '!$AK$6:$AK$23,0))=\"\",\"\",INDEX('جدول '!$E$6:$E$23,MATCH($I$18,'جدول '!$AK$6:$AK$23,0)))","v":""},{"$f":"IF(INDEX('جدول '!$F$6:$F$23,MATCH($I$18,'جدول '!$AK$6:$AK$23,0))=\"\",\"\",INDEX('جدول '!$F$6:$F$23,MATCH($I$18,'جدول '!$AK$6:$AK$23,0)))","v":""},{"$f":"IF(INDEX('جدول '!$G$6:$G$23,MATCH($I$18,'جدول '!$AK$6:$AK$23,0))=\"\",\"\",INDEX('جدول '!$G$6:$G$23,MATCH($I$18,'جدول '!$AK$6:$AK$23,0)))","v":""},{"$f":"IF(INDEX('جدول '!$H$6:$H$23,MATCH($I$18,'جدول '!$AK$6:$AK$23,0))=\"\",\"\",INDEX('جدول '!$H$6:$H$23,MATCH($I$18,'جدول '!$AK$6:$AK$23,0)))","v":""}]
[null,"الإثنين",{"$f":"IF(INDEX('جدول '!$I$6:$I$23,MATCH($I$18,'جدول '!$AK$6:$AK$23,0))=\"\",\"\",INDEX('جدول '!$I$6:$I$23,MATCH($I$18,'جدول '!$AK$6:$AK$23,0)))","v":""},{"$f":"IF(INDEX('جدول '!$J$6:$J$23,MATCH($I$18,'جدول '!$AK$6:$AK$23,0))=\"\",\"\",INDEX('جدول '!$J$6:$J$23,MATCH($I$18,'جدول '!$AK$6:$AK$23,0)))","v":""},{"$f":"IF(INDEX('جدول '!$K$6:$K$23,MATCH($I$18,'جدول '!$AK$6:$AK$23,0))=\"\",\"\",INDEX('جدول '!$K$6:$K$23,MATCH($I$18,'جدول '!$AK$6:$AK$23,0)))","v":"٢-٢"},{"$f":"IF(INDEX('جدول '!$L$6:$L$23,MATCH($I$18,'جدول '!$AK$6:$AK$23,0))=\"\",\"\",INDEX('جدول '!$L$6:$L$23,MATCH($I$18,'جدول '!$AK$6:$AK$23,0)))","v":""},{"$f":"IF(INDEX('جدول '!$M$6:$M$23,MATCH($I$18,'جدول '!$AK$6:$AK$23,0))=\"\",\"\",INDEX('جدول '!$M$6:$M$23,MATCH($I$18,'جدول '!$AK$6:$AK$23,0)))","v":"١-٢"},{"$f":"IF(INDEX('جدول '!$N$6:$N$23,MATCH($I$18,'جدول '!$AK$6:$AK$23,0))=\"\",\"\",INDEX('جدول '!$N$6:$N$23,MATCH($I$18,'جدول '!$AK$6:$AK$23,0)))","v":"٢-٢"},{"$f":"IF(INDEX('جدول '!$O$6:$O$23,MATCH($I$18,'جدول '!$AK$6:$AK$23,0))=\"\",\"\",INDEX('جدول '!$O$6:$O$23,MATCH($I$18,'جدول '!$AK$6:$AK$23,0)))","v":"٢-٢"}]
[null,"الثلاثاء",{"$f":"IF(INDEX('جدول '!$P$6:$P$23,MATCH($I$18,'جدول '!$AK$6:$AK$23,0))=\"\",\"\",INDEX('جدول '!$P$6:$P$23,MATCH($I$18,'جدول '!$AK$6:$AK$23,0)))","v":"٢-٢"},{"$f":"IF(INDEX('جدول '!$Q$6:$Q$23,MATCH($I$18,'جدول '!$AK$6:$AK$23,0))=\"\",\"\",INDEX('جدول '!$Q$6:$Q$23,MATCH($I$18,'جدول '!$AK$6:$AK$23,0)))","v":"٢-٢"},{"$f":"IF(INDEX('جدول '!$R$6:$R$23,MATCH($I$18,'جدول '!$AK$6:$AK$23,0))=\"\",\"\",INDEX('جدول '!$R$6:$R$23,MATCH($I$18,'جدول '!$AK$6:$AK$23,0)))","v":"١-٢"},{"$f":"IF(INDEX('جدول '!$S$6:$S$23,MATCH($I$18,'جدول '!$AK$6:$AK$23,0))=\"\",\"\",INDEX('جدول '!$S$6:$S$23,MATCH($I$18,'جدول '!$AK$6:$AK$23,0)))","v":"١-٢"},{"$f":"IF(INDEX('جدول '!$T$6:$T$23,MATCH($I$18,'جدول '!$AK$6:$AK$23,0))=\"\",\"\",INDEX('جدول '!$T$6:$T$23,MATCH($I$18,'جدول '!$AK$6:$AK$23,0)))","v":""},{"$f":"IF(INDEX('جدول '!$U$6:$U$23,MATCH($I$18,'جدول '!$AK$6:$AK$23,0))=\"\",\"\",INDEX('جدول '!$U$6:$U$23,MATCH($I$18,'جدول '!$AK$6:$AK$23,0)))","v":""},{"$f":"IF(INDEX('جدول '!$V$6:$V$23,MATCH($I$18,'جدول '!$AK$6:$AK$23,0))=\"\",\"\",INDEX('جدول '!$V$6:$V$23,MATCH($I$18,'جدول '!$AK$6:$AK$23,0)))","v":""}]
[null,"الأربعاء",{"$f":"IF(INDEX('جدول '!$W$6:$W$23,MATCH($I$18,'جدول '!$AK$6:$AK$23,0))=\"\",\"\",INDEX('جدول '!$W$6:$W$23,MATCH($I$18,'جدول '!$AK$6:$AK$23,0)))","v":""},{"$f":"IF(INDEX('جدول '!$X$6:$X$23,MATCH($I$18,'جدول '!$AK$6:$AK$23,0))=\"\",\"\",INDEX('جدول '!$X$6:$X$23,MATCH($I$18,'جدول '!$AK$6:$AK$23,0)))","v":""},{"$f":"IF(INDEX('جدول '!$Y$6:$Y$23,MATCH($I$18,'جدول '!$AK$6:$AK$23,0))=\"\",\"\",INDEX('جدول '!$Y$6:$Y$23,MATCH($I$18,'جدول '!$AK$6:$AK$23,0)))","v":""},{"$f":"IF(INDEX('جدول '!$Z$6:$Z$23,MATCH($I$18,'جدول '!$AK$6:$AK$23,0))=\"\",\"\",INDEX('جدول '!$Z$6:$Z$23,MATCH($I$18,'جدول '!$AK$6:$AK$23,0)))","v":"٢-٢"},{"$f":"IF(INDEX('جدول '!$AA$6:$AA$23,MATCH($I$18,'جدول '!$AK$6:$AK$23,0))=\"\",\"\",INDEX('جدول '!$AA$6:$AA$23,MATCH($I$18,'جدول '!$AK$6:$AK$23,0)))","v":"٢-٢"},{"$f":"IF(INDEX('جدول '!$AB$6:$AB$23,MATCH($I$18,'جدول '!$AK$6:$AK$23,0))=\"\",\"\",INDEX('جدول '!$AB$6:$AB$23,MATCH($I$18,'جدول '!$AK$6:$AK$23,0)))","v":"١-٢"},{"$f":"IF(INDEX('جدول '!$AC$6:$AC$23,MATCH($I$18,'جدول '!$AK$6:$AK$23,0))=\"\",\"\",INDEX('جدول '!$AC$6:$AC$23,MATCH($I$18,'جدول '!$AK$6:$AK$23,0)))","v":"١-٢"}]
[null,"الخميس",{"$f":"IF(INDEX('جدول '!$AD$6:$AD$23,MATCH($I$18,'جدول '!$AK$6:$AK$23,0))=\"\",\"\",INDEX('جدول '!$AD$6:$AD$23,MATCH($I$18,'جدول '!$AK$6:$AK$23,0)))","v":"٢-٢"},{"$f":"IF(INDEX('جدول '!$AE$6:$AE$23,MATCH($I$18,'جدول '!$AK$6:$AK$23,0))=\"\",\"\",INDEX('جدول '!$AE$6:$AE$23,MATCH($I$18,'جدول '!$AK$6:$AK$23,0)))","v":"٢-٢"},{"$f":"IF(INDEX('جدول '!$AF$6:$AF$23,MATCH($I$18,'جدول '!$AK$6:$AK$23,0))=\"\",\"\",INDEX('جدول '!$AF$6:$AF$23,MATCH($I$18,'جدول '!$AK$6:$AK$23,0)))","v":"١-٢"},{"$f":"IF(INDEX('جدول '!$AG$6:$AG$23,MATCH($I$18,'جدول '!$AK$6:$AK$23,0))=\"\",\"\",INDEX('جدول '!$AG$6:$AG$23,MATCH($I$18,'جدول '!$AK$6:$AK$23,0)))","v":"١-٢"},{"$f":"IF(INDEX('جدول '!$AH$6:$AH$23,MATCH($I$18,'جدول '!$AK$6:$AK$23,0))=\"\",\"\",INDEX('جدول '!$AH$6:$AH$23,MATCH($I$18,'جدول '!$AK$6:$AK$23,0)))","v":"١-٢"},{"$f":"IF(INDEX('جدول '!$AI$6:$AI$23,MATCH($I$18,'جدول '!$AK$6:$AK$23,0))=\"\",\"\",INDEX('جدول '!$AI$6:$AI$23,MATCH($I$18,'جدول '!$AK$6:$AK$23,0)))","v":""},{"$f":"IF(INDEX('جدول '!$AJ$6:$AJ$23,MATCH($I$18,'جدول '!$AK$6:$AK$23,0))=\"\",\"\",INDEX('جدول '!$AJ$6:$AJ$23,MATCH($I$18,'جدول '!$AK$6:$AK$23,0)))","v":""}]
[null,null,"مسئول الجدول",null,"إنشاء الجدول",null,null,"مدير المدرسة"]
[null,null,null,null,{"$f":"NOW()","v":"2025-04-28T21:56:39.140"}]
[]
[]
[null,"ادارة ",null,"جداول المعلمين",null,"العام الدراسي",null,"2025 - 2024"]
[null,"مدرسة",null,{"$f":"INDEX('جدول '!$A$6:$A$23,MATCH($I$30,'جدول '!$AK$6:$AK$23,0))","v":"s3"},null,null,null,{"$f":"VLOOKUP($M$2+1,'جدول '!$AK$6:$AO$23,4,0)","v":"عربي"},{"$f":"$M$2+2","v":3}]
[null,null,"الأولى","الثانية","الثالثة","الرابعة","الخامسة","السادسة","السابعة"]
[null,"الأحد",{"$f":"IF(INDEX('جدول '!$B$6:$B$23,MATCH($I$30,'جدول '!$AK$6:$AK$23,0))=\"\",\"\",INDEX('جدول '!$B$6:$B$23,MATCH($I$30,'جدول '!$AK$6:$AK$23,0)))","v":""},{"$f":"IF(INDEX('جدول '!$C$6:$C$23,MATCH($I$30,'جدول '!$AK$6:$AK$23,0))=\"\",\"\",INDEX('جدول '!$C$6:$C$23,MATCH($I$30,'جدول '!$AK$6:$AK$23,0)))","v":""},{"$f":"IF(INDEX('جدول '!$D$6:$D$23,MATCH($I$30,'جدول '!$AK$6:$AK$23,0))=\"\",\"\",INDEX('جدول '!$D$6:$D$23,MATCH($I$30,'جدول '!$AK$6:$AK$23,0)))","v":""},{"$f":"IF(INDEX('جدول '!$E$6:$E$23,MATCH($I$30,'جدول '!$AK$6:$AK$23,0))=\"\",\"\",INDEX('جدول '!$E$6:$E$23,MATCH($I$30,'جدول '!$AK$6:$AK$23,0)))","v":""},{"$f":"IF(INDEX('جدول '!$F$6:$F$23,MATCH($I$30,'جدول '!$AK$6:$AK$23,0))=\"\",\"\",INDEX('جدول '!$F$6:$F$23,MATCH($I$30,'جدول '!$AK$6:$AK$23,0)))","v":""},{"$f":"IF(INDEX('جدول '!$G$6:$G$23,MATCH($I$30,'جدول '!$AK$6:$AK$23,0))=\"\",\"\",INDEX('جدول '!$G$6:$G$23,MATCH($I$30,'جدول '!$AK$6:$AK$23,0)))","v":""},{"$f":"IF(INDEX('جدول '!$H$6:$H$23,MATCH($I$30,'جدول '!$AK$6:$AK$23,0))=\"\",\"\",INDEX('جدول '!$H$6:$H$23,MATCH($I$30,'جدول '!$AK$6:$AK$23,0)))","v":""}]
[null,"الإثنين",{"$f":"IF(INDEX('جدول '!$I$6:$I$23,MATCH($I$30,'جدول '!$AK$6:$AK$23,0))=\"\",\"\",INDEX('جدول '!$I$6:$I$23,MATCH($I$30,'جدول '!$AK$6:$AK$23,0)))","v":""},{"$f":"IF(INDEX('جدول '!$J$6:$J$23,MATCH($I$30,'جدول '!$AK$6:$AK$23,0))=\"\",\"\",INDEX('جدول '!$J$6:$J$23,MATCH($I$30,'جدول '!$AK$6:$AK$23,0)))","v":""},{"$f":"IF(INDEX('جدول '!$K$6:$K$23,MATCH($I$30,'جدول '!$AK$6:$AK$23,0))=\"\",\"\",INDEX('جدول '!$K$6:$K$23,MATCH($I$30,'جدول '!$AK$6:$AK$23,0)))","v":"٢-١"},{"$f":"IF(INDEX('جدول '!$L$6:$L$23,MATCH($I$30,'جدول '!$AK$6:$AK$23,0))=\"\",\"\",INDEX('جدول '!$L$6:$L$23,MATCH($I$30,'جدول '!$AK$6:$AK$23,0)))","v":"٢-١"},{"$f":"IF(INDEX('جدول '!$M$6:$M$23,MATCH($I$30,'جدول '!$AK$6:$AK$23,0))=\"\",\"\",INDEX('جدول '!$M$6:$M$23,MATCH($I$30,'جدول '!$AK$6:$AK$23,0)))","v":"٢-١"},{"$f":"IF(INDEX('جدول '!$N$6:$N$23,MATCH($I$30,'جدول '!$AK$6:$AK$23,0))=\"\",\"\",INDEX('جدول '!$N$6:$N$23,MATCH($I$30,'جدول '!$AK$6:$AK$23,0)))","v":"٢-١"},{"$f":"IF(INDEX('جدول '!$O$6:$O$23,MATCH($I$30,'جدول '!$AK$6:$AK$23,0))=\"\",\"\",INDEX('جدول '!$O$6:$O$23,MATCH($I$30,'جدول '!$AK$6:$AK$23,0)))","v":"٢-١"}]
[null,"الثلاثاء",{"$f":"IF(INDEX('جدول '!$P$6:$P$23,MATCH($I$30,'جدول '!$AK$6:$AK$23,0))=\"\",\"\",INDEX('جدول '!$P$6:$P$23,MATCH($I$30,'جدول '!$AK$6:$AK$23,0)))","v":""},{"$f":"IF(INDEX('جدول '!$Q$6:$Q$23,MATCH($I$30,'جدول '!$AK$6:$AK$23,0))=\"\",\"\",INDEX('جدول '!$Q$6:$Q$23,MATCH($I$30,'جدول '!$AK$6:$AK$23,0)))","v":""},{"$f":"IF(INDEX('جدول '!$R$6:$R$23,MATCH($I$30,'جدول '!$AK$6:$AK$23,0))=\"\",\"\",INDEX('جدول '!$R$6:$R$23,MATCH($I$30,'جدول '!$AK$6:$AK$23,0)))","v":""},{"$f":"IF(INDEX('جدول '!$S$6:$S$23,MATCH($I$30,'جدول '!$AK$6:$AK$23,0))=\"\",\"\",INDEX('جدول '!$S$6:$S$23,MATCH($I$30,'جدول '!$AK$6:$AK$23,0)))","v":""},{"$f":"IF(INDEX('جدول '!$T$6:$T$23,MATCH($I$30,'جدول '!$AK$6:$AK$23,0))=\"\",\"\",INDEX('جدول '!$T$6:$T$23,MATCH($I$30,'جدول '!$AK$6:$AK$23,0)))","v":""},{"$f":"IF(INDEX('جدول '!$U$6:$U$23,MATCH($I$30,'جدول '!$AK$6:$AK$23,0))=\"\",\"\",INDEX('جدول '!$U$6:$U$23,MATCH($I$30,'جدول '!$AK$6:$AK$23,0)))","v":""},{"$f":"IF(INDEX('جدول '!$V$6:$V$23,MATCH($I$30,'جدول '!$AK$6:$AK$23,0))=\"\",\"\",INDEX('جدول '!$V$6:$V$23,MATCH($I$30,'جدول '!$AK$6:$AK$23,0)))","v":""}]
[null,"الأربعاء",{"$f":"IF(INDEX('جدول '!$W$6:$W$23,MATCH($I$30,'جدول '!$AK$6:$AK$23,0))=\"\",\"\",INDEX('جدول '!$W$6:$W$23,MATCH($I$30,'جدول '!$AK$6:$AK$23,0)))","v":"٢-١"},{"$f":"IF(INDEX('جدول '!$X$6:$X$23,MATCH($I$30,'جدول '!$AK$6:$AK$23,0))=\"\",\"\",INDEX('جدول '!$X$6:$X$23,MATCH($I$30,'جدول '!$AK$6:$AK$23,0)))","v":"٢-١"},{"$f":"IF(INDEX('جدول '!$Y$6:$Y$23,MATCH($I$30,'جدول '!$AK$6:$AK$23,0))=\"\",\"\",INDEX('جدول '!$Y$6:$Y$23,MATCH($I$30,'جدول '!$AK$6:$AK$23,0)))","v":"٢-١"},{"$f":"IF(INDEX('جدول '!$Z$6:$Z$23,MATCH($I$30,'جدول '!$AK$6:$AK$23,0))=\"\",\"\",INDEX('جدول '!$Z$6:$Z$23,MATCH($I$30,'جدول '!$AK$6:$AK$23,0)))","v":"٢-١"},{"$f":"IF(INDEX('جدول '!$AA$6:$AA$23,MATCH($I$30,'جدول '!$AK$6:$AK$23,0))=\"\",\"\",INDEX('جدول '!$AA$6:$AA$23,MATCH($I$30,'جدول '!$AK$6:$AK$23,0)))","v":"٢-١"},{"$f":"IF(INDEX('جدول '!$AB$6:$AB$23,MATCH($I$30,'جدول '!$AK$6:$AK$23,0))=\"\",\"\",INDEX('جدول '!$AB$6:$AB$23,MATCH($I$30,'جدول '!$AK$6:$AK$23,0)))","v":""},{"$f":"IF(INDEX('جدول '!$AC$6:$AC$23,MATCH($I$30,'جدول '!$AK$6:$AK$23,0))=\"\",\"\",INDEX('جدول '!$AC$6:$AC$23,MATCH($I$30,'جدول '!$AK$6:$AK$23,0)))","v":""}]
[null,"الخميس",{"$f":"IF(INDEX('جدول '!$AD$6:$AD$23,MATCH($I$30,'جدول '!$AK$6:$AK$23,0))=\"\",\"\",INDEX('جدول '!$AD$6:$AD$23,MATCH($I$30,'جدول '!$AK$6:$AK$23,0)))","v":""},{"$f":"IF(INDEX('جدول '!$AE$6:$AE$23,MATCH($I$30,'جدول '!$AK$6:$AK$23,0))=\"\",\"\",INDEX('جدول '!$AE$6:$AE$23,MATCH($I$30,'جدول '!$AK$6:$AK$23,0)))","v":""},{"$f":"IF(INDEX('جدول '!$AF$6:$AF$23,MATCH($I$30,'جدول '!$AK$6:$AK$23,0))=\"\",\"\",INDEX('جدول '!$AF$6:$AF$23,MATCH($I$30,'جدول '!$AK$6:$AK$23,0)))","v":""},{"$f":"IF(INDEX('جدول '!$AG$6:$AG$23,MATCH($I$30,'جدول '!$AK$6:$AK$23,0))=\"\",\"\",INDEX('جدول '!$AG$6:$AG$23,MATCH($I$30,'جدول '!$AK$6:$AK$23,0)))","v":""},{"$f":"IF(INDEX('جدول '!$AH$6:$AH$23,MATCH($I$30,'جدول '!$AK$6:$AK$23,0))=\"\",\"\",INDEX('جدول '!$AH$6:$AH$23,MATCH($I$30,'جدول '!$AK$6:$AK$23,0)))","v":""},{"$f":"IF(INDEX('جدول '!$AI$6:$AI$23,MATCH($I$30,'جدول '!$AK$6:$AK$23,0))=\"\",\"\",INDEX('جدول '!$AI$6:$AI$23,MATCH($I$30,'جدول '!$AK$6:$AK$23,0)))","v":""},{"$f":"IF(INDEX('جدول '!$AJ$6:$AJ$23,MATCH($I$30,'جدول '!$AK$6:$AK$23,0))=\"\",\"\",INDEX('جدول '!$AJ$6:$AJ$23,MATCH($I$30,'جدول '!$AK$6:$AK$23,0)))","v":""}]
[null,null,"مسئول الجدول",null,"إنشاء الجدول",null,null,"مدير المدرسة"]
[null,null,null,null,{"$f":"NOW()","v":"2025-04-28T21:56:39.140"}]