{"text_format":"1","workbook":"xlsx","n_sheets":6,"sheets":["list","العملاء ايداع ورد","vonder","ايداع وصرف جارى الشركاء","صرف ورد المصروفات ","الخزينة"],"not_rendered":{"charts":0,"images":0,"macros":1,"external_links":0,"defined_names":1,"comments":0,"pivot_tables":0},"unopened":[],"bounds":{"document_bytes":16777216,"sheet_cells":100000,"rows_first":2000,"rows_last":500,"rows_between":2000,"halvings":0,"cell_chars":16384,"cell_head_chars":4096},"cells_cut":0,"cells_raw":0,"read":"whole","date_system":"1900"}

{"sheet":"list","index":0,"n_rows":27,"n_cols":11,"rows_kept":27,"cut":false,"hidden":false,"merged":[]}
[]
[]
[null,"الموردين","العملاء","جارى الشركاء","المصروفات",null,null,"النقدية وما فى حكمها","تاريخ","الرصيد","نوع الصرف"]
[null,1,"رضا","رمضان","مرتبات",null,null,"الحزينة","2024-12-31",5050,"نقدا"]
[null,2,"محمد ","اسلام","هبة  وعديات",null,null,"بنك مصر","2024-12-31",35025,"شيك"]
[null,3,"ربيع","مصطفى","كهرباء",null,null,"بنك القاهرة","2024-12-31",25,"تحويل بنكى"]
[null,4,"محمود","على","مياه",null,null,"بنك الاهلى","2024-12-31",256]
[null,5,"مصطفى","احمد","غاز",null,null,"بنك cip","2024-12-31",6584]
[null,6,null,"ش6","تليفوانات",null,null,"بنك qnp","2024-12-31",220]
[null,7,null,"ش7","انتر نت"]
[null,8,null,"ش8","كارتات"]
[null,9,null,"ش9","سولار"]
[null,10,null,"ش10","بنزين"]
[null,11,null,"ش11","اصلاحات"]
[null,12,null,"ش12"]
[null,13,null,"ش13"]
[null,14,null,"ش14"]
[null,15,null,"ش15"]
[null,16,null,"ش16"]
[null,17,null,"ش17"]
[null,18,null,"ش18"]
[null,19]
[null,20]
[null,21]
[null,22]
[null,23]
[null,24]

{"sheet":"العملاء ايداع ورد","index":1,"n_rows":122,"n_cols":19,"rows_kept":122,"cut":false,"hidden":false,"merged":[]}
[]
[1,2,3,4,5,6,7,8,9,9]
[null,"م","التاريخ","رقم الاذن الإيداع والرد","نوع الصرف","اسم العميل","ايداع الى ورد من","البيان","إيداع","رد",null,null,null,null,null,null,null,"اسم العميل1","منصرف من"]
[null,1,"2025-01-01","0035","نقدا","محمود","الحزينة","قيمة فاتورة رقم 1",5000,null,null,null,null,null,null,null,null,{"$f":"_xlfn._xlws.SORT(_xlfn._xlws.FILTER(list!$C$4:$C$2700,ISNUMBER(SEARCH(F4,list!$C$4:$C$2700)),\"No Results\"))","v":"محمود"},{"$f":"_xlfn._xlws.SORT(_xlfn._xlws.FILTER(list!$H$4:$H$2700,ISNUMBER(SEARCH(G4,list!$H$4:$H$2700)),\"No Results\"))","v":"الحزينة"}]
[null,{"$f":"+B4+1","v":2},"2025-01-02","0036","شيك","محمد ","بنك مصر","قيمة فاتورة رقم 2",3500]
[null,{"$f":"+B5+1","v":3},"2025-01-03","0037","تحويل بنكى","مصطفى","بنك القاهرة","قيمة فاتورة رقم 3",5200]
[null,4,"2025-01-04","0038","نقدا","ربيع","بنك الاهلى","قيمة فاتورة رقم 4",520]
[null,5,"2025-01-05","0039","شيك","رضا","بنك cip","قيمة فاتورة رقم 5",6850]
[null,6,"2025-01-06","0040","تحويل بنكى","محمود","الحزينة","قيمة فاتورة رقم 6",4850]
[null,7,"2025-01-07","0041","نقدا","محمد ","بنك مصر","قيمة فاتورة رقم 7",23650]
[null,8,"2025-01-08","0042","شيك","محمود","بنك القاهرة","قيمة فاتورة رقم 8",2205]
[null,9,"2025-01-09","0043","تحويل بنكى","محمد ","بنك الاهلى","قيمة فاتورة رقم 9",3652]
[null,10,"2025-01-10","0044","نقدا","مصطفى","بنك cip","قيمة فاتورة رقم 10",25000]
[null,11,"2025-01-11","0045","شيك","ربيع","الحزينة","قيمة فاتورة رقم 11",2500]
[null,12,"2025-01-15","01022","تحويل بنكى","محمود","الحزينة","رد للعميل ",null,1500]
[null,13,"2025-01-16","01023","نقدا","محمد ","بنك مصر","رد للعميل ",null,120]
[null,14,"2025-01-17","01024","شيك","مصطفى","بنك القاهرة","رد للعميل ",null,130]
[null,15,"2025-01-18","01025","تحويل بنكى","ربيع","بنك الاهلى","رد للعميل ",null,1400]
[null,16,"2025-01-19","01026","نقدا","رضا","بنك cip","رد للعميل ",null,1500]
[null,17,"2025-01-20","01027","شيك","محمود","الحزينة","رد للعميل ",null,1300]
[null,18,"2025-01-01","0035","نقدا","محمود","الحزينة","قيمة فاتورة رقم 1",5000]
[null,19,"2025-01-02","0036","شيك","محمد ","بنك مصر","قيمة فاتورة رقم 2",3500]
[null,20,"2025-01-03","0037","تحويل بنكى","مصطفى","بنك القاهرة","قيمة فاتورة رقم 3",5200]
[null,21,"2025-01-04","0038","نقدا","ربيع","بنك الاهلى","قيمة فاتورة رقم 4",520]
[null,22,"2025-01-05","0039","شيك","رضا","بنك cip","قيمة فاتورة رقم 5",6850]
[null,23,"2025-01-06","0040","تحويل بنكى","محمود","الحزينة","قيمة فاتورة رقم 6",4850]
[null,24,"2025-01-07","0041","نقدا","محمد ","بنك مصر","قيمة فاتورة رقم 7",23650]
[null,25,"2025-01-08","0042","شيك","محمود","بنك القاهرة","قيمة فاتورة رقم 8",2205]
[null,26,"2025-01-09","0043","تحويل بنكى","محمد ","بنك الاهلى","قيمة فاتورة رقم 9",3652]
[null,27,"2025-01-10","0044","نقدا","مصطفى","بنك cip","قيمة فاتورة رقم 10",25000]
[null,28,"2025-01-11","0045","شيك","ربيع","الحزينة","قيمة فاتورة رقم 11",2500]
[null,29,"2025-01-15","01022","تحويل بنكى","محمود","الحزينة","رد للعميل ",null,1500]
[null,30,"2025-01-16","01023","نقدا","محمد ","بنك مصر","رد للعميل ",null,120]
[null,31,"2025-01-17","01024","شيك","مصطفى","بنك القاهرة","رد للعميل ",null,130]
[null,32,"2025-01-18","01025","تحويل بنكى","ربيع","بنك الاهلى","رد للعميل ",null,1400]
[null,33,"2025-01-19","01026","نقدا","رضا","بنك cip","رد للعميل ",null,1500]
[null,34,"2025-01-20","01027","شيك","محمود","الحزينة","رد للعميل ",null,1300]
[null,35,"2025-01-01","0035","نقدا","محمود","الحزينة","قيمة فاتورة رقم 1",5000]
[null,36,"2025-01-02","0036","شيك","محمد ","بنك مصر","قيمة فاتورة رقم 2",3500]
[null,37,"2025-01-03","0037","تحويل بنكى","مصطفى","بنك القاهرة","قيمة فاتورة رقم 3",5200]
{"$rows_left_out":83}
{"sheet":"vonder","index":2,"n_rows":105,"n_cols":16,"rows_kept":105,"cut":false,"hidden":false,"merged":[]}
[]
[1,2,3,4,5,6,7,8,9,9]
[null,"م","التاريخ","رقم الاذن","نوع الصرف","اسم المورد","صرف من","البيان","إيداع","رد",null,null,null,null,"اسم المورد","منصرف من"]
[null,1,"2025-01-01","0035","نقدا","على","الحزينة","قيمة فاتورة شراء رقم 1",5000,null,null,null,null,null,{"$f":"_xlfn._xlws.SORT(_xlfn._xlws.FILTER(list!$B$4:$B$2700,ISNUMBER(SEARCH(F4,list!$B$4:$B$2700)),\"No Results\"))","v":"No Results"},{"$f":"_xlfn._xlws.SORT(_xlfn._xlws.FILTER(list!$H$4:$H$2700,ISNUMBER(SEARCH(G4,list!$H$4:$H$2700)),\"No Results\"))","v":"الحزينة"}]
[null,{"$f":"+B4+1","v":2},"2025-01-02","0036","شيك","احمد","بنك مصر","قيمة فاتورة شراء رقم 2",3500]
[null,{"$f":"+B5+1","v":3},"2025-01-03","0037","تحويل بنكى","عبد الله","بنك القاهرة","قيمة فاتورة شراء رقم 3",5200]
[null,4,"2025-01-04","0038","نقدا","عطية","بنك الاهلى","قيمة فاتورة شراء رقم 4",520]
[null,5,"2025-01-05","0039","شيك","على","بنك cip","قيمة فاتورة شراء رقم 5",6850]
[null,6,"2025-01-06","0040","تحويل بنكى","احمد","الحزينة","قيمة فاتورة شراء رقم 6",4850]
[null,7,"2025-01-07","0041","نقدا","عبد الله","بنك مصر","قيمة فاتورة شراء رقم 7",23650]
[null,8,"2025-01-08","0042","شيك","عطية","بنك القاهرة","قيمة فاتورة شراء رقم 8",2205]
[null,9,"2025-01-09","0043","تحويل بنكى","على","بنك الاهلى","قيمة فاتورة شراء رقم 9",3652]
[null,10,"2025-01-10","0044","نقدا","احمد","بنك cip","قيمة فاتورة شراء رقم 10",25000]
[null,11,"2025-01-11","0045","شيك","عبد الله","الحزينة","قيمة فاتورة شراء رقم 11",2500]
[null,12,"2025-01-15","01022","تحويل بنكى","عطية","الحزينة","رد للمورد ",null,1500]
[null,13,"2025-01-16","01023","نقدا","على","بنك مصر","رد للمورد ",null,120]
[null,14,"2025-01-17","01024","شيك","احمد","بنك القاهرة","رد للمورد ",null,130]
[null,15,"2025-01-18","01025","تحويل بنكى","عبد الله","بنك الاهلى","رد للمورد ",null,1400]
[null,16,"2025-01-19","01026","نقدا","عطية","بنك cip","رد للمورد ",null,1500]
[null,17,"2025-01-20","01027","شيك","على","الحزينة","رد للمورد ",null,1300]
[null,null,"2025-01-01","0035","نقدا","على","الحزينة","قيمة فاتورة شراء رقم 1",5000]
[null,null,"2025-01-02","0036","شيك","احمد","بنك مصر","قيمة فاتورة شراء رقم 2",3500]
[null,null,"2025-01-03","0037","تحويل بنكى","عبد الله","بنك القاهرة","قيمة فاتورة شراء رقم 3",5200]
[null,null,"2025-01-04","0038","نقدا","عطية","بنك الاهلى","قيمة فاتورة شراء رقم 4",520]
[null,null,"2025-01-05","0039","شيك","على","بنك cip","قيمة فاتورة شراء رقم 5",6850]
[null,null,"2025-01-06","0040","تحويل بنكى","احمد","الحزينة","قيمة فاتورة شراء رقم 6",4850]
[null,null,"2025-01-07","0041","نقدا","عبد الله","بنك مصر","قيمة فاتورة شراء رقم 7",23650]
[null,null,"2025-01-08","0042","شيك","عطية","بنك القاهرة","قيمة فاتورة شراء رقم 8",2205]
[null,null,"2025-01-09","0043","تحويل بنكى","على","بنك الاهلى","قيمة فاتورة شراء رقم 9",3652]
[null,null,"2025-01-10","0044","نقدا","احمد","بنك cip","قيمة فاتورة شراء رقم 10",25000]
[null,null,"2025-01-11","0045","شيك","عبد الله","الحزينة","قيمة فاتورة شراء رقم 11",2500]
[null,null,"2025-01-15","01022","تحويل بنكى","عطية","الحزينة","رد للمورد ",null,1500]
[null,null,"2025-01-16","01023","نقدا","على","بنك مصر","رد للمورد ",null,120]
[null,null,"2025-01-17","01024","شيك","احمد","بنك القاهرة","رد للمورد ",null,130]
[null,null,"2025-01-18","01025","تحويل بنكى","عبد الله","بنك الاهلى","رد للمورد ",null,1400]
[null,null,"2025-01-19","01026","نقدا","عطية","بنك cip","رد للمورد ",null,1500]
[null,null,"2025-01-20","01027","شيك","على","الحزينة","رد للمورد ",null,1300]
[null,null,"2025-01-01","0035","نقدا","على","الحزينة","قيمة فاتورة شراء رقم 1",5000]
[null,null,"2025-01-02","0036","شيك","احمد","بنك مصر","قيمة فاتورة شراء رقم 2",3500]
[null,null,"2025-01-03","0037","تحويل بنكى","عبد الله","بنك القاهرة","قيمة فاتورة شراء رقم 3",5200]
{"$rows_left_out":66}
{"sheet":"ايداع وصرف جارى الشركاء","index":3,"n_rows":122,"n_cols":19,"rows_kept":122,"cut":false,"hidden":false,"merged":[]}
[]
[1,2,3,4,5,6,7,8,9,9]
[null,"م","التاريخ","رقم الاذن","نوع الصرف","اسم الشريك","إيداع الى","البيان","إيداع","رد",null,null,null,null,null,null,null,"اسم الشريك","منصرف من"]
[null,null,"2025-01-01","0035","نقدا","احمد","الحزينة","إيداع",5000,null,null,null,null,null,null,null,null,{"$f":"_xlfn._xlws.SORT(_xlfn._xlws.FILTER(list!$D$4:$D$2700,ISNUMBER(SEARCH(F4,list!$D$4:$D$2700)),\"No Results\"))","v":"احمد"},{"$f":"_xlfn._xlws.SORT(_xlfn._xlws.FILTER(list!$H$4:$H$2700,ISNUMBER(SEARCH(G4,list!$H$4:$H$2700)),\"No Results\"))","v":"الحزينة"}]
[null,null,"2025-01-02","0036","شيك","رمضان","بنك مصر","إيداع",3500]
[null,null,"2025-01-03","0037","تحويل بنكى","احمد","بنك القاهرة","إيداع",5200]
[null,null,"2025-01-04","0038","نقدا","مصطفى","بنك الاهلى","إيداع",520]
[null,null,"2025-01-05","0039","شيك","احمد","بنك cip","إيداع",6850]
[null,null,"2025-01-06","0040","تحويل بنكى","ش6","الحزينة","إيداع",4850]
[null,null,"2025-01-07","0041","نقدا","ش14","بنك مصر","إيداع",23650]
[null,null,"2025-01-08","0042","شيك","رمضان","بنك القاهرة","إيداع",2205]
[null,null,"2025-01-09","0043","تحويل بنكى","احمد","بنك الاهلى","إيداع",3652]
[null,null,"2025-01-10","0044","نقدا","على","بنك cip","إيداع",25000]
[null,null,"2025-01-11","0045","شيك","اسلام","الحزينة","إيداع",2500]
[null,null,"2025-01-15","01022","تحويل بنكى","مصطفى","الحزينة","سحب",null,1500]
[null,null,"2025-01-16","01023","نقدا","اسلام","بنك مصر","سحب",null,120]
[null,null,"2025-01-17","01024","شيك","احمد","بنك القاهرة","سحب",null,130]
[null,null,"2025-01-18","01025","تحويل بنكى","مصطفى","بنك الاهلى","سحب",null,1400]
[null,null,"2025-01-19","01026","نقدا","احمد","بنك cip","سحب",null,1500]
[null,null,"2025-01-20","01027","شيك","ش7","الحزينة","سحب",null,1300]
[null,null,"2025-01-01","0035","نقدا","احمد","الحزينة","إيداع",5000]
[null,null,"2025-01-02","0036","شيك","رمضان","بنك مصر","إيداع",3500]
[null,null,"2025-01-03","0037","تحويل بنكى","احمد","بنك القاهرة","إيداع",5200]
[null,null,"2025-01-04","0038","نقدا","مصطفى","بنك الاهلى","إيداع",520]
[null,null,"2025-01-05","0039","شيك","احمد","بنك cip","إيداع",6850]
[null,null,"2025-01-06","0040","تحويل بنكى","ش6","الحزينة","إيداع",4850]
[null,null,"2025-01-07","0041","نقدا","ش14","بنك مصر","إيداع",23650]
[null,null,"2025-01-08","0042","شيك","رمضان","بنك القاهرة","إيداع",2205]
[null,null,"2025-01-09","0043","تحويل بنكى","احمد","بنك الاهلى","إيداع",3652]
[null,null,"2025-01-10","0044","نقدا","على","بنك cip","إيداع",25000]
[null,null,"2025-01-11","0045","شيك","اسلام","الحزينة","إيداع",2500]
[null,null,"2025-01-15","01022","تحويل بنكى","مصطفى","الحزينة","سحب",null,1500]
[null,null,"2025-01-16","01023","نقدا","اسلام","بنك مصر","سحب",null,120]
[null,null,"2025-01-17","01024","شيك","احمد","بنك القاهرة","سحب",null,130]
[null,null,"2025-01-18","01025","تحويل بنكى","مصطفى","بنك الاهلى","سحب",null,1400]
[null,null,"2025-01-19","01026","نقدا","احمد","بنك cip","سحب",null,1500]
[null,null,"2025-01-20","01027","شيك","ش7","الحزينة","سحب",null,1300]
[null,null,"2025-01-01","0035","نقدا","احمد","الحزينة","إيداع",5000]
[null,null,"2025-01-02","0036","شيك","رمضان","بنك مصر","إيداع",3500]
[null,null,"2025-01-03","0037","تحويل بنكى","احمد","بنك القاهرة","إيداع",5200]
{"$rows_left_out":83}
{"sheet":"صرف ورد المصروفات ","index":4,"n_rows":637,"n_cols":19,"rows_kept":637,"cut":false,"hidden":false,"merged":[]}
[]
[1,2,3,4,5,6,7,8,9]
[null,"م","التاريخ","رقم الاذن","نوع الصرف","اسم المورد","منصرف من","نوع المصروف","قيمة الصرف",null,null,null,null,null,null,null,null,"نوع المصروف","منصرف من"]
[null,{"$f":"IF(D4<>\"\",1,\"\")","v":1},"2025-01-01","0035","نقدا","على","الحزينة","مرتبات",20000,null,null,null,null,null,null,null,null,{"$f":"_xlfn._xlws.SORT(_xlfn._xlws.FILTER(list!$E$4:$E$2700,ISNUMBER(SEARCH(G4,list!$E$4:$E$2700)),\"No Results\"))","v":"No Results"},{"$f":"_xlfn._xlws.SORT(_xlfn._xlws.FILTER(list!$H$4:$H$2700,ISNUMBER(SEARCH(G4,list!$H$4:$H$2700)),\"No Results\"))","v":"الحزينة"}]
[null,{"$f":"IF(D5<>\"\",1+B4,\"\")","v":2},"2025-01-02","0036","شيك","احمد","بنك مصر","هبة  وعديات",5000]
[null,{"$f":"IF(D6<>\"\",1+B5,\"\")","v":3},"2025-01-03","0037","تحويل بنكى","عبد الله","بنك القاهرة","كهرباء",6000]
[null,4,"2025-01-04","0038","نقدا","عطية","بنك الاهلى","مياه",520,null,null,null,null,{"$f":"COUNTA($B$4:B4)","v":1}]
[null,5,"2025-01-05","0039","شيك","على","بنك cip","غاز",250]
[null,6,"2025-01-06","0040","تحويل بنكى","احمد","الحزينة","كارتات",560]
[null,7,"2025-01-07","0041","نقدا","عبد الله","بنك مصر","هبة  وعديات",2523]
[null,8,"2025-01-08","0042","شيك","عطية","بنك القاهرة","كهرباء",225]
[null,9,"2025-01-09","0043","تحويل بنكى","على","بنك الاهلى","مياه",225]
[null,10,"2025-01-10","0044","نقدا","احمد","بنك cip","غاز",232]
[null,11,"2025-01-11","0045","شيك","عبد الله","الحزينة","انتر نت",650]
[null,12,"2025-01-15","01022","تحويل بنكى","عطية","الحزينة","هبة  وعديات",225]
[null,13,"2025-01-16","01023","نقدا","على","بنك مصر","كهرباء",225]
[null,14,"2025-01-17","01024","شيك","احمد","بنك القاهرة","مياه",232]
[null,15,"2025-01-18","01025","تحويل بنكى","عبد الله","بنك الاهلى","غاز",650]
[null,16,"2025-01-19","01026","نقدا","عطية","بنك cip","اصلاحات",232]
[null,17,"2025-01-20","01027","شيك","على","الحزينة","بنزين",650]
[null,18,"2025-01-01","0035","نقدا","على","الحزينة","مرتبات",20000]
[null,19,"2025-01-02","0036","شيك","احمد","بنك مصر","هبة  وعديات",5000]
[null,20,"2025-01-03","0037","تحويل بنكى","عبد الله","بنك القاهرة","كهرباء",6000]
[null,21,"2025-01-04","0038","نقدا","عطية","بنك الاهلى","مياه",520]
[null,22,"2025-01-05","0039","شيك","على","بنك cip","غاز",250]
[null,23,"2025-01-06","0040","تحويل بنكى","احمد","الحزينة","كارتات",560]
[null,24,"2025-01-07","0041","نقدا","عبد الله","بنك مصر","هبة  وعديات",2523]
[null,25,"2025-01-08","0042","شيك","عطية","بنك القاهرة","كهرباء",225]
[null,26,"2025-01-09","0043","تحويل بنكى","على","بنك الاهلى","مياه",225]
[null,27,"2025-01-10","0044","نقدا","احمد","بنك cip","غاز",232]
[null,28,"2025-01-11","0045","شيك","عبد الله","الحزينة","انتر نت",650]
[null,29,"2025-01-15","01022","تحويل بنكى","عطية","الحزينة","هبة  وعديات",225]
[null,30,"2025-01-16","01023","نقدا","على","بنك مصر","كهرباء",225]
[null,31,"2025-01-17","01024","شيك","احمد","بنك القاهرة","مياه",232]
[null,32,"2025-01-18","01025","تحويل بنكى","عبد الله","بنك الاهلى","غاز",650]
[null,33,"2025-01-19","01026","نقدا","عطية","بنك cip","اصلاحات",232]
[null,34,"2025-01-20","01027","شيك","على","الحزينة","بنزين",650]
[null,35,"2025-01-01","0035","نقدا","على","الحزينة","مرتبات",20000]
[null,36,"2025-01-02","0036","شيك","احمد","بنك مصر","هبة  وعديات",5000]
[null,37,"2025-01-03","0037","تحويل بنكى","عبد الله","بنك القاهرة","كهرباء",6000]
{"$rows_left_out":598}
{"sheet":"الخزينة","index":5,"n_rows":1000,"n_cols":17,"rows_kept":1000,"cut":false,"hidden":false,"merged":[[4,4,4,12],[6,6,7,6],[6,2,7,2],[6,3,7,3],[6,4,7,4],[6,5,7,5],[8,1,8,15],[6,1,7,1],[6,7,6,11],[6,12,6,15],[6,16,7,16]]}
[]
[null,null,null,null,null,null,null,"اسم الخزينة","بنك القاهرة"]
[null,null,null,null,null,null,null,"من تاريخ","2025-01-01"]
[null,null,null,null,null,null,null,"الى تاريخ","2025-01-15"]
[]
[null,2,"1900-01-03",4,5,6,7,8,9,10,11,12,13,14,15,16,17]
[null,"م","التاريخ","الاذن","نوع الصرف","الاسم","الييان","مــــــــــــــــــــــــديـــــــــــــــــــــــن",null,null,null,null,"دائــــــــــــــــــــــن",null,null,null,"الـــرصـــــيـــــد"]
[null,null,null,null,null,null,null,"رد عملاء","صرف للمورد","سحب شريك","مصروفات","الاجمالى الكلى ","إيداع  للعميل","رد مورد","ايداع جارى","الاجمالى الكلى"]
[null,"رصــــــــــــــــيــــــــــــــــــد افـــــــــــــتــــــــــــــــــتـــــــــــــــــــــــــــــــــــــاحــــــــــــــــــــــــــــــــــــــــــــــــــى",null,null,null,null,null,null,null,null,null,null,null,null,null,null,{"$f":"VLOOKUP($I$2,list!$H$4:$J$14,3,0)","v":25}]
[null,1,"2025-01-03",37,"تحويل بنكى","مصطفى","قيمة فاتورة رقم 3",5200,null,null,null,{"$f":"+H10+I10+K10+J10","v":5200},null,null,null,{"$f":"+M10+N10+O10","v":0},{"$f":"IF(C10=\"\",\"\",IFERROR(Q9+L10-P10,\"\"))","v":5225}]
[null,2,"2025-01-03",37,"تحويل بنكى","مصطفى","قيمة فاتورة رقم 3",5200,null,null,null,{"$f":"+H11+I11+K11+J11","v":5200},null,null,null,{"$f":"+M11+N11+O11","v":0},{"$f":"IF(C11=\"\",\"\",IFERROR(Q10+L11-P11,\"\"))","v":10425}]
[null,3,"2025-01-03",37,"تحويل بنكى","مصطفى","قيمة فاتورة رقم 3",5200,null,null,null,{"$f":"+H12+I12+K12+J12","v":5200},null,null,null,{"$f":"+M12+N12+O12","v":0},15625]
[null,4,"2025-01-03",37,"تحويل بنكى","مصطفى","قيمة فاتورة رقم 3",5200,null,null,null,{"$f":"+H13+I13+K13+J13","v":5200},null,null,null,{"$f":"+M13+N13+O13","v":0},20825]
[null,5,"2025-01-03",37,"تحويل بنكى","مصطفى","قيمة فاتورة رقم 3",5200,null,null,null,{"$f":"+H14+I14+K14+J14","v":5200},null,null,null,{"$f":"+M14+N14+O14","v":0},26025]
[null,6,"2025-01-03",37,"تحويل بنكى","مصطفى","قيمة فاتورة رقم 3",5200,null,null,null,{"$f":"+H15+I15+K15+J15","v":5200},null,null,null,{"$f":"+M15+N15+O15","v":0},31225]
[null,7,"2025-01-03",37,"تحويل بنكى","مصطفى","قيمة فاتورة رقم 3",5200,null,null,null,{"$f":"+H16+I16+K16+J16","v":5200},null,null,null,{"$f":"+M16+N16+O16","v":0},36425]
[null,8,"2025-01-03",37,"تحويل بنكى","عبد الله","قيمة فاتورة شراء رقم 3",null,5200,null,null,{"$f":"+H17+I17+K17+J17","v":5200},null,null,null,{"$f":"+M17+N17+O17","v":0},41625]
[null,9,"2025-01-03",37,"تحويل بنكى","عبد الله","قيمة فاتورة شراء رقم 3",null,5200,null,null,{"$f":"+H18+I18+K18+J18","v":5200},null,null,null,{"$f":"+M18+N18+O18","v":0},46825]
[null,10,"2025-01-03",37,"تحويل بنكى","عبد الله","قيمة فاتورة شراء رقم 3",null,5200,null,null,{"$f":"+H19+I19+K19+J19","v":5200},null,null,null,{"$f":"+M19+N19+O19","v":0},52025]
[null,11,"2025-01-03",37,"تحويل بنكى","عبد الله","قيمة فاتورة شراء رقم 3",null,5200,null,null,{"$f":"+H20+I20+K20+J20","v":5200},null,null,null,{"$f":"+M20+N20+O20","v":0},57225]
[null,12,"2025-01-03",37,"تحويل بنكى","عبد الله","قيمة فاتورة شراء رقم 3",null,5200,null,null,{"$f":"+H21+I21+K21+J21","v":5200},null,null,null,{"$f":"+M21+N21+O21","v":0},62425]
[null,13,"2025-01-03",37,"تحويل بنكى","عبد الله","قيمة فاتورة شراء رقم 3",null,5200,null,null,{"$f":"+H22+I22+K22+J22","v":5200},null,null,null,{"$f":"+M22+N22+O22","v":0},67625]
[null,14,"2025-01-03",37,"تحويل بنكى","احمد","إيداع",null,null,5200,null,{"$f":"+H23+I23+K23+J23","v":5200},null,null,null,{"$f":"+M23+N23+O23","v":0},72825]
[null,15,"2025-01-03",37,"تحويل بنكى","احمد","إيداع",null,null,5200,null,{"$f":"+H24+I24+K24+J24","v":5200},null,null,null,{"$f":"+M24+N24+O24","v":0},78025]
[null,16,"2025-01-03",37,"تحويل بنكى","احمد","إيداع",null,null,5200,null,{"$f":"+H25+I25+K25+J25","v":5200},null,null,null,{"$f":"+M25+N25+O25","v":0},83225]
[null,17,"2025-01-03",37,"تحويل بنكى","احمد","إيداع",null,null,5200,null,{"$f":"+H26+I26+K26+J26","v":5200},null,null,null,{"$f":"+M26+N26+O26","v":0},88425]
[null,18,"2025-01-03",37,"تحويل بنكى","احمد","إيداع",null,null,5200,null,{"$f":"+H27+I27+K27+J27","v":5200},null,null,null,{"$f":"+M27+N27+O27","v":0},93625]
[null,19,"2025-01-03",37,"تحويل بنكى","احمد","إيداع",null,null,5200,null,{"$f":"+H28+I28+K28+J28","v":5200},null,null,null,{"$f":"+M28+N28+O28","v":0},98825]
[null,20,"2025-01-03",37,"تحويل بنكى","احمد","إيداع",null,null,5200,null,{"$f":"+H29+I29+K29+J29","v":5200},null,null,null,{"$f":"+M29+N29+O29","v":0},104025]
[null,21,"2025-01-03",37,"تحويل بنكى","عبد الله","كهرباء",null,null,null,6000,{"$f":"+H30+I30+K30+J30","v":6000},null,null,null,{"$f":"+M30+N30+O30","v":0},110025]
[null,22,"2025-01-03",37,"تحويل بنكى","عبد الله","كهرباء",null,null,null,6000,{"$f":"+H31+I31+K31+J31","v":6000},null,null,null,{"$f":"+M31+N31+O31","v":0},116025]
[null,23,"2025-01-03",37,"تحويل بنكى","عبد الله","كهرباء",null,null,null,6000,{"$f":"+H32+I32+K32+J32","v":6000},null,null,null,{"$f":"+M32+N32+O32","v":0},122025]
[null,24,"2025-01-03",37,"تحويل بنكى","عبد الله","كهرباء",null,null,null,6000,{"$f":"+H33+I33+K33+J33","v":6000},null,null,null,{"$f":"+M33+N33+O33","v":0},128025]
[null,25,"2025-01-03",37,"تحويل بنكى","عبد الله","كهرباء",null,null,null,6000,{"$f":"+H34+I34+K34+J34","v":6000},null,null,null,{"$f":"+M34+N34+O34","v":0},134025]
[null,26,"2025-01-03",37,"تحويل بنكى","عبد الله","كهرباء",null,null,null,6000,{"$f":"+H35+I35+K35+J35","v":6000},null,null,null,{"$f":"+M35+N35+O35","v":0},140025]
[null,27,"2025-01-03",37,"تحويل بنكى","عبد الله","كهرباء",null,null,null,6000,{"$f":"+H36+I36+K36+J36","v":6000},null,null,null,{"$f":"+M36+N36+O36","v":0},146025]
[null,28,"2025-01-03",37,"تحويل بنكى","عبد الله","كهرباء",null,null,null,6000,{"$f":"+H37+I37+K37+J37","v":6000},null,null,null,{"$f":"+M37+N37+O37","v":0},152025]
[null,29,"2025-01-08",42,"شيك","محمود","قيمة فاتورة رقم 8",2205,null,null,null,{"$f":"+H38+I38+K38+J38","v":2205},null,null,null,{"$f":"+M38+N38+O38","v":0},154230]
[null,30,"2025-01-08",42,"شيك","محمود","قيمة فاتورة رقم 8",2205,null,null,null,{"$f":"+H39+I39+K39+J39","v":2205},null,null,null,{"$f":"+M39+N39+O39","v":0},156435]
[null,31,"2025-01-08",42,"شيك","محمود","قيمة فاتورة رقم 8",2205,null,null,null,{"$f":"+H40+I40+K40+J40","v":2205},null,null,null,{"$f":"+M40+N40+O40","v":0},158640]
{"$rows_left_out":960}