{"text_format":"1","workbook":"xlsx","n_sheets":5,"sheets":["sheet1","sheet2","البحث بالرقم القومي","الخطابات","القائمة "],"not_rendered":{"charts":0,"images":4,"macros":1,"external_links":1,"defined_names":2,"comments":0,"pivot_tables":0},"unopened":[],"bounds":{"document_bytes":16777216,"sheet_cells":100000,"rows_first":2000,"rows_last":500,"rows_between":2000,"halvings":0,"cell_chars":16384,"cell_head_chars":4096},"cells_cut":0,"cells_raw":0,"read":"whole","date_system":"1900"}

{"sheet":"sheet1","index":0,"n_rows":21,"n_cols":11,"rows_kept":21,"cut":false,"hidden":false,"merged":[[10,2,10,3],[10,4,10,5],[10,7,10,8],[10,9,10,10],[8,2,8,3],[8,4,8,5],[8,7,8,8],[8,9,8,10],[6,2,6,3],[4,2,4,3],[4,7,4,8],[6,7,6,8],[2,3,2,5],[2,8,2,10],[4,4,4,5],[4,9,4,10],[6,4,6,5],[6,9,6,10]]}
[]
[]
[null,null,"الرقم القومي",26508062500141,null,null,null,"رقم الملف "]
[]
[null,null,"رقم الملف",null,12,null,null,"الرقم التاميني ",null,125]
[]
[null,null,"اسم الموظف",null,"محمد",null,null,"الوظيفة",null,"الووو"]
[]
[null,null,"جهة العمل",null,"التعييينات",null,null,"المجموعة الوظيفية ",null,"اااااا"]
[]
[null,null,"الرقم القومي",null,123,null,null,"المجموعة النوعية ",null,"بامنبايمسن"]
[null,null,null,null,"من ","الى",null,null,null,"من","الى "]
[null,null,"المدة الاولى ","للعمل داخل القطر ",null,null,null,"المدة الثانية ","ظروف خاصة "]
[]
[null,null,"المدة الثالثة","للعمل داخل القطر ",null,null,null,"المدة الرابعة","ظروف خاصة "]
[]
[null,null,"المدة الخامسة","للعمل داخل القطر ",null,null,null,"المدة السادسة","اجازة للعمل بالسعودية "]
[]
[null,null,"المدة السابعة","اجازة للعمل بالكويت ",null,null,null,"المدة الثامنة","ظروف خاصة "]
[]
[null,null,"المدة التاسعة","مرافقة زوج",null,null,null,"المدة العاشرة","اجازة للعمل بالسعودية "]

{"sheet":"sheet2","index":1,"n_rows":5,"n_cols":139,"rows_kept":5,"cut":false,"hidden":false,"merged":[[0,8,2,8],[0,11,1,13],[0,9,2,9],[0,10,2,10],[0,0,2,0],[0,1,2,1],[0,3,2,3],[0,4,2,4],[0,6,2,6],[0,2,2,2],[0,5,2,5],[0,7,2,7],[0,32,1,34],[0,14,2,14],[0,16,2,16],[0,17,2,17],[0,18,1,20],[0,21,2,21],[0,23,2,23],[0,24,2,24],[0,25,1,27],[0,28,2,28],[0,30,2,30],[0,31,2,31],[0,15,2,15],[0,22,2,22],[0,29,2,29],[0,53,1,55],[0,35,2,35],[0,37,2,37],[0,38,2,38],[0,39,1,41],[0,42,2,42],[0,44,2,44],[0,45,2,45],[0,46,1,48],[0,49,2,49],[0,51,2,51],[0,52,2,52],[0,36,2,36],[0,43,2,43],[0,50,2,50],[0,74,1,76],[0,56,2,56],[0,58,2,58],[0,59,2,59],[0,60,1,62],[0,63,2,63],[0,65,2,65],[0,66,2,66],[0,67,1,69],[0,70,2,70],[0,72,2,72],[0,73,2,73],[0,57,2,57],[0,64,2,64],[0,71,2,71],[0,95,1,97],[0,77,2,77],[0,79,2,79],[0,80,2,80],[0,81,1,83],[0,84,2,84],[0,86,2,86],[0,87,2,87],[0,88,1,90],[0,91,2,91],[0,93,2,93],[0,94,2,94],[0,78,2,78],[0,85,2,85],[0,92,2,92],[0,116,1,118],[0,98,2,98],[0,100,2,100],[0,101,2,101],[0,102,1,104],[0,105,2,105],[0,107,2,107],[0,108,2,108],[0,109,1,111],[0,112,2,112],[0,114,2,114],[0,115,2,115],[0,99,2,99],[0,106,2,106],[0,113,2,113],[0,129,2,129],[0,130,1,132],[0,133,2,133],[0,119,2,119],[0,121,2,121],[0,122,2,122],[0,123,1,125],[0,126,2,126],[0,128,2,128],[0,120,2,120],[0,127,2,127]]}
["رقم الملف ","الاسم ","جهة العمل ","الرقم القومي ","الرقم التاميني ","الوظيفة ","المجموعة الوظيفية ","المجموعة النوعية  ","نوع الاجازة الخاصة ","بداية الاجازة ","نهاية الاجازة ","صافي المدة ",null,null,"ملاحظة ","نوع الاجازة الخاصة ","بداية الاجازة ","نهاية الاجازة ","صافي المدة ",null,null,"ملاحظة ","نوع الاجازة الخاصة ","بداية الاجازة ","نهاية الاجازة ","صافي المدة ",null,null,"ملاحظة ","نوع الاجازة الخاصة ","بداية الاجازة ","نهاية الاجازة ","صافي المدة ",null,null,"ملاحظة ","نوع الاجازة الخاصة ","بداية الاجازة ","نهاية الاجازة ","صافي المدة ",null,null,"ملاحظة ","نوع الاجازة الخاصة ","بداية الاجازة ","نهاية الاجازة ","صافي المدة ",null,null,"ملاحظة ","نوع الاجازة الخاصة ","بداية الاجازة ","نهاية الاجازة ","صافي المدة ",null,null,"ملاحظة ","نوع الاجازة الخاصة ","بداية الاجازة ","نهاية الاجازة ","صافي المدة ",null,null,"ملاحظة ","نوع الاجازة الخاصة ","بداية الاجازة ","نهاية الاجازة ","صافي المدة ",null,null,"ملاحظة ","نوع الاجازة الخاصة ","بداية الاجازة ","نهاية الاجازة ","صافي المدة ",null,null,"ملاحظة ","نوع الاجازة الخاصة ","بداية الاجازة ","نهاية الاجازة ","صافي المدة ",null,null,"ملاحظة ","نوع الاجازة الخاصة ","بداية الاجازة ","نهاية الاجازة ","صافي المدة ",null,null,"ملاحظة ","نوع الاجازة الخاصة ","بداية الاجازة ","نهاية الاجازة ","صافي المدة ",null,null,"ملاحظة ","نوع الاجازة الخاصة ","بداية الاجازة ","نهاية الاجازة ","صافي المدة ",null,null,"ملاحظة ","نوع الاجازة الخاصة ","بداية الاجازة ","نهاية الاجازة ","صافي المدة ",null,null,"ملاحظة ","نوع الاجازة الخاصة ","بداية الاجازة ","نهاية الاجازة ","صافي المدة ",null,null,"ملاحظة ","نوع الاجازة الخاصة ","بداية الاجازة ","نهاية الاجازة ","صافي المدة ",null,null,"ملاحظة ","نوع الاجازة الخاصة ","بداية الاجازة ","نهاية الاجازة ","صافي المدة ",null,null,"ملاحظة "]
[]
[null,null,null,null,null,null,null,null,null,null,null,"يوم ","شهر","سنة ",null,null,null,null,"يوم ","شهر","سنة ",null,null,null,null,"يوم ","شهر","سنة ",null,null,null,null,"يوم ","شهر","سنة ",null,null,null,null,"يوم ","شهر","سنة ",null,null,null,null,"يوم ","شهر","سنة ",null,null,null,null,"يوم ","شهر","سنة ",null,null,null,null,"يوم ","شهر","سنة ",null,null,null,null,"يوم ","شهر","سنة ",null,null,null,null,"يوم ","شهر","سنة ",null,null,null,null,"يوم ","شهر","سنة ",null,null,null,null,"يوم ","شهر","سنة ",null,null,null,null,"يوم ","شهر","سنة ",null,null,null,null,"يوم ","شهر","سنة ",null,null,null,null,"يوم ","شهر","سنة ",null,null,null,null,"يوم ","شهر","سنة ",null,null,null,null,"يوم ","شهر","سنة ",null,null,null,null,"يوم ","شهر","سنة "]
[null,"صفاء حسين ","نقل من الاطباء ",123,null,"كبير أطباء بشريين بدرجة مدير عام","التخصصية "," الطب البشرى",null,null,null,{"$f":"DATEDIF(J4,K4, \"md\")","v":0},{"$f":"DATEDIF(J4,K4, \"ym\")","v":0},{"$f":"DATEDIF(J4,K4, \"y\")","v":0},null,null,null,null,{"$f":"DATEDIF(Q4,R4, \"md\")","v":0},{"$f":"DATEDIF(Q4,R4, \"ym\")","v":0},{"$f":"DATEDIF(Q4,R4, \"y\")","v":0},null,null,null,null,{"$f":"DATEDIF(X4,Y4, \"md\")","v":0},{"$f":"DATEDIF(X4,Y4, \"ym\")","v":0},{"$f":"DATEDIF(X4,Y4, \"y\")","v":0},null,null,null,null,{"$f":"DATEDIF(AE4,AF4, \"md\")","v":0},{"$f":"DATEDIF(AE4,AF4, \"ym\")","v":0},{"$f":"DATEDIF(AE4,AF4, \"y\")","v":0},null,null,null,null,{"$f":"DATEDIF(AL4,AM4, \"md\")","v":0},{"$f":"DATEDIF(AL4,AM4, \"ym\")","v":0},{"$f":"DATEDIF(AL4,AM4, \"y\")","v":0},null,null,null,null,{"$f":"DATEDIF(AS4,AT4, \"md\")","v":0},{"$f":"DATEDIF(AS4,AT4, \"ym\")","v":0},{"$f":"DATEDIF(AS4,AT4, \"y\")","v":0},null,null,null,null,{"$f":"DATEDIF(AZ4,BA4, \"md\")","v":0},{"$f":"DATEDIF(AZ4,BA4, \"ym\")","v":0},{"$f":"DATEDIF(AZ4,BA4, \"y\")","v":0},null,null,null,null,{"$f":"DATEDIF(BG4,BH4, \"md\")","v":0},{"$f":"DATEDIF(BG4,BH4, \"ym\")","v":0},{"$f":"DATEDIF(BG4,BH4, \"y\")","v":0},null,null,null,null,{"$f":"DATEDIF(BN4,BO4, \"md\")","v":0},{"$f":"DATEDIF(BN4,BO4, \"ym\")","v":0},{"$f":"DATEDIF(BN4,BO4, \"y\")","v":0},null,null,null,null,{"$f":"DATEDIF(BU4,BV4, \"md\")","v":0},{"$f":"DATEDIF(BU4,BV4, \"ym\")","v":0},{"$f":"DATEDIF(BU4,BV4, \"y\")","v":0},null,null,null,null,{"$f":"DATEDIF(CB4,CC4, \"md\")","v":0},{"$f":"DATEDIF(CB4,CC4, \"ym\")","v":0},{"$f":"DATEDIF(CB4,CC4, \"y\")","v":0},null,null,null,null,{"$f":"DATEDIF(CI4,CJ4, \"md\")","v":0},{"$f":"DATEDIF(CI4,CJ4, \"ym\")","v":0},{"$f":"DATEDIF(CI4,CJ4, \"y\")","v":0},null,null,null,null,{"$f":"DATEDIF(CP4,CQ4, \"md\")","v":0},{"$f":"DATEDIF(CP4,CQ4, \"ym\")","v":0},{"$f":"DATEDIF(CP4,CQ4, \"y\")","v":0},null,null,null,null,{"$f":"DATEDIF(CW4,CX4, \"md\")","v":0},{"$f":"DATEDIF(CW4,CX4, \"ym\")","v":0},{"$f":"DATEDIF(CW4,CX4, \"y\")","v":0},null,null,null,null,{"$f":"DATEDIF(DD4,DE4, \"md\")","v":0},{"$f":"DATEDIF(DD4,DE4, \"ym\")","v":0},{"$f":"DATEDIF(DD4,DE4, \"y\")","v":0},null,null,null,null,{"$f":"DATEDIF(DK4,DL4, \"md\")","v":0},{"$f":"DATEDIF(DK4,DL4, \"ym\")","v":0},{"$f":"DATEDIF(DK4,DL4, \"y\")","v":0},null,null,null,null,{"$f":"DATEDIF(DR4,DS4, \"md\")","v":0},{"$f":"DATEDIF(DR4,DS4, \"ym\")","v":0},{"$f":"DATEDIF(DR4,DS4, \"y\")","v":0},null,null,null,null,{"$f":"DATEDIF(DY4,DZ4, \"md\")","v":0},{"$f":"DATEDIF(DY4,DZ4, \"ym\")","v":0},{"$f":"DATEDIF(DY4,DZ4, \"y\")","v":0}]
[null,"ابراهيم محمد ","نقل من الاطباء ",124,null,"كبير أطباء بشريين بدرجة مدير عام","التخصصية "," الطب البشرى",null,null,null,0,0,0,null,null,null,null,0,0,0,null,null,null,null,0,0,0,null,null,null,null,0,0,0,null,null,null,null,0,0,0,null,null,null,null,0,0,0,null,null,null,null,0,0,0,null,null,null,null,0,0,0,null,null,null,null,0,0,0,null,null,null,null,0,0,0,null,null,null,null,0,0,0,null,null,null,null,0,0,0,null,null,null,null,0,0,0,null,null,null,null,0,0,0,null,null,null,null,0,0,0,null,null,null,null,0,0,0,null,null,null,null,0,0,0,null,null,null,null,0,0,0,null,null,"رقم الملف","الرقم القومي ","رقم الصف الملف ","رقم الصف القومي"]

{"sheet":"البحث بالرقم القومي","index":2,"n_rows":25,"n_cols":12,"rows_kept":25,"cut":false,"hidden":false,"merged":[[24,5,24,7],[8,3,8,7],[9,3,9,7],[11,5,11,7],[1,1,2,7],[4,3,4,7],[5,3,5,7],[6,3,6,7],[7,3,7,7],[11,2,12,2],[11,3,12,3],[11,4,12,4],[11,1,12,1]]}
[]
[null,"بيان اجازة موظف "]
[]
[]
[null,null,"الاسم:",{"$f":"_xll.XLOOKUP($L$12,sheet2!$D:$D,sheet2!$B:$B,0)","v":0},null,null,null,null,null,null,null," "]
[null,null,"الرقم القومى :",{"$f":"_xll.XLOOKUP($L$12,sheet2!$D:$D,sheet2!$D:$D,0)","v":0}]
[null,null,"المجموعة النوعية :",{"$f":"_xll.XLOOKUP($L$12,sheet2!$D:$D,sheet2!$H:$H,0)","v":0}]
[null,null,"المجموعة الوظيفية :",{"$f":"_xll.XLOOKUP($L$12,sheet2!$D:$D,sheet2!$G:$G,0)","v":0}]
[null,null,"جهة العمل :",{"$f":"_xll.XLOOKUP($L$12,sheet2!$D:$D,sheet2!$C:$C,0)","v":0}]
[null,null,"المسمى الوظيفى :",{"$f":"_xll.XLOOKUP($L$12,sheet2!$D:$D,sheet2!$F:$F,0)","v":0}]
[]
[null,"م","نوع الاجازة","من ","الى ","مدة الاجازة",null,null,null,null,"البحث بالرقم القومى :",26905142500133]
[null,null,null,null,null,"يوم","شهر","سنة"]
[null,1,{"$f":"_xll.XLOOKUP($L$12,sheet2!$D:$D,sheet2!I:I,0)","v":0},{"$f":"_xll.XLOOKUP($L$12,sheet2!$D:$D,sheet2!J:J,0)","v":"00:00:00"},{"$f":"_xll.XLOOKUP($L$12,sheet2!$D:$D,sheet2!K:K,0)","v":"00:00:00"},{"$f":"_xll.XLOOKUP($L$12,sheet2!$D:$D,sheet2!L:L,0)","v":0},{"$f":"_xll.XLOOKUP($L$12,sheet2!$D:$D,sheet2!M:M,0)","v":0},{"$f":"_xll.XLOOKUP($L$12,sheet2!$D:$D,sheet2!N:N,0)","v":0}]
[null,2,{"$f":"_xll.XLOOKUP($L$12,sheet2!$D:$D,sheet2!P:P,0)","v":0},{"$f":"_xll.XLOOKUP($L$12,sheet2!$D:$D,sheet2!Q:Q,0)","v":"00:00:00"},{"$f":"_xll.XLOOKUP($L$12,sheet2!$D:$D,sheet2!R:R,0)","v":"00:00:00"},{"$f":"_xll.XLOOKUP($L$12,sheet2!$D:$D,sheet2!S:S,0)","v":0},{"$f":"_xll.XLOOKUP($L$12,sheet2!$D:$D,sheet2!T:T,0)","v":0},{"$f":"_xll.XLOOKUP($L$12,sheet2!$D:$D,sheet2!U:U,0)","v":0}]
[null,3,{"$f":"_xll.XLOOKUP($L$12,sheet2!$D:$D,sheet2!W:W,0)","v":0},{"$f":"_xll.XLOOKUP($L$12,sheet2!$D:$D,sheet2!X:X,0)","v":"00:00:00"},{"$f":"_xll.XLOOKUP($L$12,sheet2!$D:$D,sheet2!Y:Y,0)","v":"00:00:00"},{"$f":"_xll.XLOOKUP($L$12,sheet2!$D:$D,sheet2!Z:Z,0)","v":0},{"$f":"_xll.XLOOKUP($L$12,sheet2!$D:$D,sheet2!AA:AA,0)","v":0},{"$f":"_xll.XLOOKUP($L$12,sheet2!$D:$D,sheet2!AB:AB,0)","v":0}]
[null,4,{"$f":"_xll.XLOOKUP($L$12,sheet2!$D:$D,sheet2!AD:AD,0)","v":0},{"$f":"_xll.XLOOKUP($L$12,sheet2!$D:$D,sheet2!AE:AE,0)","v":"00:00:00"},{"$f":"_xll.XLOOKUP($L$12,sheet2!$D:$D,sheet2!AF:AF,0)","v":"00:00:00"},{"$f":"_xll.XLOOKUP($L$12,sheet2!$D:$D,sheet2!AG:AG,0)","v":0},{"$f":"_xll.XLOOKUP($L$12,sheet2!$D:$D,sheet2!AH:AH,0)","v":0},{"$f":"_xll.XLOOKUP($L$12,sheet2!$D:$D,sheet2!AI:AI,0)","v":0}]
[null,5,{"$f":"_xll.XLOOKUP($L$12,sheet2!$D:$D,sheet2!AK:AK,0)","v":0},{"$f":"_xll.XLOOKUP($L$12,sheet2!$D:$D,sheet2!AL:AL,0)","v":"00:00:00"},{"$f":"_xll.XLOOKUP($L$12,sheet2!$D:$D,sheet2!AM:AM,0)","v":"00:00:00"},{"$f":"_xll.XLOOKUP($L$12,sheet2!$D:$D,sheet2!AN:AN,0)","v":0},{"$f":"_xll.XLOOKUP($L$12,sheet2!$D:$D,sheet2!AO:AO,0)","v":0},{"$f":"_xll.XLOOKUP($L$12,sheet2!$D:$D,sheet2!AP:AP,0)","v":0}]
[null,6,{"$f":"_xll.XLOOKUP($L$12,sheet2!$D:$D,sheet2!AR:AR,0)","v":0},{"$f":"_xll.XLOOKUP($L$12,sheet2!$D:$D,sheet2!AS:AS,0)","v":"00:00:00"},{"$f":"_xll.XLOOKUP($L$12,sheet2!$D:$D,sheet2!AT:AT,0)","v":"00:00:00"},{"$f":"_xll.XLOOKUP($L$12,sheet2!$D:$D,sheet2!AU:AU,0)","v":0},{"$f":"_xll.XLOOKUP($L$12,sheet2!$D:$D,sheet2!AV:AV,0)","v":0},{"$f":"_xll.XLOOKUP($L$12,sheet2!$D:$D,sheet2!AW:AW,0)","v":0},null,null,"البحث بالاسم الكامل :"]
[null,7,{"$f":"_xll.XLOOKUP($L$12,sheet2!$D:$D,sheet2!AY:AY,0)","v":0},{"$f":"_xll.XLOOKUP($L$12,sheet2!$D:$D,sheet2!AZ:AZ,0)","v":"00:00:00"},{"$f":"_xll.XLOOKUP($L$12,sheet2!$D:$D,sheet2!BA:BA,0)","v":"00:00:00"},{"$f":"_xll.XLOOKUP($L$12,sheet2!$D:$D,sheet2!BB:BB,0)","v":0},{"$f":"_xll.XLOOKUP($L$12,sheet2!$D:$D,sheet2!BC:BC,0)","v":0},{"$f":"_xll.XLOOKUP($L$12,sheet2!$D:$D,sheet2!BD:BD,0)","v":0}]
[null,8,{"$f":"_xll.XLOOKUP($L$12,sheet2!$D:$D,sheet2!BF:BF,0)","v":0},{"$f":"_xll.XLOOKUP($L$12,sheet2!$D:$D,sheet2!BG:BG,0)","v":"00:00:00"},{"$f":"_xll.XLOOKUP($L$12,sheet2!$D:$D,sheet2!BH:BH,0)","v":"00:00:00"},{"$f":"_xll.XLOOKUP($L$12,sheet2!$D:$D,sheet2!BI:BI,0)","v":0},{"$f":"_xll.XLOOKUP($L$12,sheet2!$D:$D,sheet2!BJ:BJ,0)","v":0},{"$f":"_xll.XLOOKUP($L$12,sheet2!$D:$D,sheet2!BK:BK,0)","v":0}]
[null,9,{"$f":"_xll.XLOOKUP($L$12,sheet2!$D:$D,sheet2!BM:BM,0)","v":0},{"$f":"_xll.XLOOKUP($L$12,sheet2!$D:$D,sheet2!BN:BN,0)","v":"00:00:00"},{"$f":"_xll.XLOOKUP($L$12,sheet2!$D:$D,sheet2!BO:BO,0)","v":"00:00:00"},{"$f":"_xll.XLOOKUP($L$12,sheet2!$D:$D,sheet2!BP:BP,0)","v":0},{"$f":"_xll.XLOOKUP($L$12,sheet2!$D:$D,sheet2!BQ:BQ,0)","v":0},{"$f":"_xll.XLOOKUP($L$12,sheet2!$D:$D,sheet2!BR:BR,0)","v":0}]
[null,10,{"$f":"_xll.XLOOKUP($L$12,sheet2!$D:$D,sheet2!BT:BT,0)","v":0},{"$f":"_xll.XLOOKUP($L$12,sheet2!$D:$D,sheet2!BU:BU,0)","v":"00:00:00"},{"$f":"_xll.XLOOKUP($L$12,sheet2!$D:$D,sheet2!BV:BV,0)","v":"00:00:00"},{"$f":"_xll.XLOOKUP($L$12,sheet2!$D:$D,sheet2!BW:BW,0)","v":0},{"$f":"_xll.XLOOKUP($L$12,sheet2!$D:$D,sheet2!BX:BX,0)","v":0},{"$f":"_xll.XLOOKUP($L$12,sheet2!$D:$D,sheet2!BY:BY,0)","v":0}]
[]
[null,null,"الموظف المختص:",null,null,"مدير الادارة"]

{"sheet":"الخطابات","index":3,"n_rows":0,"n_cols":0,"rows_kept":0,"cut":false,"hidden":false,"merged":[]}

{"sheet":"القائمة ","index":4,"n_rows":15,"n_cols":8,"rows_kept":15,"cut":false,"hidden":false,"merged":[]}
[]
[]
[]
[]
[]
[]
[]
[null,null,null,null,null,null,null,"رعاية طفل"]
[null,null,null,null,null,null,null,"اجازة للعمل بالخارج "]
[null,null,null,null,null,null,null,"للعمل داخل القطر "]
[null,null,null,null,null,null,null,"ظروف خاصة "]
[null,null,null,null,null,null,null,"مرافقة زوج"]
[null,null,null,null,null,null,null,"اجازة للعمل بالسعودية "]
[null,null,null,null,null,null,null,"اجازة للعمل بالكويت "]
[null,null,null,null,null,null,null,"رعاية والدين "]