{"text_format":"1","workbook":"xlsx","n_sheets":5,"sheets":["سيارة رقم 7264 متسوبيش","1","2","3","Final"],"not_rendered":{"charts":0,"images":0,"macros":1,"external_links":1,"defined_names":0,"comments":0,"pivot_tables":0},"unopened":[],"bounds":{"document_bytes":16777216,"sheet_cells":100000,"rows_first":2000,"rows_last":500,"rows_between":2000,"halvings":0,"cell_chars":16384,"cell_head_chars":4096},"cells_cut":0,"cells_raw":0,"read":"whole","date_system":"1900"}

{"sheet":"سيارة رقم 7264 متسوبيش","index":0,"n_rows":156,"n_cols":17,"rows_kept":156,"cut":false,"hidden":false,"merged":[]}
[" "]
[]
[]
[]
[]
[]
[]
[]
[]
[null,"أسم المكتب","كود الصنف","أسم الصنف","عدد الارقام","مجموعة الصنف","الموجود من واقع الجرد","حالة الصنف","الرصيد الدفترى","زيادة","عجز","ماركة الصنف","موديل الصنف","رقم مسلسل الصنف ","سعر الصنف ","تاريخ صرف الصنف","ملاحظات"]
[null,"سيارة رقم 7264 متسوبيش",15737,{"$f":"VLOOKUP(C11,'[1]اكواد الاصناف'!$A$1:$IV$65536,2,0)","v":"نموذج لوسائل للنقل الميكانيكية(سيارات - جرارات )"},{"$f":"LEN(C11)","v":5},{"$f":"VLOOKUP(C11,'[1]اكواد الاصناف'!$A$1:$IV$65536,3,0)","v":0},1,"جيدة",1]
[null,"سيارة رقم 7264 متسوبيش","بدون","لوحة معدنية",4,{"$f":"VLOOKUP(C12,'[1]اكواد الاصناف'!$A$1:$IV$65536,3,0)","v":{"$error":"#N/A"}},2,"جيدة",2]
[null,"سيارة رقم 7264 متسوبيش","بدون","مفتاح كونتاك",4,{"$f":"VLOOKUP(C13,'[1]اكواد الاصناف'!$A$1:$IV$65536,3,0)","v":{"$error":"#N/A"}},2,"جيدة",2]
[null,"سيارة رقم 7264 متسوبيش",13060,{"$f":"VLOOKUP(C14,'[1]اكواد الاصناف'!$A$1:$IV$65536,2,0)","v":"جهاز اطفاء حريق 3 كيلو بدره جافه"},5,{"$f":"VLOOKUP(C14,'[1]اكواد الاصناف'!$A$1:$IV$65536,3,0)","v":"YAS03"},1,"جيدة",1]
[null,"سيارة رقم 7264 متسوبيش",2356,{"$f":"VLOOKUP(C15,'[1]اكواد الاصناف'!$A$1:$IV$65536,2,0)","v":"كوريك تمساح من 3: 6 طن"},4,{"$f":"VLOOKUP(C15,'[1]اكواد الاصناف'!$A$1:$IV$65536,3,0)","v":"YAS05"},1,"جيدة",1]
[null,"سيارة رقم 7264 متسوبيش","بدون","استبن",4,{"$f":"VLOOKUP(C16,'[1]اكواد الاصناف'!$A$1:$IV$65536,3,0)","v":{"$error":"#N/A"}},1,"جيدة",1]
[null,"سيارة رقم 7264 متسوبيش","بدون","مرآة صالون",{"$f":"LEN(C17)","v":4},{"$f":"VLOOKUP(C17,'[1]اكواد الاصناف'!$A$1:$IV$65536,3,0)","v":{"$error":"#N/A"}},1,"جيدة",1]
[null,"سيارة رقم 7264 متسوبيش","بدون","مرآة جنب",{"$f":"LEN(C18)","v":4},{"$f":"VLOOKUP(C18,'[1]اكواد الاصناف'!$A$1:$IV$65536,3,0)","v":{"$error":"#N/A"}},2,"جيدة",2]
[null,"سيارة رقم 7264 متسوبيش","بدون","ولاعة سجاير",4,{"$f":"VLOOKUP(C19,'[1]اكواد الاصناف'!$A$1:$IV$65536,3,0)","v":{"$error":"#N/A"}},1,"جيدة",1]
[null,"سيارة رقم 7264 متسوبيش",16039,{"$f":"VLOOKUP(C20,'[1]اكواد الاصناف'!$A$1:$IV$65536,2,0)","v":"جهاز كاسيت هاي واي "},5,{"$f":"VLOOKUP(C20,'[1]اكواد الاصناف'!$A$1:$IV$65536,3,0)","v":0},1,"جيدة",1]
[null,"سيارة رقم 7264 متسوبيش",16629,{"$f":"VLOOKUP(C21,'[1]اكواد الاصناف'!$A$1:$IV$65536,2,0)","v":"مروحة محورية شفاط توشيبا"},5,{"$f":"VLOOKUP(C21,'[1]اكواد الاصناف'!$A$1:$IV$65536,3,0)","v":0},1,"جيدة",1]
[null,"سيارة رقم 7264 متسوبيش","بدون","مفتاح عجل",4,{"$f":"VLOOKUP(C22,'[1]اكواد الاصناف'!$A$1:$IV$65536,3,0)","v":{"$error":"#N/A"}},2,"جيدة",2]
[null,"سيارة رقم 7264 متسوبيش",12910,{"$f":"VLOOKUP(C23,'[1]اكواد الاصناف'!$A$1:$IV$65536,2,0)","v":"مفتاح مشرشر كبير"},5,{"$f":"VLOOKUP(C23,'[1]اكواد الاصناف'!$A$1:$IV$65536,3,0)","v":"YAS05"},1,"جيدة",1]
[null,"سيارة رقم 7264 متسوبيش",17439,{"$f":"VLOOKUP(C24,'[1]اكواد الاصناف'!$A$1:$IV$65536,2,0)","v":"مفك عادة كبير"},5,{"$f":"VLOOKUP(C24,'[1]اكواد الاصناف'!$A$1:$IV$65536,3,0)","v":0},3,"جيدة",3]
[null,"سيارة رقم 7264 متسوبيش",14318,{"$f":"VLOOKUP(C25,'[1]اكواد الاصناف'!$A$1:$IV$65536,2,0)","v":"طقم مفكات \" عادة - صليبة \""},5,{"$f":"VLOOKUP(C25,'[1]اكواد الاصناف'!$A$1:$IV$65536,3,0)","v":"YAS05"},1,"جيدة",1]
[null,"سيارة رقم 7264 متسوبيش",2320,{"$f":"VLOOKUP(C26,'[1]اكواد الاصناف'!$A$1:$IV$65536,2,0)","v":"بنس عادية معزولة 8 بوصة"},4,{"$f":"VLOOKUP(C26,'[1]اكواد الاصناف'!$A$1:$IV$65536,3,0)","v":"YAS05"},1,"جيدة",1]
[null,"سيارة رقم 7264 متسوبيش","بدون","طقم عجل",4,{"$f":"VLOOKUP(C27,'[1]اكواد الاصناف'!$A$1:$IV$65536,3,0)","v":{"$error":"#N/A"}},4,"جيدة",4]
[null,"سيارة رقم 7264 متسوبيش",3039,{"$f":"VLOOKUP(C28,'[1]اكواد الاصناف'!$A$1:$IV$65536,2,0)","v":"شفاط 50 * 50  ريشة معدن المانى"},4,{"$f":"VLOOKUP(C28,'[1]اكواد الاصناف'!$A$1:$IV$65536,3,0)","v":"YAS03"},1,"جيدة",1]
[null,"سيارة رقم 7264 متسوبيش","بدون","رخصة سير",4,{"$f":"VLOOKUP(C29,'[1]اكواد الاصناف'!$A$1:$IV$65536,3,0)","v":{"$error":"#N/A"}},1,"جيدة",1]
[null,"سيارة رقم 7264 متسوبيش",13884,{"$f":"VLOOKUP(C30,'[1]اكواد الاصناف'!$A$1:$IV$65536,2,0)","v":"GPS \"حساس - زر انذار - وحدة غلق \""},5,{"$f":"VLOOKUP(C30,'[1]اكواد الاصناف'!$A$1:$IV$65536,3,0)","v":"YAS03"},1,"جيدة",1]
[null,{"$f":"VLOOKUP(A31,'[1]اكواد المالية للمكاتب'!$A$1:$IV$65536,5,0)","v":{"$error":"#N/A"}},null,{"$f":"VLOOKUP(C31,'[1]اكواد الاصناف'!$A$1:$IV$65536,2,0)","v":{"$error":"#N/A"}},0,{"$f":"VLOOKUP(C31,'[1]اكواد الاصناف'!$A$1:$IV$65536,3,0)","v":{"$error":"#N/A"}}]
[null,{"$f":"VLOOKUP(A32,'[1]اكواد المالية للمكاتب'!$A$1:$IV$65536,5,0)","v":{"$error":"#N/A"}},null,{"$f":"VLOOKUP(C32,'[1]اكواد الاصناف'!$A$1:$IV$65536,2,0)","v":{"$error":"#N/A"}},0,{"$f":"VLOOKUP(C32,'[1]اكواد الاصناف'!$A$1:$IV$65536,3,0)","v":{"$error":"#N/A"}}]
[null,{"$f":"VLOOKUP(A33,'[1]اكواد المالية للمكاتب'!$A$1:$IV$65536,5,0)","v":{"$error":"#N/A"}},null,{"$f":"VLOOKUP(C33,'[1]اكواد الاصناف'!$A$1:$IV$65536,2,0)","v":{"$error":"#N/A"}},0,{"$f":"VLOOKUP(C33,'[1]اكواد الاصناف'!$A$1:$IV$65536,3,0)","v":{"$error":"#N/A"}}]
[null,{"$f":"VLOOKUP(A34,'[1]اكواد المالية للمكاتب'!$A$1:$IV$65536,5,0)","v":{"$error":"#N/A"}},null,{"$f":"VLOOKUP(C34,'[1]اكواد الاصناف'!$A$1:$IV$65536,2,0)","v":{"$error":"#N/A"}},0,{"$f":"VLOOKUP(C34,'[1]اكواد الاصناف'!$A$1:$IV$65536,3,0)","v":{"$error":"#N/A"}}]
[null,{"$f":"VLOOKUP(A35,'[1]اكواد المالية للمكاتب'!$A$1:$IV$65536,5,0)","v":{"$error":"#N/A"}},null,{"$f":"VLOOKUP(C35,'[1]اكواد الاصناف'!$A$1:$IV$65536,2,0)","v":{"$error":"#N/A"}},0,{"$f":"VLOOKUP(C35,'[1]اكواد الاصناف'!$A$1:$IV$65536,3,0)","v":{"$error":"#N/A"}}]
[null,{"$f":"VLOOKUP(A36,'[1]اكواد المالية للمكاتب'!$A$1:$IV$65536,5,0)","v":{"$error":"#N/A"}},null,{"$f":"VLOOKUP(C36,'[1]اكواد الاصناف'!$A$1:$IV$65536,2,0)","v":{"$error":"#N/A"}},0,{"$f":"VLOOKUP(C36,'[1]اكواد الاصناف'!$A$1:$IV$65536,3,0)","v":{"$error":"#N/A"}}]
[null,{"$f":"VLOOKUP(A37,'[1]اكواد المالية للمكاتب'!$A$1:$IV$65536,5,0)","v":{"$error":"#N/A"}},null,{"$f":"VLOOKUP(C37,'[1]اكواد الاصناف'!$A$1:$IV$65536,2,0)","v":{"$error":"#N/A"}},0,{"$f":"VLOOKUP(C37,'[1]اكواد الاصناف'!$A$1:$IV$65536,3,0)","v":{"$error":"#N/A"}}]
[null,{"$f":"VLOOKUP(A38,'[1]اكواد المالية للمكاتب'!$A$1:$IV$65536,5,0)","v":{"$error":"#N/A"}},null,{"$f":"VLOOKUP(C38,'[1]اكواد الاصناف'!$A$1:$IV$65536,2,0)","v":{"$error":"#N/A"}},0,{"$f":"VLOOKUP(C38,'[1]اكواد الاصناف'!$A$1:$IV$65536,3,0)","v":{"$error":"#N/A"}}]
[null,{"$f":"VLOOKUP(A39,'[1]اكواد المالية للمكاتب'!$A$1:$IV$65536,5,0)","v":{"$error":"#N/A"}},null,{"$f":"VLOOKUP(C39,'[1]اكواد الاصناف'!$A$1:$IV$65536,2,0)","v":{"$error":"#N/A"}},0,{"$f":"VLOOKUP(C39,'[1]اكواد الاصناف'!$A$1:$IV$65536,3,0)","v":{"$error":"#N/A"}}]
[null,{"$f":"VLOOKUP(A40,'[1]اكواد المالية للمكاتب'!$A$1:$IV$65536,5,0)","v":{"$error":"#N/A"}},null,{"$f":"VLOOKUP(C40,'[1]اكواد الاصناف'!$A$1:$IV$65536,2,0)","v":{"$error":"#N/A"}},0,{"$f":"VLOOKUP(C40,'[1]اكواد الاصناف'!$A$1:$IV$65536,3,0)","v":{"$error":"#N/A"}}]
[null,{"$f":"VLOOKUP(A41,'[1]اكواد المالية للمكاتب'!$A$1:$IV$65536,5,0)","v":{"$error":"#N/A"}},null,{"$f":"VLOOKUP(C41,'[1]اكواد الاصناف'!$A$1:$IV$65536,2,0)","v":{"$error":"#N/A"}},0,{"$f":"VLOOKUP(C41,'[1]اكواد الاصناف'!$A$1:$IV$65536,3,0)","v":{"$error":"#N/A"}}]
[null,{"$f":"VLOOKUP(A42,'[1]اكواد المالية للمكاتب'!$A$1:$IV$65536,5,0)","v":{"$error":"#N/A"}},null,{"$f":"VLOOKUP(C42,'[1]اكواد الاصناف'!$A$1:$IV$65536,2,0)","v":{"$error":"#N/A"}},0,{"$f":"VLOOKUP(C42,'[1]اكواد الاصناف'!$A$1:$IV$65536,3,0)","v":{"$error":"#N/A"}}]
[null,{"$f":"VLOOKUP(A43,'[1]اكواد المالية للمكاتب'!$A$1:$IV$65536,5,0)","v":{"$error":"#N/A"}},null,{"$f":"VLOOKUP(C43,'[1]اكواد الاصناف'!$A$1:$IV$65536,2,0)","v":{"$error":"#N/A"}},0,{"$f":"VLOOKUP(C43,'[1]اكواد الاصناف'!$A$1:$IV$65536,3,0)","v":{"$error":"#N/A"}}]
[null,{"$f":"VLOOKUP(A44,'[1]اكواد المالية للمكاتب'!$A$1:$IV$65536,5,0)","v":{"$error":"#N/A"}},null,{"$f":"VLOOKUP(C44,'[1]اكواد الاصناف'!$A$1:$IV$65536,2,0)","v":{"$error":"#N/A"}},0,{"$f":"VLOOKUP(C44,'[1]اكواد الاصناف'!$A$1:$IV$65536,3,0)","v":{"$error":"#N/A"}}]
[null,{"$f":"VLOOKUP(A45,'[1]اكواد المالية للمكاتب'!$A$1:$IV$65536,5,0)","v":{"$error":"#N/A"}},null,{"$f":"VLOOKUP(C45,'[1]اكواد الاصناف'!$A$1:$IV$65536,2,0)","v":{"$error":"#N/A"}},0,{"$f":"VLOOKUP(C45,'[1]اكواد الاصناف'!$A$1:$IV$65536,3,0)","v":{"$error":"#N/A"}}]
[null,{"$f":"VLOOKUP(A46,'[1]اكواد المالية للمكاتب'!$A$1:$IV$65536,5,0)","v":{"$error":"#N/A"}},null,{"$f":"VLOOKUP(C46,'[1]اكواد الاصناف'!$A$1:$IV$65536,2,0)","v":{"$error":"#N/A"}},0,{"$f":"VLOOKUP(C46,'[1]اكواد الاصناف'!$A$1:$IV$65536,3,0)","v":{"$error":"#N/A"}}]
[null,{"$f":"VLOOKUP(A47,'[1]اكواد المالية للمكاتب'!$A$1:$IV$65536,5,0)","v":{"$error":"#N/A"}},null,{"$f":"VLOOKUP(C47,'[1]اكواد الاصناف'!$A$1:$IV$65536,2,0)","v":{"$error":"#N/A"}},0,{"$f":"VLOOKUP(C47,'[1]اكواد الاصناف'!$A$1:$IV$65536,3,0)","v":{"$error":"#N/A"}}]
[null,{"$f":"VLOOKUP(A48,'[1]اكواد المالية للمكاتب'!$A$1:$IV$65536,5,0)","v":{"$error":"#N/A"}},null,{"$f":"VLOOKUP(C48,'[1]اكواد الاصناف'!$A$1:$IV$65536,2,0)","v":{"$error":"#N/A"}},0,{"$f":"VLOOKUP(C48,'[1]اكواد الاصناف'!$A$1:$IV$65536,3,0)","v":{"$error":"#N/A"}}]
[null,{"$f":"VLOOKUP(A49,'[1]اكواد المالية للمكاتب'!$A$1:$IV$65536,5,0)","v":{"$error":"#N/A"}},null,{"$f":"VLOOKUP(C49,'[1]اكواد الاصناف'!$A$1:$IV$65536,2,0)","v":{"$error":"#N/A"}},0,{"$f":"VLOOKUP(C49,'[1]اكواد الاصناف'!$A$1:$IV$65536,3,0)","v":{"$error":"#N/A"}}]
[null,{"$f":"VLOOKUP(A50,'[1]اكواد المالية للمكاتب'!$A$1:$IV$65536,5,0)","v":{"$error":"#N/A"}},null,{"$f":"VLOOKUP(C50,'[1]اكواد الاصناف'!$A$1:$IV$65536,2,0)","v":{"$error":"#N/A"}},0,{"$f":"VLOOKUP(C50,'[1]اكواد الاصناف'!$A$1:$IV$65536,3,0)","v":{"$error":"#N/A"}}]
[null,{"$f":"VLOOKUP(A51,'[1]اكواد المالية للمكاتب'!$A$1:$IV$65536,5,0)","v":{"$error":"#N/A"}},null,{"$f":"VLOOKUP(C51,'[1]اكواد الاصناف'!$A$1:$IV$65536,2,0)","v":{"$error":"#N/A"}},0,{"$f":"VLOOKUP(C51,'[1]اكواد الاصناف'!$A$1:$IV$65536,3,0)","v":{"$error":"#N/A"}}]
[null,{"$f":"VLOOKUP(A52,'[1]اكواد المالية للمكاتب'!$A$1:$IV$65536,5,0)","v":{"$error":"#N/A"}},null,{"$f":"VLOOKUP(C52,'[1]اكواد الاصناف'!$A$1:$IV$65536,2,0)","v":{"$error":"#N/A"}},0,{"$f":"VLOOKUP(C52,'[1]اكواد الاصناف'!$A$1:$IV$65536,3,0)","v":{"$error":"#N/A"}}]
[null,{"$f":"VLOOKUP(A53,'[1]اكواد المالية للمكاتب'!$A$1:$IV$65536,5,0)","v":{"$error":"#N/A"}},null,{"$f":"VLOOKUP(C53,'[1]اكواد الاصناف'!$A$1:$IV$65536,2,0)","v":{"$error":"#N/A"}},0,{"$f":"VLOOKUP(C53,'[1]اكواد الاصناف'!$A$1:$IV$65536,3,0)","v":{"$error":"#N/A"}}]
[null,{"$f":"VLOOKUP(A54,'[1]اكواد المالية للمكاتب'!$A$1:$IV$65536,5,0)","v":{"$error":"#N/A"}},null,{"$f":"VLOOKUP(C54,'[1]اكواد الاصناف'!$A$1:$IV$65536,2,0)","v":{"$error":"#N/A"}},0,{"$f":"VLOOKUP(C54,'[1]اكواد الاصناف'!$A$1:$IV$65536,3,0)","v":{"$error":"#N/A"}}]
[null,{"$f":"VLOOKUP(A55,'[1]اكواد المالية للمكاتب'!$A$1:$IV$65536,5,0)","v":{"$error":"#N/A"}},null,{"$f":"VLOOKUP(C55,'[1]اكواد الاصناف'!$A$1:$IV$65536,2,0)","v":{"$error":"#N/A"}},0,{"$f":"VLOOKUP(C55,'[1]اكواد الاصناف'!$A$1:$IV$65536,3,0)","v":{"$error":"#N/A"}}]
[null,{"$f":"VLOOKUP(A56,'[1]اكواد المالية للمكاتب'!$A$1:$IV$65536,5,0)","v":{"$error":"#N/A"}},null,{"$f":"VLOOKUP(C56,'[1]اكواد الاصناف'!$A$1:$IV$65536,2,0)","v":{"$error":"#N/A"}},0,{"$f":"VLOOKUP(C56,'[1]اكواد الاصناف'!$A$1:$IV$65536,3,0)","v":{"$error":"#N/A"}}]
[null,{"$f":"VLOOKUP(A57,'[1]اكواد المالية للمكاتب'!$A$1:$IV$65536,5,0)","v":{"$error":"#N/A"}},null,{"$f":"VLOOKUP(C57,'[1]اكواد الاصناف'!$A$1:$IV$65536,2,0)","v":{"$error":"#N/A"}},0,{"$f":"VLOOKUP(C57,'[1]اكواد الاصناف'!$A$1:$IV$65536,3,0)","v":{"$error":"#N/A"}}]
[null,{"$f":"VLOOKUP(A58,'[1]اكواد المالية للمكاتب'!$A$1:$IV$65536,5,0)","v":{"$error":"#N/A"}},null,{"$f":"VLOOKUP(C58,'[1]اكواد الاصناف'!$A$1:$IV$65536,2,0)","v":{"$error":"#N/A"}},0,{"$f":"VLOOKUP(C58,'[1]اكواد الاصناف'!$A$1:$IV$65536,3,0)","v":{"$error":"#N/A"}}]
[null,{"$f":"VLOOKUP(A59,'[1]اكواد المالية للمكاتب'!$A$1:$IV$65536,5,0)","v":{"$error":"#N/A"}},null,{"$f":"VLOOKUP(C59,'[1]اكواد الاصناف'!$A$1:$IV$65536,2,0)","v":{"$error":"#N/A"}},0,{"$f":"VLOOKUP(C59,'[1]اكواد الاصناف'!$A$1:$IV$65536,3,0)","v":{"$error":"#N/A"}}]
[null,{"$f":"VLOOKUP(A60,'[1]اكواد المالية للمكاتب'!$A$1:$IV$65536,5,0)","v":{"$error":"#N/A"}},null,{"$f":"VLOOKUP(C60,'[1]اكواد الاصناف'!$A$1:$IV$65536,2,0)","v":{"$error":"#N/A"}},0,{"$f":"VLOOKUP(C60,'[1]اكواد الاصناف'!$A$1:$IV$65536,3,0)","v":{"$error":"#N/A"}}]
[null,{"$f":"VLOOKUP(A61,'[1]اكواد المالية للمكاتب'!$A$1:$IV$65536,5,0)","v":{"$error":"#N/A"}},null,{"$f":"VLOOKUP(C61,'[1]اكواد الاصناف'!$A$1:$IV$65536,2,0)","v":{"$error":"#N/A"}},0,{"$f":"VLOOKUP(C61,'[1]اكواد الاصناف'!$A$1:$IV$65536,3,0)","v":{"$error":"#N/A"}}]
[null,{"$f":"VLOOKUP(A62,'[1]اكواد المالية للمكاتب'!$A$1:$IV$65536,5,0)","v":{"$error":"#N/A"}},null,{"$f":"VLOOKUP(C62,'[1]اكواد الاصناف'!$A$1:$IV$65536,2,0)","v":{"$error":"#N/A"}},0,{"$f":"VLOOKUP(C62,'[1]اكواد الاصناف'!$A$1:$IV$65536,3,0)","v":{"$error":"#N/A"}}]
[null,{"$f":"VLOOKUP(A63,'[1]اكواد المالية للمكاتب'!$A$1:$IV$65536,5,0)","v":{"$error":"#N/A"}},null,{"$f":"VLOOKUP(C63,'[1]اكواد الاصناف'!$A$1:$IV$65536,2,0)","v":{"$error":"#N/A"}},0,{"$f":"VLOOKUP(C63,'[1]اكواد الاصناف'!$A$1:$IV$65536,3,0)","v":{"$error":"#N/A"}}]
[null,{"$f":"VLOOKUP(A64,'[1]اكواد المالية للمكاتب'!$A$1:$IV$65536,5,0)","v":{"$error":"#N/A"}},null,{"$f":"VLOOKUP(C64,'[1]اكواد الاصناف'!$A$1:$IV$65536,2,0)","v":{"$error":"#N/A"}},0,{"$f":"VLOOKUP(C64,'[1]اكواد الاصناف'!$A$1:$IV$65536,3,0)","v":{"$error":"#N/A"}}]
[null,{"$f":"VLOOKUP(A65,'[1]اكواد المالية للمكاتب'!$A$1:$IV$65536,5,0)","v":{"$error":"#N/A"}},null,{"$f":"VLOOKUP(C65,'[1]اكواد الاصناف'!$A$1:$IV$65536,2,0)","v":{"$error":"#N/A"}},0,{"$f":"VLOOKUP(C65,'[1]اكواد الاصناف'!$A$1:$IV$65536,3,0)","v":{"$error":"#N/A"}}]
[null,{"$f":"VLOOKUP(A66,'[1]اكواد المالية للمكاتب'!$A$1:$IV$65536,5,0)","v":{"$error":"#N/A"}},null,{"$f":"VLOOKUP(C66,'[1]اكواد الاصناف'!$A$1:$IV$65536,2,0)","v":{"$error":"#N/A"}},0,{"$f":"VLOOKUP(C66,'[1]اكواد الاصناف'!$A$1:$IV$65536,3,0)","v":{"$error":"#N/A"}}]
[null,{"$f":"VLOOKUP(A67,'[1]اكواد المالية للمكاتب'!$A$1:$IV$65536,5,0)","v":{"$error":"#N/A"}},null,{"$f":"VLOOKUP(C67,'[1]اكواد الاصناف'!$A$1:$IV$65536,2,0)","v":{"$error":"#N/A"}},0,{"$f":"VLOOKUP(C67,'[1]اكواد الاصناف'!$A$1:$IV$65536,3,0)","v":{"$error":"#N/A"}}]
[null,{"$f":"VLOOKUP(A68,'[1]اكواد المالية للمكاتب'!$A$1:$IV$65536,5,0)","v":{"$error":"#N/A"}},null,{"$f":"VLOOKUP(C68,'[1]اكواد الاصناف'!$A$1:$IV$65536,2,0)","v":{"$error":"#N/A"}},0,{"$f":"VLOOKUP(C68,'[1]اكواد الاصناف'!$A$1:$IV$65536,3,0)","v":{"$error":"#N/A"}}]
[null,{"$f":"VLOOKUP(A69,'[1]اكواد المالية للمكاتب'!$A$1:$IV$65536,5,0)","v":{"$error":"#N/A"}},null,{"$f":"VLOOKUP(C69,'[1]اكواد الاصناف'!$A$1:$IV$65536,2,0)","v":{"$error":"#N/A"}},0,{"$f":"VLOOKUP(C69,'[1]اكواد الاصناف'!$A$1:$IV$65536,3,0)","v":{"$error":"#N/A"}}]
[null,{"$f":"VLOOKUP(A70,'[1]اكواد المالية للمكاتب'!$A$1:$IV$65536,5,0)","v":{"$error":"#N/A"}},null,{"$f":"VLOOKUP(C70,'[1]اكواد الاصناف'!$A$1:$IV$65536,2,0)","v":{"$error":"#N/A"}},0,{"$f":"VLOOKUP(C70,'[1]اكواد الاصناف'!$A$1:$IV$65536,3,0)","v":{"$error":"#N/A"}}]
[null,{"$f":"VLOOKUP(A71,'[1]اكواد المالية للمكاتب'!$A$1:$IV$65536,5,0)","v":{"$error":"#N/A"}},null,{"$f":"VLOOKUP(C71,'[1]اكواد الاصناف'!$A$1:$IV$65536,2,0)","v":{"$error":"#N/A"}},0,{"$f":"VLOOKUP(C71,'[1]اكواد الاصناف'!$A$1:$IV$65536,3,0)","v":{"$error":"#N/A"}}]
[null,{"$f":"VLOOKUP(A72,'[1]اكواد المالية للمكاتب'!$A$1:$IV$65536,5,0)","v":{"$error":"#N/A"}},null,{"$f":"VLOOKUP(C72,'[1]اكواد الاصناف'!$A$1:$IV$65536,2,0)","v":{"$error":"#N/A"}},0,{"$f":"VLOOKUP(C72,'[1]اكواد الاصناف'!$A$1:$IV$65536,3,0)","v":{"$error":"#N/A"}}]
[null,{"$f":"VLOOKUP(A73,'[1]اكواد المالية للمكاتب'!$A$1:$IV$65536,5,0)","v":{"$error":"#N/A"}},null,{"$f":"VLOOKUP(C73,'[1]اكواد الاصناف'!$A$1:$IV$65536,2,0)","v":{"$error":"#N/A"}},0,{"$f":"VLOOKUP(C73,'[1]اكواد الاصناف'!$A$1:$IV$65536,3,0)","v":{"$error":"#N/A"}}]
[null,{"$f":"VLOOKUP(A74,'[1]اكواد المالية للمكاتب'!$A$1:$IV$65536,5,0)","v":{"$error":"#N/A"}},null,{"$f":"VLOOKUP(C74,'[1]اكواد الاصناف'!$A$1:$IV$65536,2,0)","v":{"$error":"#N/A"}},0,{"$f":"VLOOKUP(C74,'[1]اكواد الاصناف'!$A$1:$IV$65536,3,0)","v":{"$error":"#N/A"}}]
[null,{"$f":"VLOOKUP(A75,'[1]اكواد المالية للمكاتب'!$A$1:$IV$65536,5,0)","v":{"$error":"#N/A"}},null,{"$f":"VLOOKUP(C75,'[1]اكواد الاصناف'!$A$1:$IV$65536,2,0)","v":{"$error":"#N/A"}},0,{"$f":"VLOOKUP(C75,'[1]اكواد الاصناف'!$A$1:$IV$65536,3,0)","v":{"$error":"#N/A"}}]
[null,{"$f":"VLOOKUP(A76,'[1]اكواد المالية للمكاتب'!$A$1:$IV$65536,5,0)","v":{"$error":"#N/A"}},null,{"$f":"VLOOKUP(C76,'[1]اكواد الاصناف'!$A$1:$IV$65536,2,0)","v":{"$error":"#N/A"}},0,{"$f":"VLOOKUP(C76,'[1]اكواد الاصناف'!$A$1:$IV$65536,3,0)","v":{"$error":"#N/A"}}]
[null,{"$f":"VLOOKUP(A77,'[1]اكواد المالية للمكاتب'!$A$1:$IV$65536,5,0)","v":{"$error":"#N/A"}},null,{"$f":"VLOOKUP(C77,'[1]اكواد الاصناف'!$A$1:$IV$65536,2,0)","v":{"$error":"#N/A"}},0,{"$f":"VLOOKUP(C77,'[1]اكواد الاصناف'!$A$1:$IV$65536,3,0)","v":{"$error":"#N/A"}}]
[null,{"$f":"VLOOKUP(A78,'[1]اكواد المالية للمكاتب'!$A$1:$IV$65536,5,0)","v":{"$error":"#N/A"}},null,{"$f":"VLOOKUP(C78,'[1]اكواد الاصناف'!$A$1:$IV$65536,2,0)","v":{"$error":"#N/A"}},0,{"$f":"VLOOKUP(C78,'[1]اكواد الاصناف'!$A$1:$IV$65536,3,0)","v":{"$error":"#N/A"}}]
[null,{"$f":"VLOOKUP(A79,'[1]اكواد المالية للمكاتب'!$A$1:$IV$65536,5,0)","v":{"$error":"#N/A"}},null,{"$f":"VLOOKUP(C79,'[1]اكواد الاصناف'!$A$1:$IV$65536,2,0)","v":{"$error":"#N/A"}},0,{"$f":"VLOOKUP(C79,'[1]اكواد الاصناف'!$A$1:$IV$65536,3,0)","v":{"$error":"#N/A"}}]
[null,{"$f":"VLOOKUP(A80,'[1]اكواد المالية للمكاتب'!$A$1:$IV$65536,5,0)","v":{"$error":"#N/A"}},null,{"$f":"VLOOKUP(C80,'[1]اكواد الاصناف'!$A$1:$IV$65536,2,0)","v":{"$error":"#N/A"}},0,{"$f":"VLOOKUP(C80,'[1]اكواد الاصناف'!$A$1:$IV$65536,3,0)","v":{"$error":"#N/A"}}]
{"$rows_left_out":77}
{"sheet":"1","index":1,"n_rows":16,"n_cols":7,"rows_kept":16,"cut":false,"hidden":false,"merged":[]}
[]
[]
[]
[]
[]
[]
[]
[]
[]
["الرقم","أسم المكتب","كود الصنف","أسم الصنف","عدد الارقام","مجموعة الصنف","الموجود من واقع الجرد"]
["بدون",null,1,"مكتب ايديال 3 درج ",1,null,3]
["بدون",null,2,"مكتب ايديال 4 درج",2,null,3]
["بدون",null,3,"مكتب ايديال 7 درج",5,null,1]
["بدون",null,4,"مكتب ايديال مواسير 3 درج",{"$f":"LEN(C14)","v":1},null,1]
["بدون",null,5,"كرسى خيرازان",1,null,7]
["بدون",null,6,"كرسى فوتية وكيل بمساند",1,null,2]

{"sheet":"2","index":2,"n_rows":15,"n_cols":7,"rows_kept":15,"cut":false,"hidden":false,"merged":[]}
[]
[]
[]
[]
[]
[]
[]
[]
[]
["الرقم","أسم المكتب","كود الصنف","أسم الصنف","عدد الارقام","مجموعة الصنف","الموجود من واقع الجرد"]
[null,null,7,"مكتب صاج 3 درج",null,null,2]
[null,null,8,"مكتب صاج 6 درج",null,null,3]
[null,null,9,"خزينة حديدية متوسطة",null,null,4]
[null,null,2,"مكتب ايديال 4 درج",null,null,5]
[null,null,3,"مكتب ايديال 7 درج",null,null,8]

{"sheet":"3","index":3,"n_rows":16,"n_cols":7,"rows_kept":16,"cut":false,"hidden":false,"merged":[]}
[]
[]
[]
[]
[]
[]
[]
[]
[]
["الرقم","أسم المكتب","كود الصنف","أسم الصنف","عدد الارقام","مجموعة الصنف","الموجود من واقع الجرد"]
[null,null,20,"سيارة",null,null,2]
[null,null,30,"اطارات",null,null,1]
[null,null,7,"مكتب صاج 3 درج",null,null,5]
[null,null,8,"مكتب صاج 6 درج",null,null,6]
[null,null,9,{"$error":"#N/A"},null,null,1]
[null,null,2,"مكتب ايديال 4 درج",null,null,2]

{"sheet":"Final","index":4,"n_rows":0,"n_cols":0,"rows_kept":0,"cut":false,"hidden":false,"merged":[]}